{"text_format":"1","workbook":"xlsx","n_sheets":9,"sheets":["similarity analysis (direct)","similarity analysis (indirect)","keystrokemousemacro","recorded macros basic pattern","recorded macro replayed version","macro-writing","info","coco","coco_online"],"not_rendered":{"charts":0,"images":2,"macros":1,"external_links":0,"defined_names":99,"comments":0,"pivot_tables":0},"unopened":[],"bounds":{"document_bytes":16777216,"sheet_cells":100000,"rows_first":2000,"rows_last":500,"rows_between":2000,"halvings":0,"cell_chars":16384,"cell_head_chars":4096},"cells_cut":0,"cells_raw":0,"read":"whole","date_system":"1900"}

{"sheet":"similarity analysis (direct)","index":0,"n_rows":82,"n_cols":16,"rows_kept":82,"cut":false,"hidden":false,"merged":[]}
["OAM","attribute_1","attribute_2","attribute_3","attribute_4","attribute_5","attribute_6","Y0","naive average","naive ranks","optimized ranks","abs differences",null,"Case study"]
["object_1",76,92,72,95,78,57,1000,{"$f":"AVERAGE(B2:G2)","v":78.333333333333329},{"$f":"RANK(I2,I$2:I$17,0)","v":7},{"$f":"RANK(I65,I$65:I$80,0)","v":7},{"$f":"ABS(J2-K2)","v":0},null,"objects","=","Students"]
["object_2",60,85,91,82,78,72,1000,{"$f":"AVERAGE(B3:G3)","v":78},{"$f":"RANK(I3,I$2:I$17,0)","v":9},{"$f":"RANK(I66,I$65:I$80,0)","v":11},{"$f":"ABS(J3-K3)","v":2},null,"attributes","=","Performances"]
["object_3",79,99,74,78,87,88,1000,84.166666666666671,2,2,0,null,"question","=","Could each Student have the same evaluation value? (anti-discriminative modelling)"]
["object_4",93,56,99,53,82,87,1000,78.333333333333329,7,9,2]
["object_5",68,55,83,93,100,90,1000,81.5,5,4,1]
["object_6",91,56,90,90,53,51,1000,71.833333333333329,14,14,0]
["object_7",63,91,84,73,99,85,1000,82.5,3,5,2]
["object_8",64,74,57,87,74,56,1000,68.666666666666671,15,15,0]
["object_9",86,64,76,82,87,78,1000,78.833333333333329,6,6,0]
["object_10",93,83,98,95,88,85,1000,90.333333333333329,1,1,0]
["object_11",87,57,95,75,85,93,1000,82,4,3,1]
["object_12",62,54,77,69,62,73,1000,66.166666666666671,16,16,0]
["object_13",75,81,93,70,59,79,1000,76.166666666666671,11,13,2]
["object_14",85,58,61,54,95,96,1000,74.833333333333329,12,8,4]
["object_15",88,66,91,58,87,75,1000,77.5,10,10,0]
["object_16",53,91,58,70,87,87,1000,74.333333333333329,13,12,1]
[]
["direction",0,0,0,0,0,0]
["meaning","the more a(i) the more Y","the more a(i) the more Y","the more a(i) the more Y","the more a(i) the more Y","the more a(i) the more Y","the more a(i) the more Y","constant value"]
[]
[]
[{"$f":"'similarity analysis (direct)'!A1","v":"OAM"},{"$f":"'similarity analysis (direct)'!B1","v":"attribute_1"},{"$f":"'similarity analysis (direct)'!C1","v":"attribute_2"},{"$f":"'similarity analysis (direct)'!D1","v":"attribute_3"},{"$f":"'similarity analysis (direct)'!E1","v":"attribute_4"},{"$f":"'similarity analysis (direct)'!F1","v":"attribute_5"},{"$f":"'similarity analysis (direct)'!G1","v":"attribute_6"},{"$f":"'similarity analysis (direct)'!H1","v":"Y0"}]
[{"$f":"'similarity analysis (direct)'!A2","v":"object_1"},{"$f":"RANK('similarity analysis (direct)'!B2,'similarity analysis (direct)'!B$2:B$17,'similarity analysis (direct)'!B$19)","v":9},{"$f":"RANK('similarity analysis (direct)'!C2,'similarity analysis (direct)'!C$2:C$17,'similarity analysis (direct)'!C$19)","v":2},{"$f":"RANK('similarity analysis (direct)'!D2,'similarity analysis (direct)'!D$2:D$17,'similarity analysis (direct)'!D$19)","v":13},{"$f":"RANK('similarity analysis (direct)'!E2,'similarity analysis (direct)'!E$2:E$17,'similarity analysis (direct)'!E$19)","v":1},{"$f":"RANK('similarity analysis (direct)'!F2,'similarity analysis (direct)'!F$2:F$17,'similarity analysis (direct)'!F$19)","v":11},{"$f":"RANK('similarity analysis (direct)'!G2,'similarity analysis (direct)'!G$2:G$17,'similarity analysis (direct)'!G$19)","v":14},{"$f":"'similarity analysis (direct)'!H2","v":1000}]
[{"$f":"'similarity analysis (direct)'!A3","v":"object_2"},{"$f":"RANK('similarity analysis (direct)'!B3,'similarity analysis (direct)'!B$2:B$17,'similarity analysis (direct)'!B$19)","v":15},{"$f":"RANK('similarity analysis (direct)'!C3,'similarity analysis (direct)'!C$2:C$17,'similarity analysis (direct)'!C$19)","v":5},{"$f":"RANK('similarity analysis (direct)'!D3,'similarity analysis (direct)'!D$2:D$17,'similarity analysis (direct)'!D$19)","v":5},{"$f":"RANK('similarity analysis (direct)'!E3,'similarity analysis (direct)'!E$2:E$17,'similarity analysis (direct)'!E$19)","v":6},{"$f":"RANK('similarity analysis (direct)'!F3,'similarity analysis (direct)'!F$2:F$17,'similarity analysis (direct)'!F$19)","v":11},{"$f":"RANK('similarity analysis (direct)'!G3,'similarity analysis (direct)'!G$2:G$17,'similarity analysis (direct)'!G$19)","v":13},{"$f":"'similarity analysis (direct)'!H3","v":1000}]
[{"$f":"'similarity analysis (direct)'!A4","v":"object_3"},{"$f":"RANK('similarity analysis (direct)'!B4,'similarity analysis (direct)'!B$2:B$17,'similarity analysis (direct)'!B$19)","v":8},{"$f":"RANK('similarity analysis (direct)'!C4,'similarity analysis (direct)'!C$2:C$17,'similarity analysis (direct)'!C$19)","v":1},{"$f":"RANK('similarity analysis (direct)'!D4,'similarity analysis (direct)'!D$2:D$17,'similarity analysis (direct)'!D$19)","v":12},{"$f":"RANK('similarity analysis (direct)'!E4,'similarity analysis (direct)'!E$2:E$17,'similarity analysis (direct)'!E$19)","v":8},{"$f":"RANK('similarity analysis (direct)'!F4,'similarity analysis (direct)'!F$2:F$17,'similarity analysis (direct)'!F$19)","v":5},{"$f":"RANK('similarity analysis (direct)'!G4,'similarity analysis (direct)'!G$2:G$17,'similarity analysis (direct)'!G$19)","v":4},{"$f":"'similarity analysis (direct)'!H4","v":1000}]
[{"$f":"'similarity analysis (direct)'!A5","v":"object_4"},{"$f":"RANK('similarity analysis (direct)'!B5,'similarity analysis (direct)'!B$2:B$17,'similarity analysis (direct)'!B$19)","v":1},{"$f":"RANK('similarity analysis (direct)'!C5,'similarity analysis (direct)'!C$2:C$17,'similarity analysis (direct)'!C$19)","v":13},{"$f":"RANK('similarity analysis (direct)'!D5,'similarity analysis (direct)'!D$2:D$17,'similarity analysis (direct)'!D$19)","v":1},{"$f":"RANK('similarity analysis (direct)'!E5,'similarity analysis (direct)'!E$2:E$17,'similarity analysis (direct)'!E$19)","v":16},{"$f":"RANK('similarity analysis (direct)'!F5,'similarity analysis (direct)'!F$2:F$17,'similarity analysis (direct)'!F$19)","v":10},{"$f":"RANK('similarity analysis (direct)'!G5,'similarity analysis (direct)'!G$2:G$17,'similarity analysis (direct)'!G$19)","v":5},{"$f":"'similarity analysis (direct)'!H5","v":1000}]
[{"$f":"'similarity analysis (direct)'!A6","v":"object_5"},{"$f":"RANK('similarity analysis (direct)'!B6,'similarity analysis (direct)'!B$2:B$17,'similarity analysis (direct)'!B$19)","v":11},{"$f":"RANK('similarity analysis (direct)'!C6,'similarity analysis (direct)'!C$2:C$17,'similarity analysis (direct)'!C$19)","v":15},{"$f":"RANK('similarity analysis (direct)'!D6,'similarity analysis (direct)'!D$2:D$17,'similarity analysis (direct)'!D$19)","v":9},{"$f":"RANK('similarity analysis (direct)'!E6,'similarity analysis (direct)'!E$2:E$17,'similarity analysis (direct)'!E$19)","v":3},{"$f":"RANK('similarity analysis (direct)'!F6,'similarity analysis (direct)'!F$2:F$17,'similarity analysis (direct)'!F$19)","v":1},{"$f":"RANK('similarity analysis (direct)'!G6,'similarity analysis (direct)'!G$2:G$17,'similarity analysis (direct)'!G$19)","v":3},{"$f":"'similarity analysis (direct)'!H6","v":1000}]
[{"$f":"'similarity analysis (direct)'!A7","v":"object_6"},{"$f":"RANK('similarity analysis (direct)'!B7,'similarity analysis (direct)'!B$2:B$17,'similarity analysis (direct)'!B$19)","v":3},{"$f":"RANK('similarity analysis (direct)'!C7,'similarity analysis (direct)'!C$2:C$17,'similarity analysis (direct)'!C$19)","v":13},{"$f":"RANK('similarity analysis (direct)'!D7,'similarity analysis (direct)'!D$2:D$17,'similarity analysis (direct)'!D$19)","v":7},{"$f":"RANK('similarity analysis (direct)'!E7,'similarity analysis (direct)'!E$2:E$17,'similarity analysis (direct)'!E$19)","v":4},{"$f":"RANK('similarity analysis (direct)'!F7,'similarity analysis (direct)'!F$2:F$17,'similarity analysis (direct)'!F$19)","v":16},{"$f":"RANK('similarity analysis (direct)'!G7,'similarity analysis (direct)'!G$2:G$17,'similarity analysis (direct)'!G$19)","v":16},{"$f":"'similarity analysis (direct)'!H7","v":1000}]
[{"$f":"'similarity analysis (direct)'!A8","v":"object_7"},{"$f":"RANK('similarity analysis (direct)'!B8,'similarity analysis (direct)'!B$2:B$17,'similarity analysis (direct)'!B$19)","v":13},{"$f":"RANK('similarity analysis (direct)'!C8,'similarity analysis (direct)'!C$2:C$17,'similarity analysis (direct)'!C$19)","v":3},{"$f":"RANK('similarity analysis (direct)'!D8,'similarity analysis (direct)'!D$2:D$17,'similarity analysis (direct)'!D$19)","v":8},{"$f":"RANK('similarity analysis (direct)'!E8,'similarity analysis (direct)'!E$2:E$17,'similarity analysis (direct)'!E$19)","v":10},{"$f":"RANK('similarity analysis (direct)'!F8,'similarity analysis (direct)'!F$2:F$17,'similarity analysis (direct)'!F$19)","v":2},{"$f":"RANK('similarity analysis (direct)'!G8,'similarity analysis (direct)'!G$2:G$17,'similarity analysis (direct)'!G$19)","v":7},{"$f":"'similarity analysis (direct)'!H8","v":1000}]
[{"$f":"'similarity analysis (direct)'!A9","v":"object_8"},{"$f":"RANK('similarity analysis (direct)'!B9,'similarity analysis (direct)'!B$2:B$17,'similarity analysis (direct)'!B$19)","v":12},{"$f":"RANK('similarity analysis (direct)'!C9,'similarity analysis (direct)'!C$2:C$17,'similarity analysis (direct)'!C$19)","v":8},{"$f":"RANK('similarity analysis (direct)'!D9,'similarity analysis (direct)'!D$2:D$17,'similarity analysis (direct)'!D$19)","v":16},{"$f":"RANK('similarity analysis (direct)'!E9,'similarity analysis (direct)'!E$2:E$17,'similarity analysis (direct)'!E$19)","v":5},{"$f":"RANK('similarity analysis (direct)'!F9,'similarity analysis (direct)'!F$2:F$17,'similarity analysis (direct)'!F$19)","v":13},{"$f":"RANK('similarity analysis (direct)'!G9,'similarity analysis (direct)'!G$2:G$17,'similarity analysis (direct)'!G$19)","v":15},{"$f":"'similarity analysis (direct)'!H9","v":1000}]
[{"$f":"'similarity analysis (direct)'!A10","v":"object_9"},{"$f":"RANK('similarity analysis (direct)'!B10,'similarity analysis (direct)'!B$2:B$17,'similarity analysis (direct)'!B$19)","v":6},{"$f":"RANK('similarity analysis (direct)'!C10,'similarity analysis (direct)'!C$2:C$17,'similarity analysis (direct)'!C$19)","v":10},{"$f":"RANK('similarity analysis (direct)'!D10,'similarity analysis (direct)'!D$2:D$17,'similarity analysis (direct)'!D$19)","v":11},{"$f":"RANK('similarity analysis (direct)'!E10,'similarity analysis (direct)'!E$2:E$17,'similarity analysis (direct)'!E$19)","v":6},{"$f":"RANK('similarity analysis (direct)'!F10,'similarity analysis (direct)'!F$2:F$17,'similarity analysis (direct)'!F$19)","v":5},{"$f":"RANK('similarity analysis (direct)'!G10,'similarity analysis (direct)'!G$2:G$17,'similarity analysis (direct)'!G$19)","v":10},{"$f":"'similarity analysis (direct)'!H10","v":1000}]
[{"$f":"'similarity analysis (direct)'!A11","v":"object_10"},{"$f":"RANK('similarity analysis (direct)'!B11,'similarity analysis (direct)'!B$2:B$17,'similarity analysis (direct)'!B$19)","v":1},{"$f":"RANK('similarity analysis (direct)'!C11,'similarity analysis (direct)'!C$2:C$17,'similarity analysis (direct)'!C$19)","v":6},{"$f":"RANK('similarity analysis (direct)'!D11,'similarity analysis (direct)'!D$2:D$17,'similarity analysis (direct)'!D$19)","v":2},{"$f":"RANK('similarity analysis (direct)'!E11,'similarity analysis (direct)'!E$2:E$17,'similarity analysis (direct)'!E$19)","v":1},{"$f":"RANK('similarity analysis (direct)'!F11,'similarity analysis (direct)'!F$2:F$17,'similarity analysis (direct)'!F$19)","v":4},{"$f":"RANK('similarity analysis (direct)'!G11,'similarity analysis (direct)'!G$2:G$17,'similarity analysis (direct)'!G$19)","v":7},{"$f":"'similarity analysis (direct)'!H11","v":1000}]
[{"$f":"'similarity analysis (direct)'!A12","v":"object_11"},{"$f":"RANK('similarity analysis (direct)'!B12,'similarity analysis (direct)'!B$2:B$17,'similarity analysis (direct)'!B$19)","v":5},{"$f":"RANK('similarity analysis (direct)'!C12,'similarity analysis (direct)'!C$2:C$17,'similarity analysis (direct)'!C$19)","v":12},{"$f":"RANK('similarity analysis (direct)'!D12,'similarity analysis (direct)'!D$2:D$17,'similarity analysis (direct)'!D$19)","v":3},{"$f":"RANK('similarity analysis (direct)'!E12,'similarity analysis (direct)'!E$2:E$17,'similarity analysis (direct)'!E$19)","v":9},{"$f":"RANK('similarity analysis (direct)'!F12,'similarity analysis (direct)'!F$2:F$17,'similarity analysis (direct)'!F$19)","v":9},{"$f":"RANK('similarity analysis (direct)'!G12,'similarity analysis (direct)'!G$2:G$17,'similarity analysis (direct)'!G$19)","v":2},{"$f":"'similarity analysis (direct)'!H12","v":1000}]
[{"$f":"'similarity analysis (direct)'!A13","v":"object_12"},{"$f":"RANK('similarity analysis (direct)'!B13,'similarity analysis (direct)'!B$2:B$17,'similarity analysis (direct)'!B$19)","v":14},{"$f":"RANK('similarity analysis (direct)'!C13,'similarity analysis (direct)'!C$2:C$17,'similarity analysis (direct)'!C$19)","v":16},{"$f":"RANK('similarity analysis (direct)'!D13,'similarity analysis (direct)'!D$2:D$17,'similarity analysis (direct)'!D$19)","v":10},{"$f":"RANK('similarity analysis (direct)'!E13,'similarity analysis (direct)'!E$2:E$17,'similarity analysis (direct)'!E$19)","v":13},{"$f":"RANK('similarity analysis (direct)'!F13,'similarity analysis (direct)'!F$2:F$17,'similarity analysis (direct)'!F$19)","v":14},{"$f":"RANK('similarity analysis (direct)'!G13,'similarity analysis (direct)'!G$2:G$17,'similarity analysis (direct)'!G$19)","v":12},{"$f":"'similarity analysis (direct)'!H13","v":1000}]
[{"$f":"'similarity analysis (direct)'!A14","v":"object_13"},{"$f":"RANK('similarity analysis (direct)'!B14,'similarity analysis (direct)'!B$2:B$17,'similarity analysis (direct)'!B$19)","v":10},{"$f":"RANK('similarity analysis (direct)'!C14,'similarity analysis (direct)'!C$2:C$17,'similarity analysis (direct)'!C$19)","v":7},{"$f":"RANK('similarity analysis (direct)'!D14,'similarity analysis (direct)'!D$2:D$17,'similarity analysis (direct)'!D$19)","v":4},{"$f":"RANK('similarity analysis (direct)'!E14,'similarity analysis (direct)'!E$2:E$17,'similarity analysis (direct)'!E$19)","v":11},{"$f":"RANK('similarity analysis (direct)'!F14,'similarity analysis (direct)'!F$2:F$17,'similarity analysis (direct)'!F$19)","v":15},{"$f":"RANK('similarity analysis (direct)'!G14,'similarity analysis (direct)'!G$2:G$17,'similarity analysis (direct)'!G$19)","v":9},{"$f":"'similarity analysis (direct)'!H14","v":1000}]
[{"$f":"'similarity analysis (direct)'!A15","v":"object_14"},{"$f":"RANK('similarity analysis (direct)'!B15,'similarity analysis (direct)'!B$2:B$17,'similarity analysis (direct)'!B$19)","v":7},{"$f":"RANK('similarity analysis (direct)'!C15,'similarity analysis (direct)'!C$2:C$17,'similarity analysis (direct)'!C$19)","v":11},{"$f":"RANK('similarity analysis (direct)'!D15,'similarity analysis (direct)'!D$2:D$17,'similarity analysis (direct)'!D$19)","v":14},{"$f":"RANK('similarity analysis (direct)'!E15,'similarity analysis (direct)'!E$2:E$17,'similarity analysis (direct)'!E$19)","v":15},{"$f":"RANK('similarity analysis (direct)'!F15,'similarity analysis (direct)'!F$2:F$17,'similarity analysis (direct)'!F$19)","v":3},{"$f":"RANK('similarity analysis (direct)'!G15,'similarity analysis (direct)'!G$2:G$17,'similarity analysis (direct)'!G$19)","v":1},{"$f":"'similarity analysis (direct)'!H15","v":1000}]
[{"$f":"'similarity analysis (direct)'!A16","v":"object_15"},{"$f":"RANK('similarity analysis (direct)'!B16,'similarity analysis (direct)'!B$2:B$17,'similarity analysis (direct)'!B$19)","v":4},{"$f":"RANK('similarity analysis (direct)'!C16,'similarity analysis (direct)'!C$2:C$17,'similarity analysis (direct)'!C$19)","v":9},{"$f":"RANK('similarity analysis (direct)'!D16,'similarity analysis (direct)'!D$2:D$17,'similarity analysis (direct)'!D$19)","v":5},{"$f":"RANK('similarity analysis (direct)'!E16,'similarity analysis (direct)'!E$2:E$17,'similarity analysis (direct)'!E$19)","v":14},{"$f":"RANK('similarity analysis (direct)'!F16,'similarity analysis (direct)'!F$2:F$17,'similarity analysis (direct)'!F$19)","v":5},{"$f":"RANK('similarity analysis (direct)'!G16,'similarity analysis (direct)'!G$2:G$17,'similarity analysis (direct)'!G$19)","v":11},{"$f":"'similarity analysis (direct)'!H16","v":1000}]
[{"$f":"'similarity analysis (direct)'!A17","v":"object_16"},{"$f":"RANK('similarity analysis (direct)'!B17,'similarity analysis (direct)'!B$2:B$17,'similarity analysis (direct)'!B$19)","v":16},{"$f":"RANK('similarity analysis (direct)'!C17,'similarity analysis (direct)'!C$2:C$17,'similarity analysis (direct)'!C$19)","v":3},{"$f":"RANK('similarity analysis (direct)'!D17,'similarity analysis (direct)'!D$2:D$17,'similarity analysis (direct)'!D$19)","v":15},{"$f":"RANK('similarity analysis (direct)'!E17,'similarity analysis (direct)'!E$2:E$17,'similarity analysis (direct)'!E$19)","v":11},{"$f":"RANK('similarity analysis (direct)'!F17,'similarity analysis (direct)'!F$2:F$17,'similarity analysis (direct)'!F$19)","v":5},{"$f":"RANK('similarity analysis (direct)'!G17,'similarity analysis (direct)'!G$2:G$17,'similarity analysis (direct)'!G$19)","v":5},{"$f":"'similarity analysis (direct)'!H17","v":1000}]
[]
["max",{"$f":"MAX(B24:B39)","v":16},16,16,16,16,16]
["min",{"$f":"MIN(B24:B39)","v":1},1,1,1,1,1]
[]
[]
["staircase function","id",{"$f":"'similarity analysis (direct)'!B23","v":"attribute_1"},{"$f":"'similarity analysis (direct)'!C23","v":"attribute_2"},{"$f":"'similarity analysis (direct)'!D23","v":"attribute_3"},{"$f":"'similarity analysis (direct)'!E23","v":"attribute_4"},{"$f":"'similarity analysis (direct)'!F23","v":"attribute_5"},{"$f":"'similarity analysis (direct)'!G23","v":"attribute_6"},null,"differences",{"$f":"C45","v":"attribute_1"},"attribute_2","attribute_3","attribute_4","attribute_5","attribute_6"]
["stair level_1 (S1)",1,168.00789110763765,179.8640995609689,252.85688220905354,165.72147898432797,187.41096683834638,253.58633954504157,null,"S1-S2",{"$f":"C46-C47","v":0.99999999999997158},{"$f":"D46-D47","v":1},{"$f":"E46-E47","v":86.146236840425985},{"$f":"F46-F47","v":1},{"$f":"G46-G47","v":1},{"$f":"H46-H47","v":78.916806325702339}]
["stair level_2",2,167.00789110763768,178.8640995609689,166.71064536862755,164.72147898432797,186.41096683834638,174.66953321933923,null,"…",0.99999999999997158,1,0.99999999999980105,1,0.99999999999997158,1]
["stair level_3",3,166.0078911076377,177.8640995609689,165.71064536862775,163.72147898432797,185.41096683834641,173.66953321933923,null,"…",1.0000000000000568,0.99999999999997158,0.99999999999997158,0.99999999999994316,1,0.99999999999997158]
["stair level_4",4,165.00789110763765,176.86409956096892,164.71064536862778,162.72147898432803,184.41096683834641,172.66953321933926,null,"…",1,0.99999999999997158,1.0000000000000568,1.0000000000002274,0.99999999999997158,1.0000000000000284]
["stair level_5",5,164.00789110763765,175.86409956096895,163.71064536862772,161.7214789843278,183.41096683834644,171.66953321933923,null,"…",1.0000000000000568,1,1,0.99999999999994316,1.0000000000000284,0.99999999999994316]
["stair level_6",6,163.00789110763759,174.86409956096895,162.71064536862772,160.72147898432786,182.41096683834641,170.66953321933929,null,"…",1.0000000000003126,1.0000000000000284,0.99999999999988631,0.99999999999980105,1.0000000000000284,1.0000000000000568]
["stair level_7",7,162.00789110763728,173.86409956096892,161.71064536862784,159.72147898432806,181.41096683834638,169.66953321933923,null,"…",0.9999999999997442,0.99999999999988631,0.99999999999994316,1,1,1.0000000000000284]
["stair level_8",8,161.00789110763753,172.86409956096904,160.71064536862789,158.72147898432806,180.41096683834638,168.6695332193392,null,"…",0.99999999999994316,1.0000000000000568,0.99999999999991473,1.0000000000000568,0.99999999999994316,1.0000000000000284]
["stair level_9",9,160.00789110763759,171.86409956096898,159.71064536862798,157.721478984328,179.41096683834644,167.66953321933917,null,"…",1.0000000000000568,0.99999999999994316,1.0000000000000853,1.0000000000000568,1.0000000000001137,0.99999999999982947]
["stair level_10",10,159.00789110763753,170.86409956096904,158.71064536862789,156.72147898432794,178.41096683834633,166.66953321933934,null,"…",1,1,0.99999999999997158,0.99999999999994316,0.99999999999997158,1.0000000000001705]
["stair level_11",11,158.00789110763753,169.86409956096904,157.71064536862792,155.721478984328,177.41096683834635,165.66953321933917,null,"…",0.9999999999997442,1,1.0000000000000853,0.99999999999994316,1.0000000000000568,0.99999999999968736]
["stair level_12",12,157.00789110763779,168.86409956096904,156.71064536862784,154.72147898432806,176.4109668383463,164.66953321933948,null,"…",0.99999999999994316,0.99999999999997158,0.99999999999997158,1.0000000000001421,1,1]
["stair level_13",13,156.00789110763785,167.86409956096907,155.71064536862787,153.72147898432792,175.4109668383463,163.66953321933948,null,"…",1.0000000000000568,1,1.0000000000000568,3.3846154950273046,0.99999999999997158,1.0000000000000568]
["stair level_14",14,155.00789110763779,166.86409956096907,154.71064536862781,150.33686348930061,174.41096683834633,162.66953321933943,null,"…",1,0.99999999999997158,1.0000000000000853,75.916805954761131,1.0000000000000284,0.99999999999971578]
["stair level_15",15,154.00789110763779,165.86409956096909,153.71064536862772,74.420057534539481,173.4109668383463,161.66953321933971,null,"S15-S16",1.0000000000000568,1.0000000000000284,0.99999999999997158,13.229430767352,1.000000000000199,1.0000000000001137]
["stair level_16 (S16)",16,153.00789110763773,164.86409956096907,152.71064536862775,61.190626767187482,172.4109668383461,160.6695332193396]
[]
[null,null,null,null,null,null,null,null,"direct",null,null,"indirect"]
[{"$f":"'similarity analysis (direct)'!A23","v":"OAM"},{"$f":"'similarity analysis (direct)'!B23","v":"attribute_1"},{"$f":"'similarity analysis (direct)'!C23","v":"attribute_2"},{"$f":"'similarity analysis (direct)'!D23","v":"attribute_3"},{"$f":"'similarity analysis (direct)'!E23","v":"attribute_4"},{"$f":"'similarity analysis (direct)'!F23","v":"attribute_5"},{"$f":"'similarity analysis (direct)'!G23","v":"attribute_6"},{"$f":"'similarity analysis (direct)'!H23","v":"Y0"},"estimation","difference","validation",{"$f":"I64","v":"estimation"},"remarks"]
[{"$f":"'similarity analysis (direct)'!A24","v":"object_1"},{"$f":"VLOOKUP('similarity analysis (direct)'!B24,'similarity analysis (direct)'!$B$46:$H$61,'similarity analysis (direct)'!B$81,0)","v":160.00789110763759},{"$f":"VLOOKUP('similarity analysis (direct)'!C24,'similarity analysis (direct)'!$B$46:$H$61,'similarity analysis (direct)'!C$81,0)","v":178.8640995609689},{"$f":"VLOOKUP('similarity analysis (direct)'!D24,'similarity analysis (direct)'!$B$46:$H$61,'similarity analysis (direct)'!D$81,0)","v":155.71064536862787},{"$f":"VLOOKUP('similarity analysis (direct)'!E24,'similarity analysis (direct)'!$B$46:$H$61,'similarity analysis (direct)'!E$81,0)","v":165.72147898432797},{"$f":"VLOOKUP('similarity analysis (direct)'!F24,'similarity analysis (direct)'!$B$46:$H$61,'similarity analysis (direct)'!F$81,0)","v":177.41096683834635},{"$f":"VLOOKUP('similarity analysis (direct)'!G24,'similarity analysis (direct)'!$B$46:$H$61,'similarity analysis (direct)'!G$81,0)","v":162.66953321933943},{"$f":"'similarity analysis (direct)'!H24","v":1000},{"$f":"SUM(B65:G65)","v":1000.3846150792481},{"$f":"H65-I65","v":-0.38461507924807847},{"$f":"IF(J65*'similarity analysis (indirect)'!J65<=0,\"valid\",\"invalid\")","v":"valid"},{"$f":"'similarity analysis (indirect)'!I65","v":999.69228182110953}]
[{"$f":"'similarity analysis (direct)'!A25","v":"object_2"},{"$f":"VLOOKUP('similarity analysis (direct)'!B25,'similarity analysis (direct)'!$B$46:$H$61,'similarity analysis (direct)'!B$81,0)","v":154.00789110763779},{"$f":"VLOOKUP('similarity analysis (direct)'!C25,'similarity analysis (direct)'!$B$46:$H$61,'similarity analysis (direct)'!C$81,0)","v":175.86409956096895},{"$f":"VLOOKUP('similarity analysis (direct)'!D25,'similarity analysis (direct)'!$B$46:$H$61,'similarity analysis (direct)'!D$81,0)","v":163.71064536862772},{"$f":"VLOOKUP('similarity analysis (direct)'!E25,'similarity analysis (direct)'!$B$46:$H$61,'similarity analysis (direct)'!E$81,0)","v":160.72147898432786},{"$f":"VLOOKUP('similarity analysis (direct)'!F25,'similarity analysis (direct)'!$B$46:$H$61,'similarity analysis (direct)'!F$81,0)","v":177.41096683834635},{"$f":"VLOOKUP('similarity analysis (direct)'!G25,'similarity analysis (direct)'!$B$46:$H$61,'similarity analysis (direct)'!G$81,0)","v":163.66953321933948},{"$f":"'similarity analysis (direct)'!H25","v":1000},995.38461507924808,4.6153849207519215,{"$f":"IF(J66*'similarity analysis (indirect)'!J66<=0,\"valid\",\"invalid\")","v":"valid"},{"$f":"'similarity analysis (indirect)'!I66","v":1005.6922817956428}]
[{"$f":"'similarity analysis (direct)'!A26","v":"object_3"},{"$f":"VLOOKUP('similarity analysis (direct)'!B26,'similarity analysis (direct)'!$B$46:$H$61,'similarity analysis (direct)'!B$81,0)","v":161.00789110763753},{"$f":"VLOOKUP('similarity analysis (direct)'!C26,'similarity analysis (direct)'!$B$46:$H$61,'similarity analysis (direct)'!C$81,0)","v":179.8640995609689},{"$f":"VLOOKUP('similarity analysis (direct)'!D26,'similarity analysis (direct)'!$B$46:$H$61,'similarity analysis (direct)'!D$81,0)","v":156.71064536862784},{"$f":"VLOOKUP('similarity analysis (direct)'!E26,'similarity analysis (direct)'!$B$46:$H$61,'similarity analysis (direct)'!E$81,0)","v":158.72147898432806},{"$f":"VLOOKUP('similarity analysis (direct)'!F26,'similarity analysis (direct)'!$B$46:$H$61,'similarity analysis (direct)'!F$81,0)","v":183.41096683834644},{"$f":"VLOOKUP('similarity analysis (direct)'!G26,'similarity analysis (direct)'!$B$46:$H$61,'similarity analysis (direct)'!G$81,0)","v":172.66953321933926},{"$f":"'similarity analysis (direct)'!H26","v":1000},1012.3846150792481,-12.384615079248078,{"$f":"IF(J67*'similarity analysis (indirect)'!J67<=0,\"valid\",\"invalid\")","v":"valid"},{"$f":"'similarity analysis (indirect)'!I67","v":988.69228175943022}]
[{"$f":"'similarity analysis (direct)'!A27","v":"object_4"},{"$f":"VLOOKUP('similarity analysis (direct)'!B27,'similarity analysis (direct)'!$B$46:$H$61,'similarity analysis (direct)'!B$81,0)","v":168.00789110763765},{"$f":"VLOOKUP('similarity analysis (direct)'!C27,'similarity analysis (direct)'!$B$46:$H$61,'similarity analysis (direct)'!C$81,0)","v":167.86409956096907},{"$f":"VLOOKUP('similarity analysis (direct)'!D27,'similarity analysis (direct)'!$B$46:$H$61,'similarity analysis (direct)'!D$81,0)","v":252.85688220905354},{"$f":"VLOOKUP('similarity analysis (direct)'!E27,'similarity analysis (direct)'!$B$46:$H$61,'similarity analysis (direct)'!E$81,0)","v":61.190626767187482},{"$f":"VLOOKUP('similarity analysis (direct)'!F27,'similarity analysis (direct)'!$B$46:$H$61,'similarity analysis (direct)'!F$81,0)","v":178.41096683834633},{"$f":"VLOOKUP('similarity analysis (direct)'!G27,'similarity analysis (direct)'!$B$46:$H$61,'similarity analysis (direct)'!G$81,0)","v":171.66953321933923},{"$f":"'similarity analysis (direct)'!H27","v":1000},999.99999970253327,2.9746672680630581E-7,{"$f":"IF(J68*'similarity analysis (indirect)'!J68<=0,\"valid\",\"invalid\")","v":"invalid"},{"$f":"'similarity analysis (indirect)'!I68","v":999.99990921082485},"<--rounding-error"]
[{"$f":"'similarity analysis (direct)'!A28","v":"object_5"},{"$f":"VLOOKUP('similarity analysis (direct)'!B28,'similarity analysis (direct)'!$B$46:$H$61,'similarity analysis (direct)'!B$81,0)","v":158.00789110763753},{"$f":"VLOOKUP('similarity analysis (direct)'!C28,'similarity analysis (direct)'!$B$46:$H$61,'similarity analysis (direct)'!C$81,0)","v":165.86409956096909},{"$f":"VLOOKUP('similarity analysis (direct)'!D28,'similarity analysis (direct)'!$B$46:$H$61,'similarity analysis (direct)'!D$81,0)","v":159.71064536862798},{"$f":"VLOOKUP('similarity analysis (direct)'!E28,'similarity analysis (direct)'!$B$46:$H$61,'similarity analysis (direct)'!E$81,0)","v":163.72147898432797},{"$f":"VLOOKUP('similarity analysis (direct)'!F28,'similarity analysis (direct)'!$B$46:$H$61,'similarity analysis (direct)'!F$81,0)","v":187.41096683834638},{"$f":"VLOOKUP('similarity analysis (direct)'!G28,'similarity analysis (direct)'!$B$46:$H$61,'similarity analysis (direct)'!G$81,0)","v":173.66953321933923},{"$f":"'similarity analysis (direct)'!H28","v":1000},1008.3846150792481,-8.3846150792480785,{"$f":"IF(J69*'similarity analysis (indirect)'!J69<=0,\"valid\",\"invalid\")","v":"valid"},{"$f":"'similarity analysis (indirect)'!I69","v":989.6922817701186}]
[{"$f":"'similarity analysis (direct)'!A29","v":"object_6"},{"$f":"VLOOKUP('similarity analysis (direct)'!B29,'similarity analysis (direct)'!$B$46:$H$61,'similarity analysis (direct)'!B$81,0)","v":166.0078911076377},{"$f":"VLOOKUP('similarity analysis (direct)'!C29,'similarity analysis (direct)'!$B$46:$H$61,'similarity analysis (direct)'!C$81,0)","v":167.86409956096907},{"$f":"VLOOKUP('similarity analysis (direct)'!D29,'similarity analysis (direct)'!$B$46:$H$61,'similarity analysis (direct)'!D$81,0)","v":161.71064536862784},{"$f":"VLOOKUP('similarity analysis (direct)'!E29,'similarity analysis (direct)'!$B$46:$H$61,'similarity analysis (direct)'!E$81,0)","v":162.72147898432803},{"$f":"VLOOKUP('similarity analysis (direct)'!F29,'similarity analysis (direct)'!$B$46:$H$61,'similarity analysis (direct)'!F$81,0)","v":172.4109668383461},{"$f":"VLOOKUP('similarity analysis (direct)'!G29,'similarity analysis (direct)'!$B$46:$H$61,'similarity analysis (direct)'!G$81,0)","v":160.6695332193396},{"$f":"'similarity analysis (direct)'!H29","v":1000},991.38461507924831,8.6153849207516942,{"$f":"IF(J70*'similarity analysis (indirect)'!J70<=0,\"valid\",\"invalid\")","v":"valid"},{"$f":"'similarity analysis (indirect)'!I70","v":1007.6922818221383}]
[{"$f":"'similarity analysis (direct)'!A30","v":"object_7"},{"$f":"VLOOKUP('similarity analysis (direct)'!B30,'similarity analysis (direct)'!$B$46:$H$61,'similarity analysis (direct)'!B$81,0)","v":156.00789110763785},{"$f":"VLOOKUP('similarity analysis (direct)'!C30,'similarity analysis (direct)'!$B$46:$H$61,'similarity analysis (direct)'!C$81,0)","v":177.8640995609689},{"$f":"VLOOKUP('similarity analysis (direct)'!D30,'similarity analysis (direct)'!$B$46:$H$61,'similarity analysis (direct)'!D$81,0)","v":160.71064536862789},{"$f":"VLOOKUP('similarity analysis (direct)'!E30,'similarity analysis (direct)'!$B$46:$H$61,'similarity analysis (direct)'!E$81,0)","v":156.72147898432794},{"$f":"VLOOKUP('similarity analysis (direct)'!F30,'similarity analysis (direct)'!$B$46:$H$61,'similarity analysis (direct)'!F$81,0)","v":186.41096683834638},{"$f":"VLOOKUP('similarity analysis (direct)'!G30,'similarity analysis (direct)'!$B$46:$H$61,'similarity analysis (direct)'!G$81,0)","v":169.66953321933923},{"$f":"'similarity analysis (direct)'!H30","v":1000},1007.3846150792481,-7.3846150792480785,{"$f":"IF(J71*'similarity analysis (indirect)'!J71<=0,\"valid\",\"invalid\")","v":"valid"},{"$f":"'similarity analysis (indirect)'!I71","v":992.69228176632396}]
[{"$f":"'similarity analysis (direct)'!A31","v":"object_8"},{"$f":"VLOOKUP('similarity analysis (direct)'!B31,'similarity analysis (direct)'!$B$46:$H$61,'similarity analysis (direct)'!B$81,0)","v":157.00789110763779},{"$f":"VLOOKUP('similarity analysis (direct)'!C31,'similarity analysis (direct)'!$B$46:$H$61,'similarity analysis (direct)'!C$81,0)","v":172.86409956096904},{"$f":"VLOOKUP('similarity analysis (direct)'!D31,'similarity analysis (direct)'!$B$46:$H$61,'similarity analysis (direct)'!D$81,0)","v":152.71064536862775},{"$f":"VLOOKUP('similarity analysis (direct)'!E31,'similarity analysis (direct)'!$B$46:$H$61,'similarity analysis (direct)'!E$81,0)","v":161.7214789843278},{"$f":"VLOOKUP('similarity analysis (direct)'!F31,'similarity analysis (direct)'!$B$46:$H$61,'similarity analysis (direct)'!F$81,0)","v":175.4109668383463},{"$f":"VLOOKUP('similarity analysis (direct)'!G31,'similarity analysis (direct)'!$B$46:$H$61,'similarity analysis (direct)'!G$81,0)","v":161.66953321933971},{"$f":"'similarity analysis (direct)'!H31","v":1000},981.38461507924853,18.615384920751467,{"$f":"IF(J72*'similarity analysis (indirect)'!J72<=0,\"valid\",\"invalid\")","v":"valid"},{"$f":"'similarity analysis (indirect)'!I72","v":1016.6922818337508}]
[{"$f":"'similarity analysis (direct)'!A32","v":"object_9"},{"$f":"VLOOKUP('similarity analysis (direct)'!B32,'similarity analysis (direct)'!$B$46:$H$61,'similarity analysis (direct)'!B$81,0)","v":163.00789110763759},{"$f":"VLOOKUP('similarity analysis (direct)'!C32,'similarity analysis (direct)'!$B$46:$H$61,'similarity analysis (direct)'!C$81,0)","v":170.86409956096904},{"$f":"VLOOKUP('similarity analysis (direct)'!D32,'similarity analysis (direct)'!$B$46:$H$61,'similarity analysis (direct)'!D$81,0)","v":157.71064536862792},{"$f":"VLOOKUP('similarity analysis (direct)'!E32,'similarity analysis (direct)'!$B$46:$H$61,'similarity analysis (direct)'!E$81,0)","v":160.72147898432786},{"$f":"VLOOKUP('similarity analysis (direct)'!F32,'similarity analysis (direct)'!$B$46:$H$61,'similarity analysis (direct)'!F$81,0)","v":183.41096683834644},{"$f":"VLOOKUP('similarity analysis (direct)'!G32,'similarity analysis (direct)'!$B$46:$H$61,'similarity analysis (direct)'!G$81,0)","v":166.66953321933934},{"$f":"'similarity analysis (direct)'!H32","v":1000},1002.3846150792482,-2.3846150792481922,{"$f":"IF(J73*'similarity analysis (indirect)'!J73<=0,\"valid\",\"invalid\")","v":"valid"},{"$f":"'similarity analysis (indirect)'!I73","v":999.69228179386653}]
[{"$f":"'similarity analysis (direct)'!A33","v":"object_10"},{"$f":"VLOOKUP('similarity analysis (direct)'!B33,'similarity analysis (direct)'!$B$46:$H$61,'similarity analysis (direct)'!B$81,0)","v":168.00789110763765},{"$f":"VLOOKUP('similarity analysis (direct)'!C33,'similarity analysis (direct)'!$B$46:$H$61,'similarity analysis (direct)'!C$81,0)","v":174.86409956096895},{"$f":"VLOOKUP('similarity analysis (direct)'!D33,'similarity analysis (direct)'!$B$46:$H$61,'similarity analysis (direct)'!D$81,0)","v":166.71064536862755},{"$f":"VLOOKUP('similarity analysis (direct)'!E33,'similarity analysis (direct)'!$B$46:$H$61,'similarity analysis (direct)'!E$81,0)","v":165.72147898432797},{"$f":"VLOOKUP('similarity analysis (direct)'!F33,'similarity analysis (direct)'!$B$46:$H$61,'similarity analysis (direct)'!F$81,0)","v":184.41096683834641},{"$f":"VLOOKUP('similarity analysis (direct)'!G33,'similarity analysis (direct)'!$B$46:$H$61,'similarity analysis (direct)'!G$81,0)","v":169.66953321933923},{"$f":"'similarity analysis (direct)'!H33","v":1000},1029.3846150792479,-29.384615079247851,{"$f":"IF(J74*'similarity analysis (indirect)'!J74<=0,\"valid\",\"invalid\")","v":"valid"},{"$f":"'similarity analysis (indirect)'!I74","v":971.69228178040794}]
[{"$f":"'similarity analysis (direct)'!A34","v":"object_11"},{"$f":"VLOOKUP('similarity analysis (direct)'!B34,'similarity analysis (direct)'!$B$46:$H$61,'similarity analysis (direct)'!B$81,0)","v":164.00789110763765},{"$f":"VLOOKUP('similarity analysis (direct)'!C34,'similarity analysis (direct)'!$B$46:$H$61,'similarity analysis (direct)'!C$81,0)","v":168.86409956096904},{"$f":"VLOOKUP('similarity analysis (direct)'!D34,'similarity analysis (direct)'!$B$46:$H$61,'similarity analysis (direct)'!D$81,0)","v":165.71064536862775},{"$f":"VLOOKUP('similarity analysis (direct)'!E34,'similarity analysis (direct)'!$B$46:$H$61,'similarity analysis (direct)'!E$81,0)","v":157.721478984328},{"$f":"VLOOKUP('similarity analysis (direct)'!F34,'similarity analysis (direct)'!$B$46:$H$61,'similarity analysis (direct)'!F$81,0)","v":179.41096683834644},{"$f":"VLOOKUP('similarity analysis (direct)'!G34,'similarity analysis (direct)'!$B$46:$H$61,'similarity analysis (direct)'!G$81,0)","v":174.66953321933923},{"$f":"'similarity analysis (direct)'!H34","v":1000},1010.3846150792481,-10.384615079248078,{"$f":"IF(J75*'similarity analysis (indirect)'!J75<=0,\"valid\",\"invalid\")","v":"valid"},{"$f":"'similarity analysis (indirect)'!I75","v":987.69228173610554}]
[{"$f":"'similarity analysis (direct)'!A35","v":"object_12"},{"$f":"VLOOKUP('similarity analysis (direct)'!B35,'similarity analysis (direct)'!$B$46:$H$61,'similarity analysis (direct)'!B$81,0)","v":155.00789110763779},{"$f":"VLOOKUP('similarity analysis (direct)'!C35,'similarity analysis (direct)'!$B$46:$H$61,'similarity analysis (direct)'!C$81,0)","v":164.86409956096907},{"$f":"VLOOKUP('similarity analysis (direct)'!D35,'similarity analysis (direct)'!$B$46:$H$61,'similarity analysis (direct)'!D$81,0)","v":158.71064536862789},{"$f":"VLOOKUP('similarity analysis (direct)'!E35,'similarity analysis (direct)'!$B$46:$H$61,'similarity analysis (direct)'!E$81,0)","v":153.72147898432792},{"$f":"VLOOKUP('similarity analysis (direct)'!F35,'similarity analysis (direct)'!$B$46:$H$61,'similarity analysis (direct)'!F$81,0)","v":174.41096683834633},{"$f":"VLOOKUP('similarity analysis (direct)'!G35,'similarity analysis (direct)'!$B$46:$H$61,'similarity analysis (direct)'!G$81,0)","v":164.66953321933948},{"$f":"'similarity analysis (direct)'!H35","v":1000},971.38461507924853,28.615384920751467,{"$f":"IF(J76*'similarity analysis (indirect)'!J76<=0,\"valid\",\"invalid\")","v":"valid"},{"$f":"'similarity analysis (indirect)'!I76","v":1026.6922817797172}]
[{"$f":"'similarity analysis (direct)'!A36","v":"object_13"},{"$f":"VLOOKUP('similarity analysis (direct)'!B36,'similarity analysis (direct)'!$B$46:$H$61,'similarity analysis (direct)'!B$81,0)","v":159.00789110763753},{"$f":"VLOOKUP('similarity analysis (direct)'!C36,'similarity analysis (direct)'!$B$46:$H$61,'similarity analysis (direct)'!C$81,0)","v":173.86409956096892},{"$f":"VLOOKUP('similarity analysis (direct)'!D36,'similarity analysis (direct)'!$B$46:$H$61,'similarity analysis (direct)'!D$81,0)","v":164.71064536862778},{"$f":"VLOOKUP('similarity analysis (direct)'!E36,'similarity analysis (direct)'!$B$46:$H$61,'similarity analysis (direct)'!E$81,0)","v":155.721478984328},{"$f":"VLOOKUP('similarity analysis (direct)'!F36,'similarity analysis (direct)'!$B$46:$H$61,'similarity analysis (direct)'!F$81,0)","v":173.4109668383463},{"$f":"VLOOKUP('similarity analysis (direct)'!G36,'similarity analysis (direct)'!$B$46:$H$61,'similarity analysis (direct)'!G$81,0)","v":167.66953321933917},{"$f":"'similarity analysis (direct)'!H36","v":1000},994.38461507924774,5.6153849207522626,{"$f":"IF(J77*'similarity analysis (indirect)'!J77<=0,\"valid\",\"invalid\")","v":"valid"},{"$f":"'similarity analysis (indirect)'!I77","v":1004.6922817573731}]
[{"$f":"'similarity analysis (direct)'!A37","v":"object_14"},{"$f":"VLOOKUP('similarity analysis (direct)'!B37,'similarity analysis (direct)'!$B$46:$H$61,'similarity analysis (direct)'!B$81,0)","v":162.00789110763728},{"$f":"VLOOKUP('similarity analysis (direct)'!C37,'similarity analysis (direct)'!$B$46:$H$61,'similarity analysis (direct)'!C$81,0)","v":169.86409956096904},{"$f":"VLOOKUP('similarity analysis (direct)'!D37,'similarity analysis (direct)'!$B$46:$H$61,'similarity analysis (direct)'!D$81,0)","v":154.71064536862781},{"$f":"VLOOKUP('similarity analysis (direct)'!E37,'similarity analysis (direct)'!$B$46:$H$61,'similarity analysis (direct)'!E$81,0)","v":74.420057534539481},{"$f":"VLOOKUP('similarity analysis (direct)'!F37,'similarity analysis (direct)'!$B$46:$H$61,'similarity analysis (direct)'!F$81,0)","v":185.41096683834641},{"$f":"VLOOKUP('similarity analysis (direct)'!G37,'similarity analysis (direct)'!$B$46:$H$61,'similarity analysis (direct)'!G$81,0)","v":253.58633954504157},{"$f":"'similarity analysis (direct)'!H37","v":1000},999.99999995516168,4.4838316171080805E-8,{"$f":"IF(J78*'similarity analysis (indirect)'!J78<=0,\"valid\",\"invalid\")","v":"invalid"},{"$f":"'similarity analysis (indirect)'!I78","v":999.99991889677653},"<--rounding-error"]
[{"$f":"'similarity analysis (direct)'!A38","v":"object_15"},{"$f":"VLOOKUP('similarity analysis (direct)'!B38,'similarity analysis (direct)'!$B$46:$H$61,'similarity analysis (direct)'!B$81,0)","v":165.00789110763765},{"$f":"VLOOKUP('similarity analysis (direct)'!C38,'similarity analysis (direct)'!$B$46:$H$61,'similarity analysis (direct)'!C$81,0)","v":171.86409956096898},{"$f":"VLOOKUP('similarity analysis (direct)'!D38,'similarity analysis (direct)'!$B$46:$H$61,'similarity analysis (direct)'!D$81,0)","v":163.71064536862772},{"$f":"VLOOKUP('similarity analysis (direct)'!E38,'similarity analysis (direct)'!$B$46:$H$61,'similarity analysis (direct)'!E$81,0)","v":150.33686348930061},{"$f":"VLOOKUP('similarity analysis (direct)'!F38,'similarity analysis (direct)'!$B$46:$H$61,'similarity analysis (direct)'!F$81,0)","v":183.41096683834644},{"$f":"VLOOKUP('similarity analysis (direct)'!G38,'similarity analysis (direct)'!$B$46:$H$61,'similarity analysis (direct)'!G$81,0)","v":165.66953321933917},{"$f":"'similarity analysis (direct)'!H38","v":1000},999.99999958422063,4.1577936826797668E-7,{"$f":"IF(J79*'similarity analysis (indirect)'!J79<=0,\"valid\",\"invalid\")","v":"invalid"},{"$f":"'similarity analysis (indirect)'!I79","v":999.99992558428767},"<--rounding-error"]
[{"$f":"'similarity analysis (direct)'!A39","v":"object_16"},{"$f":"VLOOKUP('similarity analysis (direct)'!B39,'similarity analysis (direct)'!$B$46:$H$61,'similarity analysis (direct)'!B$81,0)","v":153.00789110763773},{"$f":"VLOOKUP('similarity analysis (direct)'!C39,'similarity analysis (direct)'!$B$46:$H$61,'similarity analysis (direct)'!C$81,0)","v":177.8640995609689},{"$f":"VLOOKUP('similarity analysis (direct)'!D39,'similarity analysis (direct)'!$B$46:$H$61,'similarity analysis (direct)'!D$81,0)","v":153.71064536862772},{"$f":"VLOOKUP('similarity analysis (direct)'!E39,'similarity analysis (direct)'!$B$46:$H$61,'similarity analysis (direct)'!E$81,0)","v":155.721478984328},{"$f":"VLOOKUP('similarity analysis (direct)'!F39,'similarity analysis (direct)'!$B$46:$H$61,'similarity analysis (direct)'!F$81,0)","v":183.41096683834644},{"$f":"VLOOKUP('similarity analysis (direct)'!G39,'similarity analysis (direct)'!$B$46:$H$61,'similarity analysis (direct)'!G$81,0)","v":171.66953321933923},{"$f":"'similarity analysis (direct)'!H39","v":1000},995.38461507924796,4.6153849207520352,{"$f":"IF(J80*'similarity analysis (indirect)'!J80<=0,\"valid\",\"invalid\")","v":"valid"},{"$f":"'similarity analysis (indirect)'!I80","v":1008.6922817589722}]
["id",2,3,4,5,6,7]
[null,null,null,null,null,null,null,null,"error level",{"$f":"SUMSQ(J65:J80)","v":2569.0769230768697}]

{"sheet":"similarity analysis (indirect)","index":1,"n_rows":82,"n_cols":16,"rows_kept":82,"cut":false,"hidden":false,"merged":[]}
["OAM","attribute_1","attribute_2","attribute_3","attribute_4","attribute_5","attribute_6","Y0","naive average","naive ranks","optimized ranks","abs differences",null,"Case study"]
["object_1",76,92,72,95,78,57,1000,{"$f":"AVERAGE(B2:G2)","v":78.333333333333329},{"$f":"RANK(I2,I$2:I$17,0)","v":7},{"$f":"RANK(I65,I$65:I$80,0)","v":10},{"$f":"ABS(J2-K2)","v":3},null,"objects","=","Students"]
["object_2",60,85,91,82,78,72,1000,{"$f":"AVERAGE(B3:G3)","v":78},{"$f":"RANK(I3,I$2:I$17,0)","v":9},{"$f":"RANK(I66,I$65:I$80,0)","v":5},{"$f":"ABS(J3-K3)","v":4},null,"attributes","=","Performances"]
["object_3",79,99,74,78,87,88,1000,84.166666666666671,2,14,12,null,"question","=","Could each Student have the same evaluation value? (anti-discriminative modelling)"]
["object_4",93,56,99,53,82,87,1000,78.333333333333329,7,9,2]
["object_5",68,55,83,93,100,90,1000,81.5,5,13,8]
["object_6",91,56,90,90,53,51,1000,71.833333333333329,14,4,10]
["object_7",63,91,84,73,99,85,1000,82.5,3,12,9]
["object_8",64,74,57,87,74,56,1000,68.666666666666671,15,2,13]
["object_9",86,64,76,82,87,78,1000,78.833333333333329,6,11,5]
["object_10",93,83,98,95,88,85,1000,90.333333333333329,1,16,15]
["object_11",87,57,95,75,85,93,1000,82,4,15,11]
["object_12",62,54,77,69,62,73,1000,66.166666666666671,16,1,15]
["object_13",75,81,93,70,59,79,1000,76.166666666666671,11,6,5]
["object_14",85,58,61,54,95,96,1000,74.833333333333329,12,8,4]
["object_15",88,66,91,58,87,75,1000,77.5,10,7,3]
["object_16",53,91,58,70,87,87,1000,74.333333333333329,13,3,10]
[]
["direction",1,1,1,1,1,1]
["meaning","the more a(i) the more Y","the more a(i) the more Y","the more a(i) the more Y","the more a(i) the more Y","the more a(i) the more Y","the more a(i) the more Y","constant value"]
[]
[]
[{"$f":"'similarity analysis (indirect)'!A1","v":"OAM"},{"$f":"'similarity analysis (indirect)'!B1","v":"attribute_1"},{"$f":"'similarity analysis (indirect)'!C1","v":"attribute_2"},{"$f":"'similarity analysis (indirect)'!D1","v":"attribute_3"},{"$f":"'similarity analysis (indirect)'!E1","v":"attribute_4"},{"$f":"'similarity analysis (indirect)'!F1","v":"attribute_5"},{"$f":"'similarity analysis (indirect)'!G1","v":"attribute_6"},{"$f":"'similarity analysis (indirect)'!H1","v":"Y0"}]
[{"$f":"'similarity analysis (indirect)'!A2","v":"object_1"},{"$f":"RANK('similarity analysis (indirect)'!B2,'similarity analysis (indirect)'!B$2:B$17,'similarity analysis (indirect)'!B$19)","v":8},{"$f":"RANK('similarity analysis (indirect)'!C2,'similarity analysis (indirect)'!C$2:C$17,'similarity analysis (indirect)'!C$19)","v":15},{"$f":"RANK('similarity analysis (indirect)'!D2,'similarity analysis (indirect)'!D$2:D$17,'similarity analysis (indirect)'!D$19)","v":4},{"$f":"RANK('similarity analysis (indirect)'!E2,'similarity analysis (indirect)'!E$2:E$17,'similarity analysis (indirect)'!E$19)","v":15},{"$f":"RANK('similarity analysis (indirect)'!F2,'similarity analysis (indirect)'!F$2:F$17,'similarity analysis (indirect)'!F$19)","v":5},{"$f":"RANK('similarity analysis (indirect)'!G2,'similarity analysis (indirect)'!G$2:G$17,'similarity analysis (indirect)'!G$19)","v":3},{"$f":"'similarity analysis (indirect)'!H2","v":1000}]
[{"$f":"'similarity analysis (indirect)'!A3","v":"object_2"},{"$f":"RANK('similarity analysis (indirect)'!B3,'similarity analysis (indirect)'!B$2:B$17,'similarity analysis (indirect)'!B$19)","v":2},{"$f":"RANK('similarity analysis (indirect)'!C3,'similarity analysis (indirect)'!C$2:C$17,'similarity analysis (indirect)'!C$19)","v":12},{"$f":"RANK('similarity analysis (indirect)'!D3,'similarity analysis (indirect)'!D$2:D$17,'similarity analysis (indirect)'!D$19)","v":11},{"$f":"RANK('similarity analysis (indirect)'!E3,'similarity analysis (indirect)'!E$2:E$17,'similarity analysis (indirect)'!E$19)","v":10},{"$f":"RANK('similarity analysis (indirect)'!F3,'similarity analysis (indirect)'!F$2:F$17,'similarity analysis (indirect)'!F$19)","v":5},{"$f":"RANK('similarity analysis (indirect)'!G3,'similarity analysis (indirect)'!G$2:G$17,'similarity analysis (indirect)'!G$19)","v":4},{"$f":"'similarity analysis (indirect)'!H3","v":1000}]
[{"$f":"'similarity analysis (indirect)'!A4","v":"object_3"},{"$f":"RANK('similarity analysis (indirect)'!B4,'similarity analysis (indirect)'!B$2:B$17,'similarity analysis (indirect)'!B$19)","v":9},{"$f":"RANK('similarity analysis (indirect)'!C4,'similarity analysis (indirect)'!C$2:C$17,'similarity analysis (indirect)'!C$19)","v":16},{"$f":"RANK('similarity analysis (indirect)'!D4,'similarity analysis (indirect)'!D$2:D$17,'similarity analysis (indirect)'!D$19)","v":5},{"$f":"RANK('similarity analysis (indirect)'!E4,'similarity analysis (indirect)'!E$2:E$17,'similarity analysis (indirect)'!E$19)","v":9},{"$f":"RANK('similarity analysis (indirect)'!F4,'similarity analysis (indirect)'!F$2:F$17,'similarity analysis (indirect)'!F$19)","v":9},{"$f":"RANK('similarity analysis (indirect)'!G4,'similarity analysis (indirect)'!G$2:G$17,'similarity analysis (indirect)'!G$19)","v":13},{"$f":"'similarity analysis (indirect)'!H4","v":1000}]
[{"$f":"'similarity analysis (indirect)'!A5","v":"object_4"},{"$f":"RANK('similarity analysis (indirect)'!B5,'similarity analysis (indirect)'!B$2:B$17,'similarity analysis (indirect)'!B$19)","v":15},{"$f":"RANK('similarity analysis (indirect)'!C5,'similarity analysis (indirect)'!C$2:C$17,'similarity analysis (indirect)'!C$19)","v":3},{"$f":"RANK('similarity analysis (indirect)'!D5,'similarity analysis (indirect)'!D$2:D$17,'similarity analysis (indirect)'!D$19)","v":16},{"$f":"RANK('similarity analysis (indirect)'!E5,'similarity analysis (indirect)'!E$2:E$17,'similarity analysis (indirect)'!E$19)","v":1},{"$f":"RANK('similarity analysis (indirect)'!F5,'similarity analysis (indirect)'!F$2:F$17,'similarity analysis (indirect)'!F$19)","v":7},{"$f":"RANK('similarity analysis (indirect)'!G5,'similarity analysis (indirect)'!G$2:G$17,'similarity analysis (indirect)'!G$19)","v":11},{"$f":"'similarity analysis (indirect)'!H5","v":1000}]
[{"$f":"'similarity analysis (indirect)'!A6","v":"object_5"},{"$f":"RANK('similarity analysis (indirect)'!B6,'similarity analysis (indirect)'!B$2:B$17,'similarity analysis (indirect)'!B$19)","v":6},{"$f":"RANK('similarity analysis (indirect)'!C6,'similarity analysis (indirect)'!C$2:C$17,'similarity analysis (indirect)'!C$19)","v":2},{"$f":"RANK('similarity analysis (indirect)'!D6,'similarity analysis (indirect)'!D$2:D$17,'similarity analysis (indirect)'!D$19)","v":8},{"$f":"RANK('similarity analysis (indirect)'!E6,'similarity analysis (indirect)'!E$2:E$17,'similarity analysis (indirect)'!E$19)","v":14},{"$f":"RANK('similarity analysis (indirect)'!F6,'similarity analysis (indirect)'!F$2:F$17,'similarity analysis (indirect)'!F$19)","v":16},{"$f":"RANK('similarity analysis (indirect)'!G6,'similarity analysis (indirect)'!G$2:G$17,'similarity analysis (indirect)'!G$19)","v":14},{"$f":"'similarity analysis (indirect)'!H6","v":1000}]
[{"$f":"'similarity analysis (indirect)'!A7","v":"object_6"},{"$f":"RANK('similarity analysis (indirect)'!B7,'similarity analysis (indirect)'!B$2:B$17,'similarity analysis (indirect)'!B$19)","v":14},{"$f":"RANK('similarity analysis (indirect)'!C7,'similarity analysis (indirect)'!C$2:C$17,'similarity analysis (indirect)'!C$19)","v":3},{"$f":"RANK('similarity analysis (indirect)'!D7,'similarity analysis (indirect)'!D$2:D$17,'similarity analysis (indirect)'!D$19)","v":10},{"$f":"RANK('similarity analysis (indirect)'!E7,'similarity analysis (indirect)'!E$2:E$17,'similarity analysis (indirect)'!E$19)","v":13},{"$f":"RANK('similarity analysis (indirect)'!F7,'similarity analysis (indirect)'!F$2:F$17,'similarity analysis (indirect)'!F$19)","v":1},{"$f":"RANK('similarity analysis (indirect)'!G7,'similarity analysis (indirect)'!G$2:G$17,'similarity analysis (indirect)'!G$19)","v":1},{"$f":"'similarity analysis (indirect)'!H7","v":1000}]
[{"$f":"'similarity analysis (indirect)'!A8","v":"object_7"},{"$f":"RANK('similarity analysis (indirect)'!B8,'similarity analysis (indirect)'!B$2:B$17,'similarity analysis (indirect)'!B$19)","v":4},{"$f":"RANK('similarity analysis (indirect)'!C8,'similarity analysis (indirect)'!C$2:C$17,'similarity analysis (indirect)'!C$19)","v":13},{"$f":"RANK('similarity analysis (indirect)'!D8,'similarity analysis (indirect)'!D$2:D$17,'similarity analysis (indirect)'!D$19)","v":9},{"$f":"RANK('similarity analysis (indirect)'!E8,'similarity analysis (indirect)'!E$2:E$17,'similarity analysis (indirect)'!E$19)","v":7},{"$f":"RANK('similarity analysis (indirect)'!F8,'similarity analysis (indirect)'!F$2:F$17,'similarity analysis (indirect)'!F$19)","v":15},{"$f":"RANK('similarity analysis (indirect)'!G8,'similarity analysis (indirect)'!G$2:G$17,'similarity analysis (indirect)'!G$19)","v":9},{"$f":"'similarity analysis (indirect)'!H8","v":1000}]
[{"$f":"'similarity analysis (indirect)'!A9","v":"object_8"},{"$f":"RANK('similarity analysis (indirect)'!B9,'similarity analysis (indirect)'!B$2:B$17,'similarity analysis (indirect)'!B$19)","v":5},{"$f":"RANK('similarity analysis (indirect)'!C9,'similarity analysis (indirect)'!C$2:C$17,'similarity analysis (indirect)'!C$19)","v":9},{"$f":"RANK('similarity analysis (indirect)'!D9,'similarity analysis (indirect)'!D$2:D$17,'similarity analysis (indirect)'!D$19)","v":1},{"$f":"RANK('similarity analysis (indirect)'!E9,'similarity analysis (indirect)'!E$2:E$17,'similarity analysis (indirect)'!E$19)","v":12},{"$f":"RANK('similarity analysis (indirect)'!F9,'similarity analysis (indirect)'!F$2:F$17,'similarity analysis (indirect)'!F$19)","v":4},{"$f":"RANK('similarity analysis (indirect)'!G9,'similarity analysis (indirect)'!G$2:G$17,'similarity analysis (indirect)'!G$19)","v":2},{"$f":"'similarity analysis (indirect)'!H9","v":1000}]
[{"$f":"'similarity analysis (indirect)'!A10","v":"object_9"},{"$f":"RANK('similarity analysis (indirect)'!B10,'similarity analysis (indirect)'!B$2:B$17,'similarity analysis (indirect)'!B$19)","v":11},{"$f":"RANK('similarity analysis (indirect)'!C10,'similarity analysis (indirect)'!C$2:C$17,'similarity analysis (indirect)'!C$19)","v":7},{"$f":"RANK('similarity analysis (indirect)'!D10,'similarity analysis (indirect)'!D$2:D$17,'similarity analysis (indirect)'!D$19)","v":6},{"$f":"RANK('similarity analysis (indirect)'!E10,'similarity analysis (indirect)'!E$2:E$17,'similarity analysis (indirect)'!E$19)","v":10},{"$f":"RANK('similarity analysis (indirect)'!F10,'similarity analysis (indirect)'!F$2:F$17,'similarity analysis (indirect)'!F$19)","v":9},{"$f":"RANK('similarity analysis (indirect)'!G10,'similarity analysis (indirect)'!G$2:G$17,'similarity analysis (indirect)'!G$19)","v":7},{"$f":"'similarity analysis (indirect)'!H10","v":1000}]
[{"$f":"'similarity analysis (indirect)'!A11","v":"object_10"},{"$f":"RANK('similarity analysis (indirect)'!B11,'similarity analysis (indirect)'!B$2:B$17,'similarity analysis (indirect)'!B$19)","v":15},{"$f":"RANK('similarity analysis (indirect)'!C11,'similarity analysis (indirect)'!C$2:C$17,'similarity analysis (indirect)'!C$19)","v":11},{"$f":"RANK('similarity analysis (indirect)'!D11,'similarity analysis (indirect)'!D$2:D$17,'similarity analysis (indirect)'!D$19)","v":15},{"$f":"RANK('similarity analysis (indirect)'!E11,'similarity analysis (indirect)'!E$2:E$17,'similarity analysis (indirect)'!E$19)","v":15},{"$f":"RANK('similarity analysis (indirect)'!F11,'similarity analysis (indirect)'!F$2:F$17,'similarity analysis (indirect)'!F$19)","v":13},{"$f":"RANK('similarity analysis (indirect)'!G11,'similarity analysis (indirect)'!G$2:G$17,'similarity analysis (indirect)'!G$19)","v":9},{"$f":"'similarity analysis (indirect)'!H11","v":1000}]
[{"$f":"'similarity analysis (indirect)'!A12","v":"object_11"},{"$f":"RANK('similarity analysis (indirect)'!B12,'similarity analysis (indirect)'!B$2:B$17,'similarity analysis (indirect)'!B$19)","v":12},{"$f":"RANK('similarity analysis (indirect)'!C12,'similarity analysis (indirect)'!C$2:C$17,'similarity analysis (indirect)'!C$19)","v":5},{"$f":"RANK('similarity analysis (indirect)'!D12,'similarity analysis (indirect)'!D$2:D$17,'similarity analysis (indirect)'!D$19)","v":14},{"$f":"RANK('similarity analysis (indirect)'!E12,'similarity analysis (indirect)'!E$2:E$17,'similarity analysis (indirect)'!E$19)","v":8},{"$f":"RANK('similarity analysis (indirect)'!F12,'similarity analysis (indirect)'!F$2:F$17,'similarity analysis (indirect)'!F$19)","v":8},{"$f":"RANK('similarity analysis (indirect)'!G12,'similarity analysis (indirect)'!G$2:G$17,'similarity analysis (indirect)'!G$19)","v":15},{"$f":"'similarity analysis (indirect)'!H12","v":1000}]
[{"$f":"'similarity analysis (indirect)'!A13","v":"object_12"},{"$f":"RANK('similarity analysis (indirect)'!B13,'similarity analysis (indirect)'!B$2:B$17,'similarity analysis (indirect)'!B$19)","v":3},{"$f":"RANK('similarity analysis (indirect)'!C13,'similarity analysis (indirect)'!C$2:C$17,'similarity analysis (indirect)'!C$19)","v":1},{"$f":"RANK('similarity analysis (indirect)'!D13,'similarity analysis (indirect)'!D$2:D$17,'similarity analysis (indirect)'!D$19)","v":7},{"$f":"RANK('similarity analysis (indirect)'!E13,'similarity analysis (indirect)'!E$2:E$17,'similarity analysis (indirect)'!E$19)","v":4},{"$f":"RANK('similarity analysis (indirect)'!F13,'similarity analysis (indirect)'!F$2:F$17,'similarity analysis (indirect)'!F$19)","v":3},{"$f":"RANK('similarity analysis (indirect)'!G13,'similarity analysis (indirect)'!G$2:G$17,'similarity analysis (indirect)'!G$19)","v":5},{"$f":"'similarity analysis (indirect)'!H13","v":1000}]
[{"$f":"'similarity analysis (indirect)'!A14","v":"object_13"},{"$f":"RANK('similarity analysis (indirect)'!B14,'similarity analysis (indirect)'!B$2:B$17,'similarity analysis (indirect)'!B$19)","v":7},{"$f":"RANK('similarity analysis (indirect)'!C14,'similarity analysis (indirect)'!C$2:C$17,'similarity analysis (indirect)'!C$19)","v":10},{"$f":"RANK('similarity analysis (indirect)'!D14,'similarity analysis (indirect)'!D$2:D$17,'similarity analysis (indirect)'!D$19)","v":13},{"$f":"RANK('similarity analysis (indirect)'!E14,'similarity analysis (indirect)'!E$2:E$17,'similarity analysis (indirect)'!E$19)","v":5},{"$f":"RANK('similarity analysis (indirect)'!F14,'similarity analysis (indirect)'!F$2:F$17,'similarity analysis (indirect)'!F$19)","v":2},{"$f":"RANK('similarity analysis (indirect)'!G14,'similarity analysis (indirect)'!G$2:G$17,'similarity analysis (indirect)'!G$19)","v":8},{"$f":"'similarity analysis (indirect)'!H14","v":1000}]
[{"$f":"'similarity analysis (indirect)'!A15","v":"object_14"},{"$f":"RANK('similarity analysis (indirect)'!B15,'similarity analysis (indirect)'!B$2:B$17,'similarity analysis (indirect)'!B$19)","v":10},{"$f":"RANK('similarity analysis (indirect)'!C15,'similarity analysis (indirect)'!C$2:C$17,'similarity analysis (indirect)'!C$19)","v":6},{"$f":"RANK('similarity analysis (indirect)'!D15,'similarity analysis (indirect)'!D$2:D$17,'similarity analysis (indirect)'!D$19)","v":3},{"$f":"RANK('similarity analysis (indirect)'!E15,'similarity analysis (indirect)'!E$2:E$17,'similarity analysis (indirect)'!E$19)","v":2},{"$f":"RANK('similarity analysis (indirect)'!F15,'similarity analysis (indirect)'!F$2:F$17,'similarity analysis (indirect)'!F$19)","v":14},{"$f":"RANK('similarity analysis (indirect)'!G15,'similarity analysis (indirect)'!G$2:G$17,'similarity analysis (indirect)'!G$19)","v":16},{"$f":"'similarity analysis (indirect)'!H15","v":1000}]
[{"$f":"'similarity analysis (indirect)'!A16","v":"object_15"},{"$f":"RANK('similarity analysis (indirect)'!B16,'similarity analysis (indirect)'!B$2:B$17,'similarity analysis (indirect)'!B$19)","v":13},{"$f":"RANK('similarity analysis (indirect)'!C16,'similarity analysis (indirect)'!C$2:C$17,'similarity analysis (indirect)'!C$19)","v":8},{"$f":"RANK('similarity analysis (indirect)'!D16,'similarity analysis (indirect)'!D$2:D$17,'similarity analysis (indirect)'!D$19)","v":11},{"$f":"RANK('similarity analysis (indirect)'!E16,'similarity analysis (indirect)'!E$2:E$17,'similarity analysis (indirect)'!E$19)","v":3},{"$f":"RANK('similarity analysis (indirect)'!F16,'similarity analysis (indirect)'!F$2:F$17,'similarity analysis (indirect)'!F$19)","v":9},{"$f":"RANK('similarity analysis (indirect)'!G16,'similarity analysis (indirect)'!G$2:G$17,'similarity analysis (indirect)'!G$19)","v":6},{"$f":"'similarity analysis (indirect)'!H16","v":1000}]
[{"$f":"'similarity analysis (indirect)'!A17","v":"object_16"},{"$f":"RANK('similarity analysis (indirect)'!B17,'similarity analysis (indirect)'!B$2:B$17,'similarity analysis (indirect)'!B$19)","v":1},{"$f":"RANK('similarity analysis (indirect)'!C17,'similarity analysis (indirect)'!C$2:C$17,'similarity analysis (indirect)'!C$19)","v":13},{"$f":"RANK('similarity analysis (indirect)'!D17,'similarity analysis (indirect)'!D$2:D$17,'similarity analysis (indirect)'!D$19)","v":2},{"$f":"RANK('similarity analysis (indirect)'!E17,'similarity analysis (indirect)'!E$2:E$17,'similarity analysis (indirect)'!E$19)","v":5},{"$f":"RANK('similarity analysis (indirect)'!F17,'similarity analysis (indirect)'!F$2:F$17,'similarity analysis (indirect)'!F$19)","v":9},{"$f":"RANK('similarity analysis (indirect)'!G17,'similarity analysis (indirect)'!G$2:G$17,'similarity analysis (indirect)'!G$19)","v":11},{"$f":"'similarity analysis (indirect)'!H17","v":1000}]
[]
["max",{"$f":"MAX(B24:B39)","v":15},16,16,15,16,16]
["min",{"$f":"MIN(B24:B39)","v":1},1,1,1,1,1]
[]
[]
["staircase function","id",{"$f":"'similarity analysis (indirect)'!B23","v":"attribute_1"},{"$f":"'similarity analysis (indirect)'!C23","v":"attribute_2"},{"$f":"'similarity analysis (indirect)'!D23","v":"attribute_3"},{"$f":"'similarity analysis (indirect)'!E23","v":"attribute_4"},{"$f":"'similarity analysis (indirect)'!F23","v":"attribute_5"},{"$f":"'similarity analysis (indirect)'!G23","v":"attribute_6"},null,"differences",{"$f":"C45","v":"attribute_1"},"attribute_2","attribute_3","attribute_4","attribute_5","attribute_6"]
["stair level_1 (S1)",1,171.01174854699923,183.3502351000287,193.45693081540782,106.27827460412607,191.22265882577332,201.68006138548367,null,"S1-S2",{"$f":"C46-C47","v":0.99999999984009946},{"$f":"D46-D47","v":1.0000000003391847},{"$f":"E46-E47","v":1.0000000065899997},{"$f":"F46-F47","v":2.9999903088712614},{"$f":"G46-G47","v":0.99999999988082777},{"$f":"H46-H47","v":0.99999999988185095}]
["stair level_2",2,170.01174854715913,182.35023509968951,192.45693080881782,103.27828429525481,190.22265882589249,200.68006138560182,null,"…",0.99999999983850785,1.0000000003431637,1.0000000014512977,1.9999933473822438,0.99999999987949195,1.0000000043402224]
["stair level_3",3,169.01174854732062,181.35023509934635,191.45693080736652,101.27829094787256,189.222658826013,199.68006138126159,null,"…",0.99999999983617727,1.0000000003468585,1.0000000014691466,1.3076438153281487,0.99999999987841193,1.000000004390273]
["stair level_4",4,168.01174854748444,180.35023509899949,190.45693080589737,99.970647132544414,188.22265882613459,198.68006137687132,null,"…",0.99999999983435828,1.0000000003506386,1.0000000014871375,0.99999999649864435,0.99999999987696242,1.0000000044418016]
["stair level_5",5,167.01174854765009,179.35023509864885,189.45693080441023,98.97064713604577,187.22265882625763,197.68006137242952,null,"…",0.99999999983239718,1.0000000003547314,1.0000000015055548,0.99999999645741866,0.9999999998756266,1.0000000044934723]
["stair level_6",6,166.01174854781769,178.35023509829412,188.45693080290468,97.970647139588351,186.222658826382,196.68006136793605,null,"…",0.99999999983040766,1.0000000003589662,1.0000000015238584,0.99999999641519821,0.99999999987443289,1.0000000045468198]
["stair level_7",7,165.01174854798728,177.35023509793515,187.45693080138082,96.970647143173153,185.22265882650757,195.68006136338923,null,"…",0.99999999982799181,1.0000000003630873,1.0000000015428157,0.99999999637267933,0.99999999987289812,1.0000000046003947]
["stair level_8",8,164.01174854815929,176.35023509757207,186.45693079983801,95.970647146800474,184.22265882663467,194.68006135878883,null,"…",0.99999999982605914,1.0000000003672085,1.0000000015623698,0.99999999632929359,0.99999999987127808,1.0000000046555044]
["stair level_9",9,163.01174854833323,175.35023509720486,185.45693079827564,94.97064715047118,183.22265882676339,193.68006135413333,null,"…",0.99999999982372856,1.0000000003716139,1.0000000015819239,0.99999999628501257,0.99999999987014121,1.0000000047110404]
["stair level_10",10,162.0117485485095,174.35023509683325,184.45693079669371,93.970647154186167,182.22265882689325,192.68006134942229,null,"…",0.99999999982162535,1.0000000003758487,1.0000000016020465,0.99999999624002101,0.99999999986863486,1.0000000047682533]
["stair level_11",11,161.01174854868788,173.3502350964574,183.45693079509167,92.970647157946146,181.22265882702462,191.68006134465404,null,"…",0.99999999981918108,1.0000000003805951,1.0000000016227943,0.99999999619437574,0.9999999998669864,1.0000000048258073]
["stair level_12",12,160.0117485488687,172.3502350960768,182.45693079346887,91.970647161751771,180.22265882715763,190.68006133982823,null,"…",0.9999999998168505,1.0000000003849436,1.0000000016434001,0.9999999961477215,0.99999999986556531,1.0000000048849813]
["stair level_13",13,159.01174854905184,171.35023509569186,181.45693079182547,90.970647165604049,179.22265882729207,189.68006133494325,null,"…",0.99999999981466203,1.0000000003896048,1.0000000016646311,1.0000000005333618,0.99999999986391686,1.0000000049449795]
["stair level_14",14,158.01174854923718,170.35023509530225,180.45693079016084,89.970647165070687,178.22265882742815,188.68006132999827,null,"…",0.99999999981233145,1.0000000003943228,1.0000000016862316,1.0000000004449845,0.99999999986260946,1.0000000050061715]
["stair level_15",15,157.01174854942485,169.35023509490793,179.45693078847461,88.970647164625703,177.22265882756554,187.6800613249921,null,"S15-S16",0.99999999980980192,1.0000000003991545,1.0000000017086279,27.780020397438221,0.999999999860961,1.0000000050687845]
["stair level_16 (S16)",16,156.01174854961505,168.35023509450878,178.45693078676598,61.190626767187482,176.22265882770458,186.68006131992331]
[]
[]
[{"$f":"'similarity analysis (indirect)'!A23","v":"OAM"},{"$f":"'similarity analysis (indirect)'!B23","v":"attribute_1"},{"$f":"'similarity analysis (indirect)'!C23","v":"attribute_2"},{"$f":"'similarity analysis (indirect)'!D23","v":"attribute_3"},{"$f":"'similarity analysis (indirect)'!E23","v":"attribute_4"},{"$f":"'similarity analysis (indirect)'!F23","v":"attribute_5"},{"$f":"'similarity analysis (indirect)'!G23","v":"attribute_6"},{"$f":"'similarity analysis (indirect)'!H23","v":"Y0"},"estimation","difference"]
[{"$f":"'similarity analysis (indirect)'!A24","v":"object_1"},{"$f":"VLOOKUP('similarity analysis (indirect)'!B24,'similarity analysis (indirect)'!$B$46:$H$61,'similarity analysis (indirect)'!B$81,0)","v":164.01174854815929},{"$f":"VLOOKUP('similarity analysis (indirect)'!C24,'similarity analysis (indirect)'!$B$46:$H$61,'similarity analysis (indirect)'!C$81,0)","v":169.35023509490793},{"$f":"VLOOKUP('similarity analysis (indirect)'!D24,'similarity analysis (indirect)'!$B$46:$H$61,'similarity analysis (indirect)'!D$81,0)","v":190.45693080589737},{"$f":"VLOOKUP('similarity analysis (indirect)'!E24,'similarity analysis (indirect)'!$B$46:$H$61,'similarity analysis (indirect)'!E$81,0)","v":88.970647164625703},{"$f":"VLOOKUP('similarity analysis (indirect)'!F24,'similarity analysis (indirect)'!$B$46:$H$61,'similarity analysis (indirect)'!F$81,0)","v":187.22265882625763},{"$f":"VLOOKUP('similarity analysis (indirect)'!G24,'similarity analysis (indirect)'!$B$46:$H$61,'similarity analysis (indirect)'!G$81,0)","v":199.68006138126159},{"$f":"'similarity analysis (indirect)'!H24","v":1000},{"$f":"SUM(B65:G65)","v":999.69228182110953},{"$f":"H65-I65","v":0.30771817889046815}]
[{"$f":"'similarity analysis (indirect)'!A25","v":"object_2"},{"$f":"VLOOKUP('similarity analysis (indirect)'!B25,'similarity analysis (indirect)'!$B$46:$H$61,'similarity analysis (indirect)'!B$81,0)","v":170.01174854715913},{"$f":"VLOOKUP('similarity analysis (indirect)'!C25,'similarity analysis (indirect)'!$B$46:$H$61,'similarity analysis (indirect)'!C$81,0)","v":172.3502350960768},{"$f":"VLOOKUP('similarity analysis (indirect)'!D25,'similarity analysis (indirect)'!$B$46:$H$61,'similarity analysis (indirect)'!D$81,0)","v":183.45693079509167},{"$f":"VLOOKUP('similarity analysis (indirect)'!E25,'similarity analysis (indirect)'!$B$46:$H$61,'similarity analysis (indirect)'!E$81,0)","v":93.970647154186167},{"$f":"VLOOKUP('similarity analysis (indirect)'!F25,'similarity analysis (indirect)'!$B$46:$H$61,'similarity analysis (indirect)'!F$81,0)","v":187.22265882625763},{"$f":"VLOOKUP('similarity analysis (indirect)'!G25,'similarity analysis (indirect)'!$B$46:$H$61,'similarity analysis (indirect)'!G$81,0)","v":198.68006137687132},{"$f":"'similarity analysis (indirect)'!H25","v":1000},1005.6922817956428,-5.6922817956427707]
[{"$f":"'similarity analysis (indirect)'!A26","v":"object_3"},{"$f":"VLOOKUP('similarity analysis (indirect)'!B26,'similarity analysis (indirect)'!$B$46:$H$61,'similarity analysis (indirect)'!B$81,0)","v":163.01174854833323},{"$f":"VLOOKUP('similarity analysis (indirect)'!C26,'similarity analysis (indirect)'!$B$46:$H$61,'similarity analysis (indirect)'!C$81,0)","v":168.35023509450878},{"$f":"VLOOKUP('similarity analysis (indirect)'!D26,'similarity analysis (indirect)'!$B$46:$H$61,'similarity analysis (indirect)'!D$81,0)","v":189.45693080441023},{"$f":"VLOOKUP('similarity analysis (indirect)'!E26,'similarity analysis (indirect)'!$B$46:$H$61,'similarity analysis (indirect)'!E$81,0)","v":94.97064715047118},{"$f":"VLOOKUP('similarity analysis (indirect)'!F26,'similarity analysis (indirect)'!$B$46:$H$61,'similarity analysis (indirect)'!F$81,0)","v":183.22265882676339},{"$f":"VLOOKUP('similarity analysis (indirect)'!G26,'similarity analysis (indirect)'!$B$46:$H$61,'similarity analysis (indirect)'!G$81,0)","v":189.68006133494325},{"$f":"'similarity analysis (indirect)'!H26","v":1000},988.69228175943022,11.307718240569784]
[{"$f":"'similarity analysis (indirect)'!A27","v":"object_4"},{"$f":"VLOOKUP('similarity analysis (indirect)'!B27,'similarity analysis (indirect)'!$B$46:$H$61,'similarity analysis (indirect)'!B$81,0)","v":157.01174854942485},{"$f":"VLOOKUP('similarity analysis (indirect)'!C27,'similarity analysis (indirect)'!$B$46:$H$61,'similarity analysis (indirect)'!C$81,0)","v":181.35023509934635},{"$f":"VLOOKUP('similarity analysis (indirect)'!D27,'similarity analysis (indirect)'!$B$46:$H$61,'similarity analysis (indirect)'!D$81,0)","v":178.45693078676598},{"$f":"VLOOKUP('similarity analysis (indirect)'!E27,'similarity analysis (indirect)'!$B$46:$H$61,'similarity analysis (indirect)'!E$81,0)","v":106.27827460412607},{"$f":"VLOOKUP('similarity analysis (indirect)'!F27,'similarity analysis (indirect)'!$B$46:$H$61,'similarity analysis (indirect)'!F$81,0)","v":185.22265882650757},{"$f":"VLOOKUP('similarity analysis (indirect)'!G27,'similarity analysis (indirect)'!$B$46:$H$61,'similarity analysis (indirect)'!G$81,0)","v":191.68006134465404},{"$f":"'similarity analysis (indirect)'!H27","v":1000},999.99990921082485,9.0789175146710477E-5]
[{"$f":"'similarity analysis (indirect)'!A28","v":"object_5"},{"$f":"VLOOKUP('similarity analysis (indirect)'!B28,'similarity analysis (indirect)'!$B$46:$H$61,'similarity analysis (indirect)'!B$81,0)","v":166.01174854781769},{"$f":"VLOOKUP('similarity analysis (indirect)'!C28,'similarity analysis (indirect)'!$B$46:$H$61,'similarity analysis (indirect)'!C$81,0)","v":182.35023509968951},{"$f":"VLOOKUP('similarity analysis (indirect)'!D28,'similarity analysis (indirect)'!$B$46:$H$61,'similarity analysis (indirect)'!D$81,0)","v":186.45693079983801},{"$f":"VLOOKUP('similarity analysis (indirect)'!E28,'similarity analysis (indirect)'!$B$46:$H$61,'similarity analysis (indirect)'!E$81,0)","v":89.970647165070687},{"$f":"VLOOKUP('similarity analysis (indirect)'!F28,'similarity analysis (indirect)'!$B$46:$H$61,'similarity analysis (indirect)'!F$81,0)","v":176.22265882770458},{"$f":"VLOOKUP('similarity analysis (indirect)'!G28,'similarity analysis (indirect)'!$B$46:$H$61,'similarity analysis (indirect)'!G$81,0)","v":188.68006132999827},{"$f":"'similarity analysis (indirect)'!H28","v":1000},989.6922817701186,10.307718229881402]
[{"$f":"'similarity analysis (indirect)'!A29","v":"object_6"},{"$f":"VLOOKUP('similarity analysis (indirect)'!B29,'similarity analysis (indirect)'!$B$46:$H$61,'similarity analysis (indirect)'!B$81,0)","v":158.01174854923718},{"$f":"VLOOKUP('similarity analysis (indirect)'!C29,'similarity analysis (indirect)'!$B$46:$H$61,'similarity analysis (indirect)'!C$81,0)","v":181.35023509934635},{"$f":"VLOOKUP('similarity analysis (indirect)'!D29,'similarity analysis (indirect)'!$B$46:$H$61,'similarity analysis (indirect)'!D$81,0)","v":184.45693079669371},{"$f":"VLOOKUP('similarity analysis (indirect)'!E29,'similarity analysis (indirect)'!$B$46:$H$61,'similarity analysis (indirect)'!E$81,0)","v":90.970647165604049},{"$f":"VLOOKUP('similarity analysis (indirect)'!F29,'similarity analysis (indirect)'!$B$46:$H$61,'similarity analysis (indirect)'!F$81,0)","v":191.22265882577332},{"$f":"VLOOKUP('similarity analysis (indirect)'!G29,'similarity analysis (indirect)'!$B$46:$H$61,'similarity analysis (indirect)'!G$81,0)","v":201.68006138548367},{"$f":"'similarity analysis (indirect)'!H29","v":1000},1007.6922818221383,-7.692281822138284]
[{"$f":"'similarity analysis (indirect)'!A30","v":"object_7"},{"$f":"VLOOKUP('similarity analysis (indirect)'!B30,'similarity analysis (indirect)'!$B$46:$H$61,'similarity analysis (indirect)'!B$81,0)","v":168.01174854748444},{"$f":"VLOOKUP('similarity analysis (indirect)'!C30,'similarity analysis (indirect)'!$B$46:$H$61,'similarity analysis (indirect)'!C$81,0)","v":171.35023509569186},{"$f":"VLOOKUP('similarity analysis (indirect)'!D30,'similarity analysis (indirect)'!$B$46:$H$61,'similarity analysis (indirect)'!D$81,0)","v":185.45693079827564},{"$f":"VLOOKUP('similarity analysis (indirect)'!E30,'similarity analysis (indirect)'!$B$46:$H$61,'similarity analysis (indirect)'!E$81,0)","v":96.970647143173153},{"$f":"VLOOKUP('similarity analysis (indirect)'!F30,'similarity analysis (indirect)'!$B$46:$H$61,'similarity analysis (indirect)'!F$81,0)","v":177.22265882756554},{"$f":"VLOOKUP('similarity analysis (indirect)'!G30,'similarity analysis (indirect)'!$B$46:$H$61,'similarity analysis (indirect)'!G$81,0)","v":193.68006135413333},{"$f":"'similarity analysis (indirect)'!H30","v":1000},992.69228176632396,7.3077182336760416]
[{"$f":"'similarity analysis (indirect)'!A31","v":"object_8"},{"$f":"VLOOKUP('similarity analysis (indirect)'!B31,'similarity analysis (indirect)'!$B$46:$H$61,'similarity analysis (indirect)'!B$81,0)","v":167.01174854765009},{"$f":"VLOOKUP('similarity analysis (indirect)'!C31,'similarity analysis (indirect)'!$B$46:$H$61,'similarity analysis (indirect)'!C$81,0)","v":175.35023509720486},{"$f":"VLOOKUP('similarity analysis (indirect)'!D31,'similarity analysis (indirect)'!$B$46:$H$61,'similarity analysis (indirect)'!D$81,0)","v":193.45693081540782},{"$f":"VLOOKUP('similarity analysis (indirect)'!E31,'similarity analysis (indirect)'!$B$46:$H$61,'similarity analysis (indirect)'!E$81,0)","v":91.970647161751771},{"$f":"VLOOKUP('similarity analysis (indirect)'!F31,'similarity analysis (indirect)'!$B$46:$H$61,'similarity analysis (indirect)'!F$81,0)","v":188.22265882613459},{"$f":"VLOOKUP('similarity analysis (indirect)'!G31,'similarity analysis (indirect)'!$B$46:$H$61,'similarity analysis (indirect)'!G$81,0)","v":200.68006138560182},{"$f":"'similarity analysis (indirect)'!H31","v":1000},1016.6922818337508,-16.692281833750826]
[{"$f":"'similarity analysis (indirect)'!A32","v":"object_9"},{"$f":"VLOOKUP('similarity analysis (indirect)'!B32,'similarity analysis (indirect)'!$B$46:$H$61,'similarity analysis (indirect)'!B$81,0)","v":161.01174854868788},{"$f":"VLOOKUP('similarity analysis (indirect)'!C32,'similarity analysis (indirect)'!$B$46:$H$61,'similarity analysis (indirect)'!C$81,0)","v":177.35023509793515},{"$f":"VLOOKUP('similarity analysis (indirect)'!D32,'similarity analysis (indirect)'!$B$46:$H$61,'similarity analysis (indirect)'!D$81,0)","v":188.45693080290468},{"$f":"VLOOKUP('similarity analysis (indirect)'!E32,'similarity analysis (indirect)'!$B$46:$H$61,'similarity analysis (indirect)'!E$81,0)","v":93.970647154186167},{"$f":"VLOOKUP('similarity analysis (indirect)'!F32,'similarity analysis (indirect)'!$B$46:$H$61,'similarity analysis (indirect)'!F$81,0)","v":183.22265882676339},{"$f":"VLOOKUP('similarity analysis (indirect)'!G32,'similarity analysis (indirect)'!$B$46:$H$61,'similarity analysis (indirect)'!G$81,0)","v":195.68006136338923},{"$f":"'similarity analysis (indirect)'!H32","v":1000},999.69228179386653,0.30771820613347245]
[{"$f":"'similarity analysis (indirect)'!A33","v":"object_10"},{"$f":"VLOOKUP('similarity analysis (indirect)'!B33,'similarity analysis (indirect)'!$B$46:$H$61,'similarity analysis (indirect)'!B$81,0)","v":157.01174854942485},{"$f":"VLOOKUP('similarity analysis (indirect)'!C33,'similarity analysis (indirect)'!$B$46:$H$61,'similarity analysis (indirect)'!C$81,0)","v":173.3502350964574},{"$f":"VLOOKUP('similarity analysis (indirect)'!D33,'similarity analysis (indirect)'!$B$46:$H$61,'similarity analysis (indirect)'!D$81,0)","v":179.45693078847461},{"$f":"VLOOKUP('similarity analysis (indirect)'!E33,'similarity analysis (indirect)'!$B$46:$H$61,'similarity analysis (indirect)'!E$81,0)","v":88.970647164625703},{"$f":"VLOOKUP('similarity analysis (indirect)'!F33,'similarity analysis (indirect)'!$B$46:$H$61,'similarity analysis (indirect)'!F$81,0)","v":179.22265882729207},{"$f":"VLOOKUP('similarity analysis (indirect)'!G33,'similarity analysis (indirect)'!$B$46:$H$61,'similarity analysis (indirect)'!G$81,0)","v":193.68006135413333},{"$f":"'similarity analysis (indirect)'!H33","v":1000},971.69228178040794,28.307718219592061]
[{"$f":"'similarity analysis (indirect)'!A34","v":"object_11"},{"$f":"VLOOKUP('similarity analysis (indirect)'!B34,'similarity analysis (indirect)'!$B$46:$H$61,'similarity analysis (indirect)'!B$81,0)","v":160.0117485488687},{"$f":"VLOOKUP('similarity analysis (indirect)'!C34,'similarity analysis (indirect)'!$B$46:$H$61,'similarity analysis (indirect)'!C$81,0)","v":179.35023509864885},{"$f":"VLOOKUP('similarity analysis (indirect)'!D34,'similarity analysis (indirect)'!$B$46:$H$61,'similarity analysis (indirect)'!D$81,0)","v":180.45693079016084},{"$f":"VLOOKUP('similarity analysis (indirect)'!E34,'similarity analysis (indirect)'!$B$46:$H$61,'similarity analysis (indirect)'!E$81,0)","v":95.970647146800474},{"$f":"VLOOKUP('similarity analysis (indirect)'!F34,'similarity analysis (indirect)'!$B$46:$H$61,'similarity analysis (indirect)'!F$81,0)","v":184.22265882663467},{"$f":"VLOOKUP('similarity analysis (indirect)'!G34,'similarity analysis (indirect)'!$B$46:$H$61,'similarity analysis (indirect)'!G$81,0)","v":187.6800613249921},{"$f":"'similarity analysis (indirect)'!H34","v":1000},987.69228173610554,12.307718263894458]
[{"$f":"'similarity analysis (indirect)'!A35","v":"object_12"},{"$f":"VLOOKUP('similarity analysis (indirect)'!B35,'similarity analysis (indirect)'!$B$46:$H$61,'similarity analysis (indirect)'!B$81,0)","v":169.01174854732062},{"$f":"VLOOKUP('similarity analysis (indirect)'!C35,'similarity analysis (indirect)'!$B$46:$H$61,'similarity analysis (indirect)'!C$81,0)","v":183.3502351000287},{"$f":"VLOOKUP('similarity analysis (indirect)'!D35,'similarity analysis (indirect)'!$B$46:$H$61,'similarity analysis (indirect)'!D$81,0)","v":187.45693080138082},{"$f":"VLOOKUP('similarity analysis (indirect)'!E35,'similarity analysis (indirect)'!$B$46:$H$61,'similarity analysis (indirect)'!E$81,0)","v":99.970647132544414},{"$f":"VLOOKUP('similarity analysis (indirect)'!F35,'similarity analysis (indirect)'!$B$46:$H$61,'similarity analysis (indirect)'!F$81,0)","v":189.222658826013},{"$f":"VLOOKUP('similarity analysis (indirect)'!G35,'similarity analysis (indirect)'!$B$46:$H$61,'similarity analysis (indirect)'!G$81,0)","v":197.68006137242952},{"$f":"'similarity analysis (indirect)'!H35","v":1000},1026.6922817797172,-26.692281779717177]
[{"$f":"'similarity analysis (indirect)'!A36","v":"object_13"},{"$f":"VLOOKUP('similarity analysis (indirect)'!B36,'similarity analysis (indirect)'!$B$46:$H$61,'similarity analysis (indirect)'!B$81,0)","v":165.01174854798728},{"$f":"VLOOKUP('similarity analysis (indirect)'!C36,'similarity analysis (indirect)'!$B$46:$H$61,'similarity analysis (indirect)'!C$81,0)","v":174.35023509683325},{"$f":"VLOOKUP('similarity analysis (indirect)'!D36,'similarity analysis (indirect)'!$B$46:$H$61,'similarity analysis (indirect)'!D$81,0)","v":181.45693079182547},{"$f":"VLOOKUP('similarity analysis (indirect)'!E36,'similarity analysis (indirect)'!$B$46:$H$61,'similarity analysis (indirect)'!E$81,0)","v":98.97064713604577},{"$f":"VLOOKUP('similarity analysis (indirect)'!F36,'similarity analysis (indirect)'!$B$46:$H$61,'similarity analysis (indirect)'!F$81,0)","v":190.22265882589249},{"$f":"VLOOKUP('similarity analysis (indirect)'!G36,'similarity analysis (indirect)'!$B$46:$H$61,'similarity analysis (indirect)'!G$81,0)","v":194.68006135878883},{"$f":"'similarity analysis (indirect)'!H36","v":1000},1004.6922817573731,-4.6922817573730526]
[{"$f":"'similarity analysis (indirect)'!A37","v":"object_14"},{"$f":"VLOOKUP('similarity analysis (indirect)'!B37,'similarity analysis (indirect)'!$B$46:$H$61,'similarity analysis (indirect)'!B$81,0)","v":162.0117485485095},{"$f":"VLOOKUP('similarity analysis (indirect)'!C37,'similarity analysis (indirect)'!$B$46:$H$61,'similarity analysis (indirect)'!C$81,0)","v":178.35023509829412},{"$f":"VLOOKUP('similarity analysis (indirect)'!D37,'similarity analysis (indirect)'!$B$46:$H$61,'similarity analysis (indirect)'!D$81,0)","v":191.45693080736652},{"$f":"VLOOKUP('similarity analysis (indirect)'!E37,'similarity analysis (indirect)'!$B$46:$H$61,'similarity analysis (indirect)'!E$81,0)","v":103.27828429525481},{"$f":"VLOOKUP('similarity analysis (indirect)'!F37,'similarity analysis (indirect)'!$B$46:$H$61,'similarity analysis (indirect)'!F$81,0)","v":178.22265882742815},{"$f":"VLOOKUP('similarity analysis (indirect)'!G37,'similarity analysis (indirect)'!$B$46:$H$61,'similarity analysis (indirect)'!G$81,0)","v":186.68006131992331},{"$f":"'similarity analysis (indirect)'!H37","v":1000},999.99991889677653,8.1103223465106566E-5]
[{"$f":"'similarity analysis (indirect)'!A38","v":"object_15"},{"$f":"VLOOKUP('similarity analysis (indirect)'!B38,'similarity analysis (indirect)'!$B$46:$H$61,'similarity analysis (indirect)'!B$81,0)","v":159.01174854905184},{"$f":"VLOOKUP('similarity analysis (indirect)'!C38,'similarity analysis (indirect)'!$B$46:$H$61,'similarity analysis (indirect)'!C$81,0)","v":176.35023509757207},{"$f":"VLOOKUP('similarity analysis (indirect)'!D38,'similarity analysis (indirect)'!$B$46:$H$61,'similarity analysis (indirect)'!D$81,0)","v":183.45693079509167},{"$f":"VLOOKUP('similarity analysis (indirect)'!E38,'similarity analysis (indirect)'!$B$46:$H$61,'similarity analysis (indirect)'!E$81,0)","v":101.27829094787256},{"$f":"VLOOKUP('similarity analysis (indirect)'!F38,'similarity analysis (indirect)'!$B$46:$H$61,'similarity analysis (indirect)'!F$81,0)","v":183.22265882676339},{"$f":"VLOOKUP('similarity analysis (indirect)'!G38,'similarity analysis (indirect)'!$B$46:$H$61,'similarity analysis (indirect)'!G$81,0)","v":196.68006136793605},{"$f":"'similarity analysis (indirect)'!H38","v":1000},999.99992558428767,7.4415712333575357E-5]
[{"$f":"'similarity analysis (indirect)'!A39","v":"object_16"},{"$f":"VLOOKUP('similarity analysis (indirect)'!B39,'similarity analysis (indirect)'!$B$46:$H$61,'similarity analysis (indirect)'!B$81,0)","v":171.01174854699923},{"$f":"VLOOKUP('similarity analysis (indirect)'!C39,'similarity analysis (indirect)'!$B$46:$H$61,'similarity analysis (indirect)'!C$81,0)","v":171.35023509569186},{"$f":"VLOOKUP('similarity analysis (indirect)'!D39,'similarity analysis (indirect)'!$B$46:$H$61,'similarity analysis (indirect)'!D$81,0)","v":192.45693080881782},{"$f":"VLOOKUP('similarity analysis (indirect)'!E39,'similarity analysis (indirect)'!$B$46:$H$61,'similarity analysis (indirect)'!E$81,0)","v":98.97064713604577},{"$f":"VLOOKUP('similarity analysis (indirect)'!F39,'similarity analysis (indirect)'!$B$46:$H$61,'similarity analysis (indirect)'!F$81,0)","v":183.22265882676339},{"$f":"VLOOKUP('similarity analysis (indirect)'!G39,'similarity analysis (indirect)'!$B$46:$H$61,'similarity analysis (indirect)'!G$81,0)","v":191.68006134465404},{"$f":"'similarity analysis (indirect)'!H39","v":1000},1008.6922817589722,-8.6922817589721717]
["id",2,3,4,5,6,7]
[null,null,null,null,null,null,null,null,"error level",{"$f":"SUMSQ(J65:J80)","v":2420.7692347184661}]

{"sheet":"keystrokemousemacro","index":2,"n_rows":1424,"n_cols":11,"rows_kept":1424,"cut":false,"hidden":false,"merged":[]}
["OAM","attribute1","attribute2","attribute3","y0",null,"original"]
["object1",{"$f":"RANDBETWEEN(50,100)","v":55},{"$f":"RANDBETWEEN(50,100)","v":77},59,1000]
["obejct2",{"$f":"RANDBETWEEN(50,100)","v":61},55,77,1000]
["object3",85,81,87,100]
[]
[]
["OAM","attribute1","attribute2","attribute3","y0",null,"recorded, saved,loaded,played",null,"reduced version","OAM"]
["object1",{"$f":"RANDBETWEEN(50,100)","v":89},{"$f":"RANDBETWEEN(50,100)","v":89},74,1000]
["obejct2",{"$f":"RANDBETWEEN(50,100)","v":100},92,72,1000]
["object3",97,77,70,100]
[]
["**Script version 2.0.2.0**",null,null,null,null,null,"full version",null,"reduced version","**Script version 2.0.2.0**"]
[5,656,null,null,null,null,null,null,null,3,"{Shift}"]
[1,"X:848 Y:469",null,null,null,null,null,null,null,3,"o"]
[1,"X:847 Y:480",null,null,null,null,null,null,null,3,"a"]
[5,16,null,null,null,null,null,null,null,3,"m"]
[1,"X:844 Y:512",null,null,null,null,null,null,null,4,"{Shift}"]
[1,"X:844 Y:524",null,null,null,null,null,null,null,3,"{Enter}"]
[1,"X:840 Y:558"]
[1,"X:836 Y:570"]
[5,16]
[1,"X:833 Y:604"]
[1,"X:832 Y:615"]
[1,"X:826 Y:648"]
[5,15]
[1,"X:825 Y:659"]
[1,"X:819 Y:687"]
[1,"X:817 Y:698"]
[1,"X:812 Y:726"]
[5,16]
[1,"X:811 Y:738"]
[1,"X:803 Y:761"]
[1,"X:802 Y:773"]
[5,15]
[1,"X:795 Y:801"]
[1,"X:794 Y:811"]
[1,"X:786 Y:837"]
[1,"X:785 Y:845"]
[5,16]
[1,"X:778 Y:871"]
[1,"X:776 Y:878"]
[1,"X:773 Y:898"]
[1,"X:771 Y:905"]
[5,16]
[1,"X:769 Y:925"]
[1,"X:768 Y:930"]
[5,15]
[1,"X:767 Y:946"]
[1,"X:767 Y:954"]
[1,"X:766 Y:967"]
[1,"X:763 Y:974"]
[5,16]
[1,"X:762 Y:987"]
[1,"X:762 Y:992"]
[1,"X:761 Y:1003"]
[1,"X:761 Y:1007"]
[5,16]
[1,"X:760 Y:1017"]
[1,"X:759 Y:1020"]
[1,"X:758 Y:1027"]
[5,15]
[1,"X:758 Y:1031"]
[1,"X:757 Y:1034"]
[1,"X:757 Y:1036"]
[5,16]
[1,"X:757 Y:1039"]
[1,"X:756 Y:1040"]
[1,"X:756 Y:1041"]
[1,"X:756 Y:1041"]
[5,15]
[1,"X:756 Y:1042"]
[1,"X:756 Y:1043"]
[1,"X:756 Y:1043"]
[5,16]
[1,"X:754 Y:1046"]
[1,"X:754 Y:1047"]
[1,"X:753 Y:1048"]
[5,16]
[1,"X:752 Y:1050"]
[1,"X:752 Y:1051"]
[1,"X:751 Y:1054"]
[5,15]
[1,"X:751 Y:1055"]
[1,"X:750 Y:1057"]
[1,"X:748 Y:1059"]
[1,"X:747 Y:1060"]
[5,16]
[1,"X:746 Y:1063"]
[1,"X:745 Y:1064"]
[1,"X:744 Y:1065"]
[5,16]
[1,"X:744 Y:1066"]
[1,"X:744 Y:1066"]
[1,"X:743 Y:1067"]
[5,15]
[1,"X:741 Y:1068"]
[1,"X:741 Y:1069"]
[5,16]
[1,"X:740 Y:1069"]
[1,"X:739 Y:1069"]
[5,47]
[1,"X:738 Y:1069"]
[5,15]
[1,"X:737 Y:1069"]
[5,16]
[1,"X:737 Y:1068"]
[1,"X:736 Y:1068"]
[1,"X:736 Y:1067"]
[5,16]
[1,"X:735 Y:1067"]
[1,"X:734 Y:1067"]
[5,15]
[1,"X:733 Y:1067"]
[1,"X:730 Y:1067"]
[1,"X:729 Y:1067"]
[5,16]
[1,"X:727 Y:1067"]
[1,"X:726 Y:1067"]
[5,31]
[1,"X:726 Y:1067"]
[1,"X:726 Y:1066"]
[5,16]
[1,"X:725 Y:1066"]
[1,"X:725 Y:1065"]
[5,15]
[1,"X:725 Y:1065"]
[5,16]
[1,"X:725 Y:1065"]
[5,16]
[1,"X:725 Y:1064"]
[1,"X:725 Y:1064"]
[1,"X:725 Y:1063"]
[1,"X:725 Y:1062"]
[5,203]
[2,"Left Down"]
[5,218]
[2,"Left Up"]
[5,1579]
[1,"X:726 Y:1060"]
[1,"X:729 Y:1059"]
[5,15]
[1,"X:730 Y:1057"]
[1,"X:731 Y:1055"]
[1,"X:734 Y:1053"]
[1,"X:736 Y:1052"]
[5,16]
[1,"X:738 Y:1051"]
[1,"X:739 Y:1049"]
[1,"X:740 Y:1047"]
[5,15]
[1,"X:743 Y:1045"]
[1,"X:743 Y:1044"]
[1,"X:744 Y:1043"]
[1,"X:746 Y:1042"]
[5,16]
[1,"X:748 Y:1040"]
[1,"X:749 Y:1039"]
[1,"X:752 Y:1035"]
[5,16]
[1,"X:753 Y:1035"]
[1,"X:755 Y:1033"]
[1,"X:755 Y:1033"]
[5,15]
[1,"X:757 Y:1030"]
[1,"X:759 Y:1030"]
[1,"X:761 Y:1028"]
[1,"X:762 Y:1027"]
[5,16]
[1,"X:763 Y:1026"]
[1,"X:764 Y:1025"]
[1,"X:766 Y:1024"]
[5,16]
[1,"X:768 Y:1023"]
[1,"X:769 Y:1023"]
[1,"X:770 Y:1022"]
[5,15]
[1,"X:770 Y:1020"]
[5,16]
[1,"X:770 Y:1020"]
[5,78]
[1,"X:770 Y:1020"]
[5,16]
[1,"X:770 Y:1020"]
[1,"X:770 Y:1021"]
[1,"X:770 Y:1021"]
[5,16]
[1,"X:769 Y:1021"]
[5,15]
[1,"X:769 Y:1021"]
[1,"X:769 Y:1022"]
[5,16]
[1,"X:767 Y:1022"]
[1,"X:766 Y:1022"]
[1,"X:766 Y:1022"]
[1,"X:763 Y:1022"]
[5,16]
[1,"X:762 Y:1022"]
[1,"X:757 Y:1023"]
[1,"X:755 Y:1023"]
[5,15]
[1,"X:749 Y:1023"]
[1,"X:747 Y:1023"]
[1,"X:737 Y:1023"]
[1,"X:734 Y:1023"]
[5,16]
[1,"X:723 Y:1023"]
[1,"X:718 Y:1023"]
[1,"X:704 Y:1023"]
[5,16]
[1,"X:698 Y:1022"]
[1,"X:680 Y:1018"]
[1,"X:675 Y:1018"]
[5,15]
[1,"X:659 Y:1014"]
[1,"X:652 Y:1013"]
[1,"X:636 Y:1009"]
[1,"X:627 Y:1005"]
[5,16]
[1,"X:611 Y:1001"]
[1,"X:604 Y:999"]
[1,"X:588 Y:994"]
[1,"X:582 Y:991"]
[5,15]
[1,"X:564 Y:985"]
[1,"X:557 Y:983"]
[1,"X:537 Y:974"]
[5,16]
[1,"X:532 Y:972"]
[1,"X:514 Y:963"]
[1,"X:507 Y:961"]
[5,16]
[1,"X:490 Y:954"]
[1,"X:481 Y:949"]
[1,"X:464 Y:940"]
[1,"X:455 Y:935"]
[5,15]
[1,"X:440 Y:927"]
[1,"X:433 Y:922"]
[1,"X:414 Y:908"]
[1,"X:407 Y:904"]
[5,16]
[1,"X:389 Y:891"]
[1,"X:382 Y:887"]
[1,"X:365 Y:874"]
[5,16]
[1,"X:358 Y:870"]
[1,"X:344 Y:857"]
[1,"X:338 Y:853"]
[5,15]
[1,"X:326 Y:841"]
[1,"X:319 Y:837"]
[1,"X:310 Y:827"]
[1,"X:306 Y:824"]
[5,16]
[1,"X:295 Y:813"]
[1,"X:293 Y:810"]
[1,"X:284 Y:803"]
[5,15]
[1,"X:282 Y:801"]
[1,"X:275 Y:795"]
[1,"X:273 Y:793"]
[5,16]
[1,"X:268 Y:788"]
[1,"X:266 Y:786"]
[1,"X:262 Y:782"]
[1,"X:262 Y:781"]
[5,16]
[1,"X:259 Y:779"]
[1,"X:258 Y:778"]
[1,"X:255 Y:777"]
[5,15]
[1,"X:254 Y:775"]
[1,"X:252 Y:773"]
[1,"X:252 Y:773"]
[5,16]
[1,"X:251 Y:772"]
[1,"X:250 Y:772"]
[1,"X:250 Y:771"]
[1,"X:249 Y:771"]
[5,16]
[1,"X:247 Y:771"]
[5,31]
[1,"X:249 Y:771"]
[1,"X:250 Y:771"]
[5,203]
[1,"X:241 Y:769"]
[1,"X:237 Y:769"]
[5,16]
[1,"X:225 Y:766"]
[1,"X:219 Y:765"]
[1,"X:205 Y:758"]
[1,"X:199 Y:756"]
[5,15]
[1,"X:184 Y:751"]
[1,"X:177 Y:746"]
[1,"X:164 Y:741"]
[5,16]
[1,"X:160 Y:740"]
[1,"X:148 Y:733"]
[1,"X:143 Y:731"]
[1,"X:138 Y:729"]
[5,15]
[1,"X:134 Y:728"]
[1,"X:129 Y:727"]
[1,"X:126 Y:726"]
[5,16]
[1,"X:121 Y:723"]
[1,"X:119 Y:723"]
[1,"X:114 Y:722"]
[1,"X:114 Y:721"]
[5,16]
[1,"X:111 Y:721"]
[1,"X:111 Y:721"]
[1,"X:110 Y:720"]
[1,"X:109 Y:720"]
[5,62]
[1,"X:109 Y:720"]
[5,110]
[1,"X:109 Y:720"]
[5,15]
[1,"X:109 Y:720"]
[5,16]
[1,"X:109 Y:721"]
[5,15]
[1,"X:110 Y:721"]
[5,172]
[2,"Left Down"]
[5,203]
[2,"Left Up"]
[5,766]
[3,"{Shift}"]
[5,187]
[3,"o"]
[5,78]
[4,"o"]
[5,78]
[3,"a"]
[5,172]
[3,"m"]
[5,32]
[4,"a"]
[5,62]
[4,"m"]
[5,141]
[4,"{Shift}"]
[5,2282]
[3,"{Esc}"]
[5,140]
[4,"{Esc}"]
[5,985]
[3,"{Down}"]
[5,187]
[4,"{Down}"]
[5,344]
[3,"{Up}"]
[5,140]
[4,"{Up}"]
[5,1407]
[3,"{Shift}"]
[5,140]
[3,"o"]
[5,94]
[4,"o"]
[5,31]
[3,"a"]
[5,172]
[3,"m"]
[5,16]
[4,"a"]
[5,47]
[4,"m"]
[5,62]
[4,"{Shift}"]
[5,891]
[3,"{Enter}"]
[5,94]
[4,"{Enter}"]
[5,812]
[3,"o"]
[5,63]
[4,"o"]
[5,203]
[3,"b"]
[5,62]
[4,"b"]
[5,172]
[3,"j"]
[5,94]
[3,"e"]
[5,15]
[4,"j"]
[5,94]
[4,"e"]
[5,141]
[3,"c"]
[5,125]
[4,"c"]
[5,203]
[3,"t"]
[5,62]
[4,"t"]
[5,782]
[3,1]
[5,78]
[4,1]
[5,953]
[3,"{Enter}"]
[5,141]
[4,"{Enter}"]
[5,859]
[3,"o"]
[5,78]
[4,"o"]
[5,2094]
[3,"{Right}"]
[5,187]
[4,"{Right}"]
[5,2000]
[3,"{Left}"]
[5,141]
[4,"{Left}"]
[5,781]
[3,"o"]
[5,62]
[4,"o"]
[5,172]
[3,"b"]
[5,94]
[4,"b"]
[5,62]
[3,"e"]
[5,94]
[3,"j"]
[4,"e"]
[5,94]
[4,"j"]
[5,78]
[3,"c"]
[5,125]
[4,"c"]
[5,78]
[3,"t"]
[5,78]
[4,"t"]
[5,703]
[3,2]
[5,79]
[4,2]
[5,578]
[3,"{Enter}"]
[5,110]
[4,"{Enter}"]
[5,609]
[3,"o"]
[5,78]
[4,"o"]
[5,172]
[3,"b"]
[5,78]
[4,"b"]
[5,328]
[3,"j"]
[5,78]
[4,"j"]
[5,32]
[3,"e"]
[5,78]
[4,"e"]
[5,140]
[3,"c"]
[5,110]
[4,"c"]
[5,62]
[3,"t"]
[5,78]
[4,"t"]
[5,782]
[3,3]
[5,78]
[4,3]
[5,719]
[3,"{Enter}"]
[5,93]
[4,"{Enter}"]
[5,500]
[3,"{Up}"]
[5,110]
[4,"{Up}"]
[5,78]
[3,"{Up}"]
[5,78]
[4,"{Up}"]
[5,78]
[3,"{Up}"]
[5,78]
[4,"{Up}"]
[5,78]
[3,"{Up}"]
[5,94]
[4,"{Up}"]
[5,813]
[3,"{Right}"]
[5,110]
[4,"{Right}"]
[5,421]
[3,"a"]
[5,94]
[4,"a"]
[5,281]
[3,"t"]
[5,78]
[4,"t"]
[5,47]
[3,"t"]
[5,109]
[3,"r"]
[5,47]
[4,"t"]
[5,78]
[3,"i"]
[4,"r"]
[5,63]
[4,"i"]
[5,125]
[3,"b"]
[5,93]
[4,"b"]
[5,47]
[3,"u"]
[5,94]
[4,"u"]
[5,31]
[3,"t"]
[5,109]
[3,"e"]
[5,63]
[4,"t"]
[5,93]
[4,"e"]
[5,625]
[3,1]
[5,79]
[4,1]
[5,234]
[3,"{Enter}"]
[5,94]
[4,"{Enter}"]
[5,297]
[3,"{Up}"]
[5,109]
[4,"{Up}"]
[5,125]
[3,"{Right}"]
[5,125]
[4,"{Right}"]
[5,328]
[3,"a"]
[5,109]
[4,"a"]
[5,219]
[3,"t"]
[5,78]
[4,"t"]
[5,47]
[3,"t"]
[5,94]
[3,"r"]
[5,47]
[4,"t"]
[5,62]
[3,"i"]
[4,"r"]
[5,78]
[4,"i"]
[5,110]
[3,"b"]
[5,109]
[3,"u"]
[5,63]
[4,"b"]
[5,31]
[4,"u"]
[5,15]
[3,"t"]
[5,125]
[3,"e"]
[5,63]
[4,"t"]
[5,78]
[4,"e"]
[5,640]
[3,2]
[5,94]
[4,2]
[5,391]
[3,"{Enter}"]
[5,109]
[4,"{Enter}"]
[5,360]
[3,"{Up}"]
[5,78]
[4,"{Up}"]
[5,140]
[3,"{Right}"]
[5,125]
[4,"{Right}"]
[5,625]
[3,"a"]
[5,94]
[4,"a"]
[5,234]
[3,"t"]
[5,63]
[4,"t"]
[5,62]
[3,"t"]
[5,94]
[3,"r"]
[5,78]
[4,"t"]
[5,47]
[3,"i"]
[5,16]
[4,"r"]
[5,62]
[4,"i"]
[5,110]
[3,"b"]
[5,109]
[3,"u"]
[5,63]
[4,"b"]
[5,46]
[4,"u"]
[5,47]
[3,"t"]
[5,110]
[3,"e"]
[5,47]
[4,"t"]
[5,78]
[4,"e"]
[5,782]
[3,3]
[5,93]
[4,3]
[5,328]
[3,"{Enter}"]
[5,125]
[4,"{Enter}"]
[5,1297]
[3,"{Up}"]
[5,94]
[4,"{Up}"]
[5,172]
[3,"{Right}"]
[5,125]
[4,"{Right}"]
[5,641]
[3,"y"]
[5,78]
[4,"y"]
[5,312]
[3,0]
[5,78]
[4,0]
[5,594]
[3,"{Enter}"]
[5,109]
[4,"{Enter}"]
[5,594]
[3,"{Left}"]
[5,78]
[4,"{Left}"]
[5,547]
[3,"{Right}"]
[5,78]
[4,"{Right}"]
[5,407]
[3,1]
[5,78]
[4,1]
[5,125]
[3,0]
[5,93]
[4,0]
[5,110]
[3,0]
[5,78]
[4,0]
[5,93]
[3,0]
[5,94]
[4,0]
[5,781]
[3,"{Enter}"]
[5,94]
[4,"{Enter}"]
[5,375]
[3,1]
[5,94]
[4,1]
[5,156]
[3,0]
[5,94]
[4,0]
[5,109]
[3,0]
[5,78]
[4,0]
[5,94]
[3,0]
[5,78]
[4,0]
[5,125]
[3,"{Enter}"]
[5,110]
[4,"{Enter}"]
[5,156]
[3,1]
[5,79]
[4,1]
[5,141]
[3,0]
[5,78]
[4,0]
[5,125]
[3,0]
[5,94]
[4,0]
[5,187]
[3,"{Enter}"]
[5,110]
[4,"{Enter}"]
[5,703]
[3,"{Up}"]
[5,93]
[4,"{Up}"]
[5,94]
[3,"{Up}"]
[5,94]
[4,"{Up}"]
[5,94]
[3,"{Up}"]
[5,109]
[4,"{Up}"]
[5,141]
[3,"{Left}"]
[5,93]
[4,"{Left}"]
[5,94]
[3,"{Left}"]
[5,110]
[4,"{Left}"]
[5,109]
[3,"{Left}"]
[5,94]
[4,"{Left}"]
[5,1375]
[3,"{Shift}"]
[5,140]
[3,7]
[5,78]
[4,7]
[5,32]
[4,"{Shift}"]
[5,640]
[3,"v"]
[5,125]
[4,"v"]
[5,78]
[3,";"]
[5,172]
[3,"l"]
[5,32]
[4,";"]
[5,78]
[4,"l"]
[5,140]
[3,"e"]
[5,141]
[4,"e"]
[5,47]
[3,"t"]
[5,94]
[4,"t"]
[5,31]
[3,"l"]
[5,94]
[4,"l"]
[3,"e"]
[5,125]
[4,"e"]
[5,62]
[3,"n"]
[5,78]
[4,"n"]
[5,391]
[3,"."]
[5,78]
[4,"."]
[5,187]
[3,"k"]
[5,78]
[4,"k"]
[5,94]
[3,"`"]
[5,125]
[4,"`"]
[5,16]
[3,"z"]
[5,93]
[3,"`"]
[5,16]
[4,"z"]
[5,78]
[4,"`"]
[3,"t"]
[5,109]
[4,"t"]
[5,47]
[3,"t"]
[5,110]
[4,"t"]
[5,437]
[3,"{Shift}"]
[5,188]
[3,8]
[5,78]
[4,8]
[5,31]
[4,"{Shift}"]
[5,703]
[3,5]
[5,63]
[3,0]
[5,15]
[4,5]
[5,78]
[4,0]
[5,516]
[3,"{Ctrl}"]
[3,"{Alt}"]
[5,78]
[3,","]
[5,63]
[4,"{Ctrl}"]
[4,"{Alt}"]
[5,47]
[4,","]
[5,140]
[3,1]
[5,140]
[3,0]
[5,47]
[4,1]
[5,62]
[4,0]
[5,63]
[3,0]
[5,109]
[4,0]
[5,312]
[3,"{Shift}"]
[5,297]
[3,9]
[5,78]
[4,9]
[5,16]
[4,"{Shift}"]
[5,328]
[3,"{Enter}"]
[5,78]
[4,"{Enter}"]
[5,438]
[3,"{Up}"]
[5,110]
[4,"{Up}"]
[5,1594]
[3,"{Ctrl}"]
[5,234]
[3,"c"]
[5,94]
[4,"c"]
[5,93]
[4,"{Ctrl}"]
[5,485]
[3,"{Shift}"]
[5,187]
[3,"{Right}"]
[5,125]
[4,"{Right}"]
[5,94]
[3,"{Right}"]
[5,94]
[4,"{Right}"]
[5,78]
[3,"{Right}"]
[5,94]
[4,"{Right}"]
[5,343]
[3,"{Left}"]
[5,109]
[4,"{Left}"]
[5,235]
[3,"{Down}"]
[5,94]
[4,"{Down}"]
[5,171]
[3,"{Down}"]
[5,94]
[4,"{Down}"]
[5,156]
[4,"{Shift}"]
[5,109]
[3,"{Enter}"]
[5,94]
[4,"{Enter}"]
[5,1125]
[3,"{Up}"]
[5,109]
[4,"{Up}"]
[5,172]
[3,"{Left}"]
[5,78]
[4,"{Left}"]
[5,1015]
[1,"X:134 Y:728"]
[5,16]
[1,"X:147 Y:732"]
[1,"X:188 Y:749"]
[1,"X:201 Y:757"]
[1,"X:240 Y:779"]
[5,16]
[1,"X:254 Y:789"]
[1,"X:294 Y:815"]
[1,"X:310 Y:826"]
[5,15]
[1,"X:362 Y:861"]
[1,"X:379 Y:873"]
[1,"X:425 Y:908"]
[1,"X:438 Y:917"]
[5,16]
[1,"X:474 Y:945"]
[1,"X:486 Y:955"]
[1,"X:509 Y:973"]
[5,16]
[1,"X:519 Y:979"]
[1,"X:542 Y:996"]
[1,"X:548 Y:1002"]
[1,"X:562 Y:1010"]
[5,15]
[1,"X:567 Y:1014"]
[1,"X:573 Y:1018"]
[1,"X:575 Y:1019"]
[5,16]
[1,"X:577 Y:1019"]
[1,"X:578 Y:1019"]
[5,15]
[1,"X:578 Y:1019"]
[1,"X:578 Y:1019"]
[5,188]
[1,"X:587 Y:1022"]
[1,"X:591 Y:1024"]
[1,"X:606 Y:1031"]
[1,"X:613 Y:1032"]
[5,16]
[1,"X:626 Y:1036"]
[1,"X:631 Y:1037"]
[1,"X:643 Y:1039"]
[1,"X:648 Y:1042"]
[5,15]
[1,"X:656 Y:1043"]
[1,"X:660 Y:1043"]
[1,"X:666 Y:1044"]
[5,16]
[1,"X:670 Y:1044"]
[1,"X:671 Y:1044"]
[1,"X:673 Y:1044"]
[5,15]
[1,"X:674 Y:1044"]
[1,"X:674 Y:1044"]
[5,32]
[1,"X:674 Y:1044"]
[1,"X:674 Y:1044"]
[1,"X:673 Y:1044"]
[1,"X:672 Y:1044"]
[5,16]
[1,"X:671 Y:1045"]
[1,"X:666 Y:1046"]
[1,"X:665 Y:1046"]
[5,16]
[1,"X:657 Y:1047"]
[1,"X:654 Y:1047"]
[1,"X:645 Y:1047"]
[5,15]
[1,"X:641 Y:1047"]
[1,"X:630 Y:1047"]
[1,"X:623 Y:1047"]
[5,16]
[1,"X:610 Y:1048"]
[1,"X:605 Y:1048"]
[1,"X:596 Y:1048"]
[1,"X:589 Y:1048"]
[5,15]
[1,"X:581 Y:1048"]
[1,"X:578 Y:1048"]
[1,"X:568 Y:1048"]
[5,16]
[1,"X:565 Y:1048"]
[1,"X:555 Y:1048"]
[1,"X:550 Y:1048"]
[1,"X:544 Y:1048"]
[1,"X:540 Y:1049"]
[5,16]
[1,"X:535 Y:1049"]
[1,"X:531 Y:1049"]
[5,15]
[1,"X:526 Y:1050"]
[1,"X:524 Y:1052"]
[1,"X:516 Y:1052"]
[1,"X:511 Y:1053"]
[5,16]
[1,"X:505 Y:1053"]
[1,"X:500 Y:1053"]
[1,"X:493 Y:1053"]
[5,16]
[1,"X:490 Y:1053"]
[1,"X:485 Y:1053"]
[1,"X:481 Y:1053"]
[5,15]
[1,"X:476 Y:1053"]
[1,"X:475 Y:1053"]
[1,"X:469 Y:1053"]
[1,"X:466 Y:1053"]
[5,16]
[1,"X:461 Y:1051"]
[1,"X:459 Y:1051"]
[1,"X:455 Y:1050"]
[5,15]
[1,"X:452 Y:1050"]
[1,"X:450 Y:1049"]
[1,"X:448 Y:1048"]
[1,"X:444 Y:1048"]
[1,"X:442 Y:1047"]
[5,16]
[1,"X:439 Y:1047"]
[1,"X:438 Y:1047"]
[5,16]
[1,"X:434 Y:1046"]
[1,"X:432 Y:1046"]
[1,"X:430 Y:1046"]
[1,"X:427 Y:1045"]
[5,15]
[1,"X:423 Y:1045"]
[1,"X:421 Y:1045"]
[1,"X:416 Y:1045"]
[1,"X:414 Y:1044"]
[5,16]
[1,"X:408 Y:1044"]
[1,"X:406 Y:1044"]
[1,"X:401 Y:1042"]
[5,16]
[1,"X:398 Y:1042"]
[1,"X:393 Y:1041"]
[1,"X:392 Y:1040"]
[5,15]
[1,"X:387 Y:1040"]
[1,"X:385 Y:1039"]
[1,"X:379 Y:1039"]
[5,16]
[1,"X:377 Y:1038"]
[1,"X:375 Y:1038"]
[1,"X:373 Y:1038"]
[1,"X:370 Y:1038"]
[5,15]
[1,"X:368 Y:1038"]
[1,"X:366 Y:1038"]
[1,"X:365 Y:1038"]
[5,16]
[1,"X:362 Y:1038"]
[1,"X:361 Y:1038"]
[1,"X:360 Y:1038"]
[1,"X:358 Y:1038"]
[5,16]
[1,"X:356 Y:1038"]
[1,"X:354 Y:1039"]
[1,"X:353 Y:1039"]
[5,15]
[1,"X:353 Y:1039"]
[1,"X:352 Y:1039"]
[5,16]
[1,"X:351 Y:1039"]
[5,31]
[1,"X:351 Y:1040"]
[5,16]
[1,"X:350 Y:1040"]
[1,"X:350 Y:1042"]
[5,15]
[1,"X:350 Y:1042"]
[1,"X:350 Y:1043"]
[1,"X:347 Y:1045"]
[1,"X:347 Y:1045"]
[5,16]
[1,"X:347 Y:1046"]
[1,"X:347 Y:1047"]
[1,"X:346 Y:1047"]
[1,"X:345 Y:1047"]
[5,16]
[1,"X:345 Y:1049"]
[5,15]
[1,"X:345 Y:1050"]
[5,78]
[1,"X:345 Y:1050"]
[5,79]
[1,"X:345 Y:1050"]
[5,15]
[1,"X:346 Y:1050"]
[5,16]
[1,"X:346 Y:1050"]
[5,15]
[1,"X:347 Y:1050"]
[1,"X:349 Y:1050"]
[1,"X:349 Y:1050"]
[5,16]
[1,"X:352 Y:1050"]
[1,"X:352 Y:1050"]
[1,"X:355 Y:1051"]
[1,"X:357 Y:1051"]
[5,16]
[1,"X:362 Y:1052"]
[1,"X:364 Y:1053"]
[1,"X:370 Y:1054"]
[5,15]
[1,"X:372 Y:1055"]
[1,"X:379 Y:1056"]
[1,"X:382 Y:1058"]
[5,16]
[1,"X:389 Y:1059"]
[1,"X:392 Y:1060"]
[1,"X:401 Y:1061"]
[1,"X:403 Y:1061"]
[5,16]
[1,"X:409 Y:1061"]
[1,"X:412 Y:1061"]
[1,"X:418 Y:1061"]
[5,15]
[1,"X:420 Y:1061"]
[1,"X:425 Y:1061"]
[1,"X:427 Y:1061"]
[5,16]
[1,"X:430 Y:1061"]
[1,"X:432 Y:1061"]
[1,"X:438 Y:1061"]
[1,"X:441 Y:1061"]
[5,15]
[1,"X:447 Y:1061"]
[1,"X:449 Y:1061"]
[1,"X:457 Y:1061"]
[5,16]
[1,"X:459 Y:1061"]
[1,"X:465 Y:1061"]
[1,"X:468 Y:1061"]
[1,"X:475 Y:1062"]
[5,16]
[1,"X:477 Y:1062"]
[1,"X:483 Y:1064"]
[1,"X:486 Y:1064"]
[5,15]
[1,"X:491 Y:1065"]
[1,"X:493 Y:1065"]
[1,"X:498 Y:1065"]
[1,"X:500 Y:1067"]
[5,16]
[1,"X:505 Y:1068"]
[1,"X:506 Y:1068"]
[1,"X:511 Y:1068"]
[5,16]
[1,"X:513 Y:1068"]
[1,"X:515 Y:1068"]
[1,"X:517 Y:1068"]
[5,15]
[1,"X:520 Y:1068"]
[1,"X:522 Y:1068"]
[1,"X:525 Y:1068"]
[1,"X:526 Y:1068"]
[5,16]
[1,"X:530 Y:1068"]
[1,"X:532 Y:1068"]
[1,"X:537 Y:1068"]
[1,"X:538 Y:1068"]
[5,15]
[1,"X:543 Y:1068"]
[1,"X:545 Y:1068"]
[1,"X:552 Y:1068"]
[5,16]
[1,"X:555 Y:1068"]
[1,"X:563 Y:1068"]
[1,"X:566 Y:1068"]
[5,16]
[1,"X:576 Y:1068"]
[1,"X:580 Y:1068"]
[1,"X:588 Y:1068"]
[1,"X:592 Y:1068"]
[5,15]
[1,"X:602 Y:1069"]
[1,"X:607 Y:1069"]
[1,"X:620 Y:1069"]
[5,16]
[1,"X:623 Y:1069"]
[1,"X:635 Y:1070"]
[1,"X:641 Y:1070"]
[5,16]
[1,"X:654 Y:1070"]
[1,"X:657 Y:1070"]
[1,"X:669 Y:1070"]
[1,"X:674 Y:1070"]
[5,15]
[1,"X:688 Y:1072"]
[1,"X:693 Y:1072"]
[1,"X:707 Y:1072"]
[1,"X:714 Y:1072"]
[5,16]
[1,"X:725 Y:1072"]
[1,"X:730 Y:1072"]
[1,"X:741 Y:1073"]
[5,15]
[1,"X:748 Y:1073"]
[1,"X:761 Y:1073"]
[1,"X:766 Y:1073"]
[5,16]
[1,"X:777 Y:1073"]
[1,"X:782 Y:1073"]
[1,"X:793 Y:1073"]
[1,"X:796 Y:1073"]
[5,16]
[1,"X:804 Y:1074"]
[1,"X:806 Y:1074"]
[1,"X:813 Y:1075"]
[5,15]
[1,"X:814 Y:1075"]
[1,"X:817 Y:1075"]
[1,"X:818 Y:1075"]
[5,16]
[1,"X:820 Y:1075"]
[1,"X:821 Y:1075"]
[1,"X:821 Y:1075"]
[5,16]
[1,"X:821 Y:1075"]
[1,"X:819 Y:1074"]
[5,156]
[1,"X:825 Y:1073"]
[1,"X:854 Y:1073"]
[5,15]
[1,"X:865 Y:1072"]
[1,"X:894 Y:1070"]
[1,"X:905 Y:1070"]
[5,16]
[1,"X:930 Y:1069"]
[1,"X:940 Y:1069"]
[1,"X:967 Y:1067"]
[1,"X:975 Y:1067"]
[5,16]
[1,"X:999 Y:1067"]
[1,"X:1007 Y:1067"]
[1,"X:1024 Y:1067"]
[1,"X:1031 Y:1067"]
[5,15]
[1,"X:1045 Y:1067"]
[1,"X:1050 Y:1067"]
[1,"X:1063 Y:1067"]
[5,16]
[1,"X:1068 Y:1066"]
[1,"X:1076 Y:1066"]
[1,"X:1080 Y:1065"]
[5,16]
[1,"X:1085 Y:1065"]
[1,"X:1087 Y:1064"]
[1,"X:1090 Y:1064"]
[1,"X:1092 Y:1064"]
[5,15]
[1,"X:1092 Y:1064"]
[1,"X:1093 Y:1064"]
[5,94]
[1,"X:1094 Y:1064"]
[5,16]
[1,"X:1094 Y:1063"]
[5,47]
[1,"X:1094 Y:1063"]
[1,"X:1094 Y:1063"]
[5,15]
[1,"X:1095 Y:1063"]
[5,157]
[2,"Left Down"]
[5,218]
[2,"Left Up"]
[5,328]
[1,"X:1095 Y:1058"]
[1,"X:1091 Y:1023"]
[1,"X:1090 Y:1011"]
[1,"X:1084 Y:962"]
[1,"X:1080 Y:947"]
[5,16]
[1,"X:1072 Y:893"]
[1,"X:1069 Y:872"]
[5,15]
[1,"X:1055 Y:807"]
[1,"X:1052 Y:791"]
[1,"X:1041 Y:742"]
[1,"X:1037 Y:726"]
[5,16]
[1,"X:1028 Y:686"]
[1,"X:1022 Y:671"]
[1,"X:1014 Y:636"]
[5,16]
[1,"X:1008 Y:622"]
[1,"X:1000 Y:594"]
[1,"X:997 Y:584"]
[1,"X:989 Y:567"]
[5,15]
[1,"X:986 Y:560"]
[1,"X:980 Y:548"]
[1,"X:978 Y:542"]
[5,16]
[1,"X:972 Y:537"]
[1,"X:969 Y:532"]
[1,"X:963 Y:529"]
[1,"X:961 Y:526"]
[5,15]
[1,"X:955 Y:522"]
[1,"X:952 Y:520"]
[1,"X:943 Y:517"]
[5,16]
[1,"X:940 Y:515"]
[1,"X:931 Y:511"]
[1,"X:927 Y:509"]
[5,16]
[1,"X:919 Y:505"]
[1,"X:915 Y:504"]
[1,"X:906 Y:499"]
[1,"X:902 Y:497"]
[5,15]
[1,"X:892 Y:492"]
[1,"X:890 Y:489"]
[1,"X:884 Y:483"]
[1,"X:881 Y:481"]
[5,16]
[1,"X:878 Y:476"]
[1,"X:876 Y:475"]
[1,"X:874 Y:468"]
[5,16]
[1,"X:872 Y:467"]
[1,"X:871 Y:463"]
[1,"X:871 Y:460"]
[5,15]
[1,"X:871 Y:457"]
[1,"X:871 Y:455"]
[1,"X:872 Y:448"]
[1,"X:872 Y:445"]
[5,16]
[1,"X:877 Y:437"]
[1,"X:878 Y:433"]
[1,"X:886 Y:424"]
[1,"X:888 Y:422"]
[5,15]
[1,"X:892 Y:417"]
[1,"X:894 Y:415"]
[5,16]
[1,"X:900 Y:412"]
[1,"X:902 Y:411"]
[1,"X:908 Y:408"]
[1,"X:910 Y:407"]
[1,"X:916 Y:407"]
[5,16]
[1,"X:918 Y:407"]
[5,218]
[1,"X:917 Y:407"]
[5,32]
[1,"X:912 Y:407"]
[1,"X:910 Y:407"]
[5,15]
[1,"X:904 Y:409"]
[1,"X:902 Y:410"]
[1,"X:899 Y:412"]
[1,"X:896 Y:412"]
[5,16]
[1,"X:893 Y:416"]
[1,"X:891 Y:417"]
[1,"X:887 Y:420"]
[1,"X:887 Y:422"]
[5,16]
[1,"X:884 Y:425"]
[1,"X:883 Y:426"]
[5,15]
[1,"X:880 Y:427"]
[1,"X:880 Y:428"]
[1,"X:879 Y:429"]
[1,"X:879 Y:430"]
[5,16]
[1,"X:878 Y:431"]
[1,"X:878 Y:432"]
[5,109]
[1,"X:878 Y:433"]
[5,16]
[1,"X:878 Y:433"]
[1,"X:878 Y:433"]
[5,15]
[1,"X:877 Y:435"]
[5,16]
[1,"X:876 Y:437"]
[1,"X:875 Y:439"]
[1,"X:875 Y:440"]
[5,16]
[1,"X:874 Y:441"]
[1,"X:874 Y:442"]
[1,"X:872 Y:443"]
[5,15]
[1,"X:872 Y:443"]
[1,"X:870 Y:443"]
[1,"X:869 Y:444"]
[5,219]
[2,"Left Down"]
[5,219]
[2,"Left Up"]

{"sheet":"recorded macros basic pattern","index":3,"n_rows":17,"n_cols":8,"rows_kept":17,"cut":false,"hidden":false,"merged":[]}
["OAM","attribute1","attribute2","attribute3","attribute4","attribute5","attribute6","Y0"]
["object1",{"$f":"RANDBETWEEN(50,100)","v":71},{"$f":"RANDBETWEEN(50,100)","v":95},55,80,77,88,1000]
["object2",{"$f":"RANDBETWEEN(50,100)","v":88},57,57,55,98,94,1000]
["object3",92,57,79,78,65,50,1000]
["object4",76,77,75,82,90,94,1000]
["object5",79,91,78,76,55,68,1000]
["object6",55,83,63,73,60,71,1000]
["object7",63,77,68,72,80,96,1000]
["object8",71,97,51,51,98,51,1000]
["object9",84,61,74,63,77,58,1000]
["object10",59,66,55,62,99,53,1000]
["object11",66,85,94,60,65,61,1000]
["object12",82,63,100,75,68,79,1000]
["object13",86,84,50,62,96,76,1000]
["object14",84,73,53,64,67,62,1000]
["object15",70,79,65,54,78,99,1000]
["object16",84,89,65,69,56,76,1000]

{"sheet":"recorded macro replayed version","index":4,"n_rows":36,"n_cols":10,"rows_kept":36,"cut":false,"hidden":false,"merged":[]}
["OAM","attribute1","attribute2","attribute3","attribute4","attribute5","attribute6","Y0",null,"CTRL+Q"]
["object1",{"$f":"RANDBETWEEN(50,100)","v":92},{"$f":"RANDBETWEEN(50,100)","v":96},72,71,77,95,1000,null,"Sub Makró1()"]
["object2",{"$f":"RANDBETWEEN(50,100)","v":99},73,70,76,61,93,1000,null,"'"]
["object3",84,60,66,84,69,79,1000,null,"' Makró1 Makró"]
["object4",56,66,97,91,96,91,1000,null,"'"]
["object5",61,74,51,88,73,69,1000,null,"' Billentyűparancs: Ctrl+q"]
["object6",56,55,77,51,91,77,1000,null,"'"]
["object7",51,72,65,70,83,61,1000,null,"    ActiveCell.FormulaR1C1 = \"OAM\""]
["object8",84,92,69,63,82,80,1000,null,"    Range(\"A2\").Select"]
["object9",68,96,68,69,74,58,1000,null,"    ActiveCell.FormulaR1C1 = \"object1\""]
["object10",72,53,86,81,80,52,1000,null,"    Range(\"A2\").Select"]
["object11",94,53,50,71,53,63,1000,null,"    Selection.AutoFill Destination:=Range(\"A2:A17\"), Type:=xlFillDefault"]
["object12",70,64,86,50,76,97,1000,null,"    Range(\"A2:A17\").Select"]
["object13",82,81,99,97,52,64,1000,null,"    Range(\"B1\").Select"]
["object14",96,86,52,56,72,61,1000,null,"    ActiveCell.FormulaR1C1 = \"attribute1\""]
["object15",91,69,54,54,79,90,1000,null,"    Range(\"B1\").Select"]
["object16",91,93,83,65,62,94,1000,null,"    Selection.AutoFill Destination:=Range(\"B1:G1\"), Type:=xlFillDefault"]
[null,null,null,null,null,null,null,null,null,"    Range(\"B1:G1\").Select"]
[null,null,null,null,null,null,null,null,null,"    Range(\"H1\").Select"]
[null,null,null,null,null,null,null,null,null,"    ActiveCell.FormulaR1C1 = \"Y0\""]
[null,null,null,null,null,null,null,null,null,"    Range(\"H2\").Select"]
[null,null,null,null,null,null,null,null,null,"    ActiveCell.FormulaR1C1 = \"1000\""]
[null,null,null,null,null,null,null,null,null,"    Range(\"H2\").Select"]
[null,null,null,null,null,null,null,null,null,"    Selection.AutoFill Destination:=Range(\"H2:H17\")"]
[null,null,null,null,null,null,null,null,null,"    Range(\"H2:H17\").Select"]
[null,null,null,null,null,null,null,null,null,"    Cells.Select"]
[null,null,null,null,null,null,null,null,null,"    Cells.EntireColumn.AutoFit"]
[null,null,null,null,null,null,null,null,null,"    Range(\"B2\").Select"]
[null,null,null,null,null,null,null,null,null,"    ActiveCell.FormulaR1C1 = \"=RANDBETWEEN(50,100)\""]
[null,null,null,null,null,null,null,null,null,"    Range(\"B2\").Select"]
[null,null,null,null,null,null,null,null,null,"    Selection.Copy"]
[null,null,null,null,null,null,null,null,null,"    Range(\"B2:G17\").Select"]
[null,null,null,null,null,null,null,null,null,"    ActiveSheet.Paste"]
[null,null,null,null,null,null,null,null,null,"    Application.CutCopyMode = False"]
[null,null,null,null,null,null,null,null,null,"    Range(\"A1\").Select"]
[null,null,null,null,null,null,null,null,null,"End Sub"]

{"sheet":"macro-writing","index":5,"n_rows":31,"n_cols":11,"rows_kept":31,"cut":false,"hidden":false,"merged":[]}
["OAM","attribute1","attribute2","attribute3","attribute4","attribute5","attribute6","Y0",null,null,"Sub Makró2()"]
["object1",{"$f":"RANDBETWEEN(50,100)","v":86},50,54,74,59,71,1000]
["object2",97,59,63,68,53,78,1000,null,null,"' Billentyűparancs: Ctrl+e"]
["object3",68,99,65,92,87,60,1000]
["object4",81,75,77,99,79,84,1000,null,null,"Sheets(\"macro-writing\").Cells(1, 1) = \"OAM\""]
["object5",51,56,82,78,59,83,1000]
["object6",72,69,96,79,90,88,1000,null,null,"For i = 1 To 16"]
["object7",74,52,81,90,62,75,1000,null,null,"Sheets(\"macro-writing\").Cells(i + 1, 1) = \"object\" & i"]
["object8",84,64,97,79,100,95,1000,null,null,"Next i"]
["object9",67,89,50,85,57,80,1000]
["object10",50,84,50,72,77,86,1000,null,null,"For i = 1 To 6"]
["object11",{"$f":"RANDBETWEEN(50,100)","v":99},54,63,96,88,82,1000,null,null,"Sheets(\"macro-writing\").Cells(1, i + 1) = \"attribute\" & i"]
["object12",99,98,71,69,86,71,1000,null,null,"Next i"]
["object13",63,89,95,51,50,89,1000]
["object14",51,76,94,99,56,68,1000,null,null,"Sheets(\"macro-writing\").Cells(1, 8) = \"Y0\""]
["object15",77,77,63,89,88,80,1000]
["object16",72,56,60,59,74,54,1000,null,null,"For i = 1 To 16"]
[null,null,null,null,null,null,null,null,null,null,"Sheets(\"macro-writing\").Cells(i + 1, 8) = 1000"]
[null,null,null,null,null,null,null,null,null,null,"Next i"]
[]
[null,null,null,null,null,null,null,null,null,null,"For i = 1 To 16"]
[null,null,null,null,null,null,null,null,null,null,"For j = 1 To 6"]
[null,null,null,null,null,null,null,null,null,null,"Sheets(\"macro-writing\").Cells(i + 1, j + 1).Formula = \"=RANDBETWEEN(50,100)\""]
[null,null,null,null,null,null,null,null,null,null,"Next j"]
[]
[null,null,null,null,null,null,null,null,null,null,"Rem Calculate"]
[]
[null,null,null,null,null,null,null,null,null,null,"Next i"]
[]
[]
[null,null,null,null,null,null,null,null,null,null,"End Sub"]

{"sheet":"info","index":6,"n_rows":9,"n_cols":5,"rows_kept":9,"cut":false,"hidden":false,"merged":[]}
["Sheets","Content",null,"Literature"]
["similarity analysis (*)","relevant analytical steps - hand-made",null,"keyloggers","https://www.raymond.cc/blog/free-and-simple-keylogger-to-monitor-keystrokes-in-windows/"]
["keystrokemousemacro","hand-made activities can also be recorded and replayed (without using Excel-Macros)",null,null,"https://www.comparitech.com/blog/vpn-privacy/what-is-keylogger/"]
["recorded macros (*)","hand-made pattern and replayed version within Excel",null,null,"https://softwarerecs.stackexchange.com/questions/14490/whats-a-good-keystroke-macro-recorder-and-replayer-on-windows"]
["macro-writing","cell-oriented macro - hand-made",null,null,"https://nemex-studios.com/software/Mouse%20Recorder%20Pro%202%202.0.7.6/download"]
["coco","macro-driven similarity analysis including relativized solver calls",null,"Recommenations"]
[null,"https://www.youtube.com/watch?v=cIQnLJt6SnM",null,"google spreadsheets+online-solver","https://docs.google.com/spreadsheets/d/1sEbStn1MlsfE4dlu5JOPPkZKKAALPZT6TQH-wtycKU4/edit#gid=0"]
[null,"https://stackoverflow.com/questions/40679036/set-cell-in-solver-vba-by-changing-more-than-one-cell"]
["coco_online","Connections between the standard LP-inputs and the ranked OAM"]

{"sheet":"coco","index":7,"n_rows":126,"n_cols":10,"rows_kept":126,"cut":false,"hidden":false,"merged":[]}
["number of objects",16,15,"<--test data"]
["number of attributes",6,5]
["raw OAM","attribute_1","attribute_2","attribute_3","attribute_4","attribute_5","attribute_6","Y0"]
["object_1",76,92,72,95,78,57,1000]
["object_2",100,85,91,82,78,72,1000]
["object_3",79,99,74,78,87,88,1000]
["object_4",93,56,99,50,82,87,1000]
["object_5",68,100,83,93,50,90,1000]
["object_6",91,56,90,90,53,100,1000]
["object_7",50,91,84,73,99,85,1000]
["object_8",64,74,50,87,74,100,1000]
["object_9",86,64,76,82,87,78,1000]
["object_10",93,83,98,95,88,85,1000]
["object_11",87,57,95,75,85,93,1000]
["object_12",100,54,77,69,62,73,1000]
["object_13",75,81,93,70,59,79,1000]
["object_14",85,58,61,50,95,96,1000]
["object_15",88,66,91,58,87,75,1000]
["object_16",53,91,58,70,87,87,1000]
["direction",0,0,0,0,0]
["direction",0,0,0,0,0,0]
["meaning","the more a(i) the more Y","the more a(i) the more Y","the more a(i) the more Y","the more a(i) the more Y","the more a(i) the more Y","the more a(i) the more Y","constant value"]
[]
[]
[]
[]
[]
[]
[]
["ranked OAM","attribute_1","attribute_2","attribute_3","attribute_4","attribute_5","attribute_6",{"$f":"H3","v":"Y0"}]
["object_1",{"$f":"RANK(B4,B$4:B$19,B$21)","v":11},3,13,1,10,16,{"$f":"H4","v":1000}]
["object_2",1,6,5,6,10,15,1000]
["object_3",10,2,12,8,4,6,1000]
["object_4",3,14,1,15,9,7,1000]
["object_5",13,1,9,3,16,5,1000]
["object_6",5,14,7,4,15,1,1000]
["object_7",16,4,8,10,1,9,1000]
["object_8",14,9,16,5,12,1,1000]
["object_9",8,11,11,6,4,12,1000]
["object_10",3,7,2,1,3,9,1000]
["object_11",{"$f":"RANK(B14,B$4:B$19,B$21)","v":7},13,3,9,8,4,1000]
["object_12",1,16,10,13,13,14,1000]
["object_13",12,8,4,11,14,11,1000]
["object_14",9,12,14,15,2,3,1000]
["object_15",6,10,5,14,4,13,1000]
["object_16",15,4,15,11,4,7,1000]
[]
[]
[]
[]
[]
[]
[]
[]
[]
["stairs","attribute_1","attribute_2","attribute_3","attribute_4","attribute_5","attribute_6"]
[1,162.27567649882215,146.43493042808464,151.23041581175764,294.05905542605706,165.93104424558823,156.98270515555566]
[2,152.19006116264077,140.57793125364324,147.83059608293848,293.05905542604972,164.9310442455949,154.43883842731651]
[3,148.16142329024424,139.5779312536587,146.8305960829411,292.05905542604211,163.93104424559516,152.98273759673918]
[4,147.16142329026292,138.57793125367445,145.8305960829436,291.05905542603455,162.93104424560417,143.58279102354481]
[5,146.16142329028185,135.48353727884017,144.83059608294622,290.0590554260271,161.93104424561335,142.58279102354751]
[6,145.16142329030112,130.03509153422581,143.83059608294892,289.05905542601937,160.93104424562247,141.58279102355203]
[7,144.16142329032058,129.03509153422203,142.83059608295162,288.0590554260117,159.93104424563197,140.58279102355655]
[8,143.16142329034031,128.03509153421808,141.83059608295434,287.05905542600402,158.93104424564152,139.58279102356099]
[9,142.16142329036029,127.03509153421422,140.83059608295707,286.05905542599612,157.93104424565104,138.58279102356573]
[10,141.16142329038055,126.03509153421024,139.83059608295994,285.05905542598822,156.93104424566076,137.58279102357037]
[11,140.16142329040119,125.03509153420623,138.83059608296281,284.05905542598038,155.93104424567068,136.58279102357517]
[12,139.16142329042196,124.03509153420212,137.83059608296571,283.05905542597236,154.93104424568074,135.58279102358]
[13,138.16142329044317,123.03509153486702,136.83059608296864,282.05905542596429,153.9310442456908,134.5827910235848]
[14,137.16142329046468,122.03509153486809,135.83059608297171,281.05905542595633,152.93104424570114,133.58279102358981]
[15,136.16142329048648,121.03509153486915,134.83059608297464,280.05905542594809,140.93109383458665,125.1541552587943]
[16,130.01847143162223,120.03509153487028,133.83059608297779,0,139.93109383459048,124.15415525878764]
[null,2,3,4,5,6,7]
[]
[]
[]
[]
[]
[]
[]
[]
["differences of stairs","attribute_1","attribute_2","attribute_3","attribute_4","attribute_5","attribute_6"]
["s1- s2",{"$f":"B57-B58","v":10.085615336181377},5.8569991744413983,3.3998197288191534,1.0000000000073328,0.9999999999933209,2.5438667282391521]
["s2- s3",4.0286378723965299,0.99999999998453859,0.9999999999973852,1.000000000007617,0.9999999999997442,1.4561008305773271]
["s3- s4",0.99999999998132694,0.99999999998425437,0.99999999999749889,1.0000000000075602,0.99999999999099032,9.3999465731943701]
["s4- s5",0.99999999998107114,3.0943939748342757,0.9999999999973852,1.0000000000074465,0.99999999999081979,0.99999999999729994]
["s5- s6",0.99999999998073008,5.4484457446143608,0.99999999999729994,1.0000000000077307,0.99999999999087663,0.99999999999548095]
["s6- s7",0.99999999998053113,1.0000000000037801,0.99999999999729994,1.0000000000076739,0.99999999999050715,0.99999999999548095]
["s7- s8",0.99999999998027533,1.0000000000039506,0.99999999999727152,1.0000000000076739,0.99999999999045031,0.99999999999556621]
["s8- s9",0.99999999998001954,1.0000000000038654,0.99999999999727152,1.0000000000079012,0.99999999999047873,0.99999999999525357]
["s9- s10",0.99999999997973532,1.000000000003979,0.99999999999712941,1.0000000000079012,0.99999999999027978,0.99999999999536726]
["s10- s11",0.99999999997936584,1.0000000000040075,0.99999999999712941,1.0000000000078444,0.99999999999008082,0.99999999999519673]
["s11- s12",0.99999999997922373,1.0000000000041069,0.99999999999710099,1.0000000000080149,0.99999999998993871,0.99999999999516831]
["s12- s13",0.9999999999787974,0.99999999933510253,0.99999999999707256,1.0000000000080718,0.99999999998993871,0.99999999999519673]
["s13- s14",0.99999999997848477,0.99999999999893419,0.99999999999693046,1.0000000000079581,0.9999999999896545,0.99999999999499778]
["s14- s15",0.99999999997820055,0.99999999999893419,0.99999999999707256,1.0000000000082423,11.999950411114497,8.4286357647955015]
["s15- s16",6.1429518588642509,0.99999999999887734,0.99999999999684519,280.05905542594809,0.99999999999616307,1.0000000000066649]
[]
[]
[]
[]
[]
[]
[]
[]
[]
[]
["estimations","attribute_1","attribute_2","attribute_3","attribute_4","attribute_5","attribute_6","Y0","sum","difference"]
[1,{"$f":"VLOOKUP(B31,$A$57:$G$72,B$73,0)","v":140.16142329040119},139.5779312536587,136.83059608296864,294.05905542605706,156.93104424566076,124.15415525878764,1000,{"$f":"SUM(B109:G109)","v":991.714205557534},{"$f":"I109-H109","v":-8.2857944424659991}]
[2,162.27567649882215,130.03509153422581,144.83059608294622,289.05905542601937,156.93104424566076,125.1541552587943,1000,1008.2856190464687,8.2856190464686961]
[3,141.16142329038055,140.57793125364324,137.83059608296571,287.05905542600402,162.93104424560417,141.58279102355203,1000,1011.1428413221497,11.142841322149707]
[4,148.16142329024424,122.03509153486809,151.23041581175764,280.05905542594809,157.93104424565104,140.58279102355655,1000,999.99982133202559,-1.7866797441001836E-4]
[5,138.16142329044317,146.43493042808464,140.83059608295707,292.05905542604211,139.93109383459048,142.58279102354751,1000,999.9998900856649,-1.0991433509843773E-4]
[6,146.16142329028185,122.03509153486809,142.83059608295162,291.05905542603455,140.93109383458665,156.98270515555566,1000,999.99996532427838,-3.4675721622079436E-5]
[7,130.01847143162223,138.57793125367445,141.83059608295434,285.05905542598822,165.93104424558823,138.58279102356573,1000,999.99988946339317,-1.1053660682591726E-4]
[8,137.16142329046468,127.03509153421422,133.83059608297779,290.0590554260271,154.93104424568074,156.98270515555566,1000,999.99991573492025,-8.4265079749457072E-5]
[9,143.16142329034031,125.03509153420623,138.83059608296281,289.05905542601937,162.93104424560417,135.58279102358,1000,994.60000160271284,-5.3999983972871632]
[10,148.16142329024424,129.03509153422203,147.83059608293848,294.05905542605706,163.93104424559516,138.58279102356573,1000,1021.6000016026226,21.600001602622569]
[11,{"$f":"VLOOKUP(B41,$A$57:$G$72,B$73,0)","v":144.16142329032058},123.03509153486702,146.8305960829411,286.05905542599612,158.93104424564152,143.58279102354481,1000,1002.6000016033111,2.6000016033110569]
[12,162.27567649882215,120.03509153487028,139.83059608295994,282.05905542596429,153.9310442456908,133.58279102358981,1000,991.71425481189726,-8.2857451881027373]
[13,139.16142329042196,128.03509153421808,145.8305960829436,284.05905542598038,152.93104424570114,136.58279102357517,1000,986.60000160284039,-13.399998397159607]
[14,142.16142329036029,124.03509153420212,135.83059608297171,280.05905542594809,164.9310442455949,152.98273759673918,1000,999.99994817581626,-5.182418374261033E-5]
[15,145.16142329030112,126.03509153421024,144.83059608294622,281.05905542595633,162.93104424560417,134.5827910235848,1000,994.60000160260302,-5.3999983973969847]
[16,136.16142329048648,138.57793125367445,134.83059608297464,284.05905542598038,162.93104424560417,140.58279102355655,1000,997.14284132227669,-2.8571586777233051]
[null,null,null,null,null,null,null,null,null,"error"]
[null,null,null,null,null,null,null,null,null,{"$f":"SUMPRODUCT(J109:J124,J109:J124)","v":1049.4857143526715}]

{"sheet":"coco_online","index":8,"n_rows":111,"n_cols":15,"rows_kept":111,"cut":false,"hidden":false,"merged":[]}
[null,null,null,null,"https://miau.my-x.hu/myx-free/coco/beker_y0.php",null,null,null,null,null,null,null,null,null,"/* Objective function */"]
[null,null,null,null,null,null,null,null,null,null,null,null,null,null,"min:  -2 X1S1# -1 X2S1# -1 X3S1# -2 X4S1# -1 X5S1# -2 X6S1# -0 X1S2# -1 X2S2# -1 X3S2# -0 X4S2# -1 X5S2# -0 X6S2# -2 X1S3# -1 X2S3# -1 X3S3# -1 X4S3# -1 X5S3# -1 X6S3# -0 X1S4# -2 X2S4# -1 X3S4# -1 X4S4# -4 X5S4# -1 X6S4# -1 X1S5# -0 X2S5# -2 X3S5# -1 X4S5# -0 X5S5# -1 X6S5# -1 X1S6# -1 X2S6# -0 X3S6# -2 X4S6# -0 X5S6# -1 X6S6# -1 X1S7# -1 X2S7# -1 X3S7# -0 X4S7# -0 X5S7# -2 X6S7# -1 X1S8# -1 X2S8# -1 X3S8# -1 X4S8# -1 X5S8# -0 X6S8# -1 X1S9# -1 X2S9# -1 X3S9# -1 X4S9# -1 X5S9# -2 X6S9# -1 X1S10# -1 X2S10# -1 X3S10# -1 X4S10# -2 X5S10# -0 X6S10# -1 X1S11# -1 X2S11# -1 X3S11# -2 X4S11# -0 X5S11# -1 X6S11# -1 X1S12# -1 X2S12# -1 X3S12# -0 X4S12# -1 X5S12# -1 X6S12# -1 X1S13# -1 X2S13# -1 X3S13# -1 X4S13# -1 X5S13# -1 X6S13# -1 X1S14# -2 X2S14# -1 X3S14# -1 X4S14# -1 X5S14# -1 X6S14# -1 X1S15# -0 X2S15# -1 X3S15# -2 X4S15# -1 X5S15# -1 X6S15# -1 X1S16# -1 X2S16# -1 X3S16# -0 X4S16# -1 X5S16# -1 X6S16# + 1000 + 1000 + 1000 + 1000 + 1000 + 1000 + 1000 + 1000 + 1000 + 1000 + 1000 + 1000 + 1000 + 1000 + 1000 + 1000;"]
[null,null,null,null,null,null,null,null,null,null,null,null,null,null,"/* Standard constraints */"]
[null,null,null,null,null,null,null,null,null,null,null,null,null,null," +X1S1# -X1S2# >=1;"]
["Azonos�t�:",1358899,"Objektumok:",16,"Attrib�tumok:",6,"Lepcs�k:",16,"Eltol�s:",0,"Le�r�s:","COCO Y0: 1358899",null,null," +X2S1# -X2S2# >=1;"]
[null,null,null,null,null,null,null,null,null,null,null,null,null,null," +X3S1# -X3S2# >=1;"]
["Rangsor","X(A1)","X(A2)","X(A3)","X(A4)","X(A5)","X(A6)","Y(A7)",null,null,null,null,null,null," +X4S1# -X4S2# >=1;"]
["O1",11,3,13,1,10,16,1000,null,null,null,null,null,null," +X5S1# -X5S2# >=1;"]
["O2",1,6,5,6,10,15,1000,null,null,null,null,null,null," +X6S1# -X6S2# >=1;"]
["O3",10,2,12,8,4,6,1000,null,null,null,null,null,null," +X1S2# -X1S3# >=1;"]
["O4",3,14,1,15,9,7,1000,null,null,null,null,null,null," +X2S2# -X2S3# >=1;"]
["O5",13,1,9,3,16,5,1000,null,null,null,null,null,null," +X3S2# -X3S3# >=1;"]
["O6",5,14,7,4,15,1,1000,null,null,null,null,null,null," +X4S2# -X4S3# >=1;"]
["O7",16,4,8,10,1,9,1000,null,null,null,null,null,null," +X5S2# -X5S3# >=1;"]
["O8",14,9,16,5,12,1,1000,null,null,null,null,null,null," +X6S2# -X6S3# >=1;"]
["O9",8,11,11,6,4,12,1000,null,null,null,null,null,null," +X1S3# -X1S4# >=1;"]
["O10",3,7,2,1,3,9,1000,null,null,null,null,null,null," +X2S3# -X2S4# >=1;"]
["O11",7,13,3,9,8,4,1000,null,null,null,null,null,null," +X3S3# -X3S4# >=1;"]
["O12",1,16,10,13,13,14,1000,null,null,null,null,null,null," +X4S3# -X4S4# >=1;"]
["O13",12,8,4,11,14,11,1000,null,null,null,null,null,null," +X5S3# -X5S4# >=1;"]
["O14",9,12,14,15,2,3,1000,null,null,null,null,null,null," +X6S3# -X6S4# >=1;"]
["O15",6,10,5,14,4,13,1000,null,null,null,null,null,null," +X1S4# -X1S5# >=1;"]
["O16",15,4,15,11,4,7,1000,null,null,null,null,null,null," +X2S4# -X2S5# >=1;"]
[null,null,null,null,null,null,null,null,null,null,null,null,null,null," +X3S4# -X3S5# >=1;"]
["L�pcs�k(1)","X(A1)","X(A2)","X(A3)","X(A4)","X(A5)","X(A6)",null,null,null,null,null,null,null," +X4S4# -X4S5# >=1;"]
["S1","(33.1+496.8)/(2)=264.95","(32.1+246.4)/(2)=139.25","(39.1+240.4)/(2)=139.75","(15+38.1)/(2)=26.55","(951.5+484.8)/(2)=718.15","(47.1+271.4)/(2)=159.25",null,null,null,null,null,null,null," +X5S4# -X5S5# >=1;"]
["S2","(14+480.8)/(2)=247.4","(31.1+245.4)/(2)=138.2","(14+239.4)/(2)=126.7","(14+37.1)/(2)=25.55","(950.5+483.8)/(2)=717.15","(46.1+38.1)/(2)=42.05",null,null,null,null,null,null,null," +X6S4# -X6S5# >=1;"]
["S3","(13+479.8)/(2)=246.4","(30+244.4)/(2)=137.2","(13+238.4)/(2)=125.7","(13+36.1)/(2)=24.55","(943.5+251.4)/(2)=597.45","(37.1+37.1)/(2)=37.05",null,null,null,null,null,null,null," +X1S5# -X1S6# >=1;"]
["S4","(12+478.8)/(2)=245.4","(29+243.4)/(2)=136.2","(12+237.4)/(2)=124.7","(12+23)/(2)=17.55","(942.5+250.4)/(2)=596.45","(31.1+36.1)/(2)=33.55",null,null,null,null,null,null,null," +X2S5# -X2S6# >=1;"]
["S5","(11+477.8)/(2)=244.4","(28+242.4)/(2)=135.2","(11+228.4)/(2)=119.7","(11+22)/(2)=16.55","(941.5+249.4)/(2)=595.45","(27+35.1)/(2)=31.05",null,null,null,null,null,null,null," +X3S5# -X3S6# >=1;"]
["S6","(10+476.8)/(2)=243.4","(10+10)/(2)=10","(10+227.4)/(2)=118.7","(10+21)/(2)=15.55","(940.5+248.4)/(2)=594.45","(10+34.1)/(2)=22.05",null,null,null,null,null,null,null," +X4S5# -X4S6# >=1;"]
["S7","(9+475.8)/(2)=242.4","(9+9)/(2)=9","(9+226.4)/(2)=117.7","(9+20)/(2)=14.5","(939.5+247.4)/(2)=593.45","(9+33.1)/(2)=21.05",null,null,null,null,null,null,null," +X5S5# -X5S6# >=1;"]
["S8","(8+474.8)/(2)=241.4","(8+8)/(2)=8","(8+225.4)/(2)=116.7","(8+19)/(2)=13.5","(938.5+246.4)/(2)=592.45","(8+32.1)/(2)=20.05",null,null,null,null,null,null,null," +X6S5# -X6S6# >=1;"]
["S9","(7+473.8)/(2)=240.4","(7+7)/(2)=7","(7+224.4)/(2)=115.7","(7+18)/(2)=12.5","(937.5+245.4)/(2)=591.45","(7+31.1)/(2)=19.05",null,null,null,null,null,null,null," +X1S6# -X1S7# >=1;"]
["S10","(6+472.8)/(2)=239.4","(6+6)/(2)=6","(6+223.4)/(2)=114.7","(6+17)/(2)=11.5","(936.5+244.4)/(2)=590.45","(6+30)/(2)=18.05",null,null,null,null,null,null,null," +X2S6# -X2S7# >=1;"]
["S11","(5+471.8)/(2)=238.4","(5+5)/(2)=5","(5+222.4)/(2)=113.7","(5+16)/(2)=10.5","(935.5+243.4)/(2)=589.45","(5+29)/(2)=17.05",null,null,null,null,null,null,null," +X3S6# -X3S7# >=1;"]
["S12","(4+470.8)/(2)=237.4","(4+4)/(2)=4","(4+4)/(2)=4","(4+15)/(2)=9.5","(934.5+242.4)/(2)=588.45","(4+28)/(2)=16.05",null,null,null,null,null,null,null," +X4S6# -X4S7# >=1;"]
["S13","(3+459.7)/(2)=231.4","(3+3)/(2)=3","(3+3)/(2)=3","(3+14)/(2)=8.5","(933.5+241.4)/(2)=587.45","(3+27)/(2)=15",null,null,null,null,null,null,null," +X5S6# -X5S7# >=1;"]
["S14","(2+458.7)/(2)=230.35","(2+2)/(2)=2","(2+2)/(2)=2","(2+13)/(2)=7.5","(932.5+240.4)/(2)=586.45","(2+26)/(2)=14",null,null,null,null,null,null,null," +X6S6# -X6S7# >=1;"]
["S15","(1+457.7)/(2)=229.35","(1+1)/(2)=1","(1+1)/(2)=1","(1+1)/(2)=1","(920.5+1)/(2)=460.75","(1+1)/(2)=1",null,null,null,null,null,null,null," +X1S7# -X1S8# >=1;"]
["S16","(0+0)/(2)=0","(0+0)/(2)=0","(0+0)/(2)=0","(0+0)/(2)=0","(919.5+0)/(2)=459.75","(0+0)/(2)=0",null,null,null,null,null,null,null," +X2S7# -X2S8# >=1;"]
[null,null,null,null,null,null,null,null,null,null,null,null,null,null," +X3S7# -X3S8# >=1;"]
["L�pcs�k(2)","X(A1)","X(A2)","X(A3)","X(A4)","X(A5)","X(A6)",null,null,null,null,null,null,null," +X4S7# -X4S8# >=1;"]
["S1",264.89999999999998,139.19999999999999,139.69999999999999,26.5,718.2,159.30000000000001,null,null,null,null,null,null,null," +X5S7# -X5S8# >=1;"]
["S2",247.4,138.19999999999999,126.7,25.5,717.2,42.1,null,null,null,null,null,null,null," +X6S7# -X6S8# >=1;"]
["S3",246.4,137.19999999999999,125.7,24.5,597.5,37.1,null,null,null,null,null,null,null," +X1S8# -X1S9# >=1;"]
["S4",245.4,136.19999999999999,124.7,17.5,596.5,33.6,null,null,null,null,null,null,null," +X2S8# -X2S9# >=1;"]
["S5",244.4,135.19999999999999,119.7,16.5,595.5,31.1,null,null,null,null,null,null,null," +X3S8# -X3S9# >=1;"]
["S6",243.4,10,118.7,15.5,594.5,22,null,null,null,null,null,null,null," +X4S8# -X4S9# >=1;"]
["S7",242.4,9,117.7,14.5,593.5,21,null,null,null,null,null,null,null," +X5S8# -X5S9# >=1;"]
["S8",241.4,8,116.7,13.5,592.5,20,null,null,null,null,null,null,null," +X6S8# -X6S9# >=1;"]
["S9",240.4,7,115.7,12.5,591.5,19,null,null,null,null,null,null,null," +X1S9# -X1S10# >=1;"]
["S10",239.4,6,114.7,11.5,590.5,18,null,null,null,null,null,null,null," +X2S9# -X2S10# >=1;"]
["S11",238.4,5,113.7,10.5,589.5,17,null,null,null,null,null,null,null," +X3S9# -X3S10# >=1;"]
["S12",237.4,4,4,9.5,588.5,16,null,null,null,null,null,null,null," +X4S9# -X4S10# >=1;"]
["S13",231.4,3,3,8.5,587.5,15,null,null,null,null,null,null,null," +X5S9# -X5S10# >=1;"]
["S14",230.4,2,2,7.5,586.5,14,null,null,null,null,null,null,null," +X6S9# -X6S10# >=1;"]
["S15",229.4,1,1,1,460.7,1,null,null,null,null,null,null,null," +X1S10# -X1S11# >=1;"]
["S16",0,0,0,0,459.7,0,null,null,null,null,null,null,null," +X2S10# -X2S11# >=1;"]
[null,null,null,null,null,null,null,null,null,null,null,null,null,null," +X3S10# -X3S11# >=1;"]
["COCO:Y0","X(A1)","X(A2)","X(A3)","X(A4)","X(A5)","X(A6)","Becsl�s","T�ny+0","Delta","Delta/T�ny",null,null,null," +X4S10# -X4S11# >=1;"]
["O1",238.4,137.19999999999999,3,26.5,590.5,0,995.6,1000,4.4000000000000004,0.44,null,null,null," +X5S10# -X5S11# >=1;"]
["O2",264.89999999999998,10,119.7,15.5,590.5,1,1001.6,1000,-1.6,-0.16,null,null,null," +X6S10# -X6S11# >=1;"]
["O3",239.4,138.19999999999999,4,13.5,596.5,22,1013.6,1000,-13.6,-1.36,null,null,null," +X1S11# -X1S12# >=1;"]
["O4",246.4,2,139.69999999999999,1,591.5,21,1001.6,1000,-1.6,-0.16,null,null,null," +X2S11# -X2S12# >=1;"]
["O5",231.4,139.19999999999999,115.7,24.5,459.7,31.1,1001.6,1000,-1.6,-0.16,null,null,null," +X3S11# -X3S12# >=1;"]
["O6",244.4,2,117.7,17.5,460.7,159.30000000000001,1001.6,1000,-1.6,-0.16,null,null,null," +X4S11# -X4S12# >=1;"]
["O7",0,136.19999999999999,116.7,11.5,718.2,19,1001.6,1000,-1.6,-0.16,null,null,null," +X5S11# -X5S12# >=1;"]
["O8",230.4,7,0,16.5,588.5,159.30000000000001,1001.6,1000,-1.6,-0.16,null,null,null," +X6S11# -X6S12# >=1;"]
["O9",241.4,5,113.7,15.5,596.5,16,988.1,1000,11.9,1.19,null,null,null," +X1S12# -X1S13# >=1;"]
["O10",246.4,9,126.7,26.5,597.5,19,1025.2,1000,-25.2,-2.52,null,null,null," +X2S12# -X2S13# >=1;"]
["O11",242.4,3,125.7,12.5,592.5,33.6,1009.6,1000,-9.6,-0.96,null,null,null," +X3S12# -X3S13# >=1;"]
["O12",264.89999999999998,0,114.7,8.5,587.5,14,989.6,1000,10.4,1.04,null,null,null," +X4S12# -X4S13# >=1;"]
["O13",237.4,8,124.7,10.5,586.5,17,984.1,1000,15.9,1.59,null,null,null," +X5S12# -X5S13# >=1;"]
["O14",240.4,4,2,1,717.2,37.1,1001.6,1000,-1.6,-0.16,null,null,null," +X6S12# -X6S13# >=1;"]
["O15",243.4,6,119.7,7.5,596.5,15,988.1,1000,11.9,1.19,null,null,null," +X1S13# -X1S14# >=1;"]
["O16",229.4,136.19999999999999,1,10.5,596.5,21,994.6,1000,5.4,0.54,null,null,null," +X2S13# -X2S14# >=1;"]
[null,null,null,null,null,null,null,null,null,null,null,null,null,null," +X3S13# -X3S14# >=1;"]
["S1 �sszeg:",1447.8,null,null,null,null,null,null,null,null,null,null,null,null," +X4S13# -X4S14# >=1;"]
["S16 �sszeg:",459.7,null,null,null,null,null,null,null,null,null,null,null,null," +X5S13# -X5S14# >=1;"]
["Becsl�s �sszeg:",15999.7,null,null,null,null,null,null,null,null,null,null,null,null," +X6S13# -X6S14# >=1;"]
["T�ny �sszeg:",16000,null,null,null,null,null,null,null,null,null,null,null,null," +X1S14# -X1S15# >=1;"]
["T�ny-becsl�s elt�r�s:",-0.3,null,null,null,null,null,null,null,null,null,null,null,null," +X2S14# -X2S15# >=1;"]
["T�ny n�gyzet�sszeg:",null,null,null,null,null,null,null,null,null,null,null,null,null," +X3S14# -X3S15# >=1;"]
["Becsl�s n�gyzet�sszeg:",null,null,null,null,null,null,null,null,null,null,null,null,null," +X4S14# -X4S15# >=1;"]
["N�gyzet�sszeg hiba:",0,null,null,null,null,null,null,null,null,null,null,null,null," +X5S14# -X5S15# >=1;"]
[null,null,null,null,null,null,null,null,null,null,null,null,null,null," +X6S14# -X6S15# >=1;"]
["Open url",null,null,null,null,null,null,null,null,null,null,null,null,null," +X1S15# -X1S16# >=1;"]
[null,null,null,null,null,null,null,null,null,null,null,null,null,null," +X2S15# -X2S16# >=1;"]
["Maxim�lis mem�ria haszn�lat: 1.36 Mb",null,null,null,null,null,null,null,null,null,null,null,null,null," +X3S15# -X3S16# >=1;"]
["A futtat�s id�tartama: 0.05 mp (0 p)",null,null,null,null,null,null,null,null,null,null,null,null,null," +X4S15# -X4S16# >=1;"]
[null,null,null,null,null,null,null,null,null,null,null,null,null,null," +X5S15# -X5S16# >=1;"]
[null,null,null,null,null,null,null,null,null,null,null,null,null,null," +X6S15# -X6S16# >=1;"]
[null,null,null,null,null,null,null,null,null,null,null,null,null,null," - X1S11# - X2S3# - X3S13# - X4S1# - X5S10# - X6S16# + 1000 >=0;"]
[null,null,null,null,null,null,null,null,null,null,null,null,null,null," - X1S1# - X2S6# - X3S5# - X4S6# - X5S10# - X6S15# + 1000 >=0;"]
[null,null,null,null,null,null,null,null,null,null,null,null,null,null," - X1S10# - X2S2# - X3S12# - X4S8# - X5S4# - X6S6# + 1000 >=0;"]
[null,null,null,null,null,null,null,null,null,null,null,null,null,null," - X1S3# - X2S14# - X3S1# - X4S15# - X5S9# - X6S7# + 1000 >=0;"]
[null,null,null,null,null,null,null,null,null,null,null,null,null,null," - X1S13# - X2S1# - X3S9# - X4S3# - X5S16# - X6S5# + 1000 >=0;"]
[null,null,null,null,null,null,null,null,null,null,null,null,null,null," - X1S5# - X2S14# - X3S7# - X4S4# - X5S15# - X6S1# + 1000 >=0;"]
[null,null,null,null,null,null,null,null,null,null,null,null,null,null," - X1S16# - X2S4# - X3S8# - X4S10# - X5S1# - X6S9# + 1000 >=0;"]
[null,null,null,null,null,null,null,null,null,null,null,null,null,null," - X1S14# - X2S9# - X3S16# - X4S5# - X5S12# - X6S1# + 1000 >=0;"]
[null,null,null,null,null,null,null,null,null,null,null,null,null,null," - X1S8# - X2S11# - X3S11# - X4S6# - X5S4# - X6S12# + 1000 >=0;"]
[null,null,null,null,null,null,null,null,null,null,null,null,null,null," - X1S3# - X2S7# - X3S2# - X4S1# - X5S3# - X6S9# + 1000 >=0;"]
[null,null,null,null,null,null,null,null,null,null,null,null,null,null," - X1S7# - X2S13# - X3S3# - X4S9# - X5S8# - X6S4# + 1000 >=0;"]
[null,null,null,null,null,null,null,null,null,null,null,null,null,null," - X1S1# - X2S16# - X3S10# - X4S13# - X5S13# - X6S14# + 1000 >=0;"]
[null,null,null,null,null,null,null,null,null,null,null,null,null,null," - X1S12# - X2S8# - X3S4# - X4S11# - X5S14# - X6S11# + 1000 >=0;"]
[null,null,null,null,null,null,null,null,null,null,null,null,null,null," - X1S9# - X2S12# - X3S14# - X4S15# - X5S2# - X6S3# + 1000 >=0;"]
[null,null,null,null,null,null,null,null,null,null,null,null,null,null," - X1S6# - X2S10# - X3S5# - X4S14# - X5S4# - X6S13# + 1000 >=0;"]
[null,null,null,null,null,null,null,null,null,null,null,null,null,null," - X1S15# - X2S4# - X3S15# - X4S11# - X5S4# - X6S7# + 1000 >=0;"]
[]
[null,null,null,null,null,null,null,null,null,null,null,null,null,null,"Feladat: Vezesse le algoritmikusan a fenti, az LP standard egyenlőtlenség rendszerét a bal oldali kiindulási sorszám-OAM adataiból!"]