{"text_format":"1","workbook":"xlsx","n_sheets":3,"sheets":["db","OAM","step1_2"],"not_rendered":{"charts":0,"images":3,"macros":1,"external_links":0,"defined_names":0,"comments":0,"pivot_tables":0},"unopened":[],"bounds":{"document_bytes":16777216,"sheet_cells":100000,"rows_first":2000,"rows_last":500,"rows_between":2000,"halvings":0,"cell_chars":16384,"cell_head_chars":4096},"cells_cut":0,"cells_raw":0,"read":"whole","date_system":"1900"}

{"sheet":"db","index":0,"n_rows":18,"n_cols":49,"rows_kept":18,"cut":false,"hidden":false,"merged":[]}
[null,null,"I.","II.","III.","IV.","V.","VI.","VII.",null,null,null,"ptrn1","ptrn2","ptrn3","ptrn4","ptrn5","ptrn6","ptrn7",null,null,null,"clr1","clr2","clr3","clr4","clr5","clr6","clr7",null,null,null,"prtnclr","prtnclr","prtnclr","prtnclr","prtnclr","prtnclr","prtnclr",null,null,null,"ABC","ABC","ABC","ABC","ABC","ABC","ABC"]
[1,"a)",3,3,1,1,3,1,1,null,null,null,13,13,14,13,14,14,13,null,null,null,16776960,255,32767,16711807,16711680,65280,65535,null,null,null,{"$f":"M2&W2","v":"1316776960"},{"$f":"N2&X2","v":"13255"},{"$f":"O2&Y2","v":"1432767"},{"$f":"P2&Z2","v":"1316711807"},{"$f":"Q2&AA2","v":"1416711680"},{"$f":"R2&AB2","v":"1465280"},{"$f":"S2&AC2","v":"1365535"},null,null,null,{"$f":"VLOOKUP(AG2,$U$11:$V$18,2,0)","v":"E"},{"$f":"VLOOKUP(AH2,$U$11:$V$18,2,0)","v":"A"},{"$f":"VLOOKUP(AI2,$U$11:$V$18,2,0)","v":"B"},{"$f":"VLOOKUP(AJ2,$U$11:$V$18,2,0)","v":"G"},{"$f":"VLOOKUP(AK2,$U$11:$V$18,2,0)","v":"F"},{"$f":"VLOOKUP(AL2,$U$11:$V$18,2,0)","v":"D"},{"$f":"VLOOKUP(AM2,$U$11:$V$18,2,0)","v":"C"}]
[2,"b)",1,1,1,1,1,1,1,null,null,null,13,14,14,13,13,13,14,null,null,null,16711807,32767,16711935,65535,255,16711807,16711680,null,null,null,{"$f":"M3&W3","v":"1316711807"},"1432767","1416711935","1365535","13255","1316711807","1416711680",null,null,null,{"$f":"VLOOKUP(AG3,$U$11:$V$18,2,0)","v":"G"},"B","H","C","A","G","F"]
[3,"c)",1,1,1,3,1,1,1,null,null,null,14,13,13,14,13,14,14,null,null,null,65280,16776960,65535,16711680,16711807,32767,16711935,null,null,null,"1465280","1316776960","1365535","1416711680","1316711807","1432767","1416711935",null,null,null,"D","E","C","F","G","B","H"]
[4,"d)",1,1,3,1,1,3,3,null,null,null,14,14,14,13,13,14,13,null,null,null,32767,16711680,65280,255,65535,16711935,16776960,null,null,null,"1432767","1416711680","1465280","13255","1365535","1416711935","1316776960",null,null,null,"B","F","D","A","C","H","E"]
[5,"e)",1,1,1,1,1,1,1,null,null,null,14,13,13,14,13,14,13,null,null,null,16711935,65535,16711807,65280,16776960,16711680,255,null,null,null,"1416711935","1365535","1316711807","1465280","1316776960","1416711680","13255",null,null,null,"H","C","G","D","E","F","A"]
[6,"f)",1,1,1,1,1,1,1,null,null,null,13,13,13,14,14,13,14,null,null,null,65535,16711807,16776960,16711935,32767,255,65280,null,null,null,"1365535","1316711807","1316776960","1416711935","1432767","13255","1465280",null,null,null,"C","G","E","H","B","A","D"]
[7,"g)",1,1,1,1,1,1,1,null,null,null,13,14,14,13,14,13,14,null,null,null,255,65280,16711680,16776960,16711935,65535,32767,null,null,null,"13255","1465280","1416711680","1316776960","1416711935","1365535","1432767",null,null,null,"A","D","F","E","H","C","B"]
[8,"h)",1,1,1,1,1,1,1,null,null,null,14,14,13,14,14,13,13,null,null,null,16711680,16711935,255,32767,65280,16776960,16711807,null,null,null,"1416711680","1416711935","13255","1432767","1465280","1316776960","1316711807",null,null,null,"F","H","A","B","D","E","G"]
[null,null,"I.","II.","III.","IV.","V.","VI.","VII.","ÖSSZESEN","ptrn","clr"]
["A","VÁLLALATÉPÍTŐ",1,3,1,1,1,1,1,9,13,255,null,null,null,null,null,null,null,null,{"$f":"K11&L11","v":"13255"},{"$f":"A11","v":"A"},null,null,null,null,null,null,null,null,null,null,{"$f":"MATCH($U11,AG$2:AG$9,0)","v":7},{"$f":"MATCH($U11,AH$2:AH$9,0)","v":1},8,4,2,6,5]
["B","ELNÖK",1,1,1,1,1,1,1,7,14,32767,null,null,null,null,null,null,null,null,{"$f":"K12&L12","v":"1432767"},{"$f":"A12","v":"B"},null,null,null,null,null,null,null,null,null,null,{"$f":"MATCH($U12,AG$2:AG$9,0)","v":4},2,1,8,6,3,7]
["C","SERKENTŐ",1,1,1,1,1,1,1,7,13,65535,null,null,null,null,null,null,null,null,"1365535","C",null,null,null,null,null,null,null,null,null,null,6,5,3,2,4,7,1]
["D","ÖTLETGYÁRTÓ",1,1,3,1,1,1,1,9,14,65280,null,null,null,null,null,null,null,null,"1465280","D",null,null,null,null,null,null,null,null,null,null,3,7,4,5,8,1,6]
["E","FORRÁSFELTÁRÓ",3,1,1,1,1,1,3,11,13,16776960,null,null,null,null,null,null,null,null,"1316776960","E",null,null,null,null,null,null,null,null,null,null,1,3,6,7,5,8,4]
["F","HELYZETÉRTÉKELŐ",1,1,1,3,3,1,1,11,14,16711680,null,null,null,null,null,null,null,null,"1416711680","F",null,null,null,null,null,null,null,null,null,null,8,4,7,3,1,5,2]
["G","CSAPATJÁTÉKOS",1,1,1,1,1,1,1,7,13,16711807,null,null,null,null,null,null,null,null,"1316711807","G",null,null,null,null,null,null,null,null,null,null,2,6,5,1,3,2,8]
["H","MEGVALÓSÍTÓ",1,1,1,1,1,3,1,9,14,16711935,null,null,null,null,null,null,null,null,"1416711935","H",null,null,null,null,null,null,null,null,null,null,5,8,2,6,7,4,3]

{"sheet":"OAM","index":1,"n_rows":32,"n_cols":23,"rows_kept":32,"cut":false,"hidden":false,"merged":[[0,1,0,7],[0,8,0,14],[31,1,43,37]]}
[null,"minél nagyobb a nyers pontszám, annál jellemzőbb az objektum",null,null,null,null,null,null,"minél később szerepel egy objektumra utalás, vagyis minél átfogóbb kép mellett születik egy nyers pont, annál jellemzőbb az objektum",null,null,null,null,null,null,"cél: vagy bizonyítani a minden objektum másként egyformán jellemző állapot létét, vagy minél inkább egyedivé tenni a súlyozott összpontszámot szinte homogén nyers pontok esetén is"]
["irány",0,0,0,0,0,0,0,0,0,0,0,0,0,0,"nincs"]
[null,{"$f":"db!C10","v":"I."},{"$f":"db!D10","v":"II."},{"$f":"db!E10","v":"III."},{"$f":"db!F10","v":"IV."},{"$f":"db!G10","v":"V."},{"$f":"db!H10","v":"VI."},{"$f":"db!I10","v":"VII."},"suly1","suly2","suly3","suly4","suly5","suly6","suly7","Y0","naiv","naiv2","konklúzió","Becslés","sorrend","kategória","becslés_ell"]
[{"$f":"db!B11","v":"VÁLLALATÉPÍTŐ"},{"$f":"db!C11","v":1},{"$f":"db!D11","v":3},{"$f":"db!E11","v":1},{"$f":"db!F11","v":1},{"$f":"db!G11","v":1},{"$f":"db!H11","v":1},{"$f":"db!I11","v":1},{"$f":"db!AG11*B4","v":7},{"$f":"db!AH11*C4","v":3},{"$f":"db!AI11*D4","v":8},{"$f":"db!AJ11*E4","v":4},{"$f":"db!AK11*F4","v":2},{"$f":"db!AL11*G4","v":6},{"$f":"db!AM11*H4","v":5},1000,{"$f":"SUM(B4:H4)","v":9},{"$f":"SUM(I4:O4)","v":35},null,{"$f":"step1_2!AH38","v":1001.4},{"$f":"RANK(T4,T$4:T$11,0)","v":4},{"$f":"A15","v":"VÁLLALATÉPÍTŐ"},{"$f":"IF(step1_2!BA38*step1_2!AJ38<=0,\"valid\",\"invalid\")","v":"valid"}]
[{"$f":"db!B12","v":"ELNÖK"},{"$f":"db!C12","v":1},{"$f":"db!D12","v":1},{"$f":"db!E12","v":1},{"$f":"db!F12","v":1},{"$f":"db!G12","v":1},{"$f":"db!H12","v":1},{"$f":"db!I12","v":1},{"$f":"db!AG12*B5","v":4},{"$f":"db!AH12*C5","v":2},{"$f":"db!AI12*D5","v":1},{"$f":"db!AJ12*E5","v":8},{"$f":"db!AK12*F5","v":6},{"$f":"db!AL12*G5","v":3},{"$f":"db!AM12*H5","v":7},1000,{"$f":"SUM(B5:H5)","v":7},{"$f":"SUM(I5:O5)","v":31},null,{"$f":"step1_2!AH39","v":996.4},{"$f":"RANK(T5,T$4:T$11,0)","v":6},{"$f":"A16","v":"ELNÖK"},{"$f":"IF(step1_2!BA39*step1_2!AJ39<=0,\"valid\",\"invalid\")","v":"valid"}]
[{"$f":"db!B13","v":"SERKENTŐ"},{"$f":"db!C13","v":1},{"$f":"db!D13","v":1},{"$f":"db!E13","v":1},{"$f":"db!F13","v":1},{"$f":"db!G13","v":1},{"$f":"db!H13","v":1},{"$f":"db!I13","v":1},{"$f":"db!AG13*B6","v":6},{"$f":"db!AH13*C6","v":5},{"$f":"db!AI13*D6","v":3},{"$f":"db!AJ13*E6","v":2},{"$f":"db!AK13*F6","v":4},{"$f":"db!AL13*G6","v":7},{"$f":"db!AM13*H6","v":1},1000,7,28,null,{"$f":"step1_2!AH40","v":994.9},7,"SERKENTŐ",{"$f":"IF(step1_2!BA40*step1_2!AJ40<=0,\"valid\",\"invalid\")","v":"valid"}]
[{"$f":"db!B14","v":"ÖTLETGYÁRTÓ"},{"$f":"db!C14","v":1},{"$f":"db!D14","v":1},{"$f":"db!E14","v":3},{"$f":"db!F14","v":1},{"$f":"db!G14","v":1},{"$f":"db!H14","v":1},{"$f":"db!I14","v":1},{"$f":"db!AG14*B7","v":3},{"$f":"db!AH14*C7","v":7},{"$f":"db!AI14*D7","v":12},{"$f":"db!AJ14*E7","v":5},{"$f":"db!AK14*F7","v":8},{"$f":"db!AL14*G7","v":1},{"$f":"db!AM14*H7","v":6},1000,9,42,"<--zavar",{"$f":"step1_2!AH41","v":1003.4},3,"ÖTLETGYÁRTÓ",{"$f":"IF(step1_2!BA41*step1_2!AJ41<=0,\"valid\",\"invalid\")","v":"valid"}]
[{"$f":"db!B15","v":"FORRÁSFELTÁRÓ"},{"$f":"db!C15","v":3},{"$f":"db!D15","v":1},{"$f":"db!E15","v":1},{"$f":"db!F15","v":1},{"$f":"db!G15","v":1},{"$f":"db!H15","v":1},{"$f":"db!I15","v":3},{"$f":"db!AG15*B8","v":3},{"$f":"db!AH15*C8","v":3},{"$f":"db!AI15*D8","v":6},{"$f":"db!AJ15*E8","v":7},{"$f":"db!AK15*F8","v":5},{"$f":"db!AL15*G8","v":8},{"$f":"db!AM15*H8","v":12},1000,11,44,null,{"$f":"step1_2!AH42","v":1003.9},2,"FORRÁSFELTÁRÓ",{"$f":"IF(step1_2!BA42*step1_2!AJ42<=0,\"valid\",\"invalid\")","v":"valid"}]
[{"$f":"db!B16","v":"HELYZETÉRTÉKELŐ"},{"$f":"db!C16","v":1},{"$f":"db!D16","v":1},{"$f":"db!E16","v":1},{"$f":"db!F16","v":3},{"$f":"db!G16","v":3},{"$f":"db!H16","v":1},{"$f":"db!I16","v":1},{"$f":"db!AG16*B9","v":8},{"$f":"db!AH16*C9","v":4},{"$f":"db!AI16*D9","v":7},{"$f":"db!AJ16*E9","v":9},{"$f":"db!AK16*F9","v":3},{"$f":"db!AL16*G9","v":5},{"$f":"db!AM16*H9","v":2},1000,11,38,"<--zavar",{"$f":"step1_2!AH43","v":1004.9},1,"HELYZETÉRTÉKELŐ",{"$f":"IF(step1_2!BA43*step1_2!AJ43<=0,\"valid\",\"invalid\")","v":"valid"}]
[{"$f":"db!B17","v":"CSAPATJÁTÉKOS"},{"$f":"db!C17","v":1},{"$f":"db!D17","v":1},{"$f":"db!E17","v":1},{"$f":"db!F17","v":1},{"$f":"db!G17","v":1},{"$f":"db!H17","v":1},{"$f":"db!I17","v":1},{"$f":"db!AG17*B10","v":2},{"$f":"db!AH17*C10","v":6},{"$f":"db!AI17*D10","v":5},{"$f":"db!AJ17*E10","v":1},{"$f":"db!AK17*F10","v":3},{"$f":"db!AL17*G10","v":2},{"$f":"db!AM17*H10","v":8},1000,7,27,null,{"$f":"step1_2!AH44","v":994.9},7,"CSAPATJÁTÉKOS",{"$f":"IF(step1_2!BA44*step1_2!AJ44<=0,\"valid\",\"invalid\")","v":"valid"}]
[{"$f":"db!B18","v":"MEGVALÓSÍTÓ"},{"$f":"db!C18","v":1},{"$f":"db!D18","v":1},{"$f":"db!E18","v":1},{"$f":"db!F18","v":1},{"$f":"db!G18","v":1},{"$f":"db!H18","v":3},{"$f":"db!I18","v":1},{"$f":"db!AG18*B11","v":5},{"$f":"db!AH18*C11","v":8},{"$f":"db!AI18*D11","v":2},{"$f":"db!AJ18*E11","v":6},{"$f":"db!AK18*F11","v":7},{"$f":"db!AL18*G11","v":12},{"$f":"db!AM18*H11","v":3},1000,9,43,"<--zavar",{"$f":"step1_2!AH45","v":999.9},5,"MEGVALÓSÍTÓ",{"$f":"IF(step1_2!BA45*step1_2!AJ45<=0,\"valid\",\"invalid\")","v":"valid"}]
[]
[]
[null,{"$f":"B3","v":"I."},{"$f":"C3","v":"II."},"III.","IV.","V.","VI.","VII.","suly1","suly2","suly3","suly4","suly5","suly6","suly7","Y0"]
[{"$f":"A4","v":"VÁLLALATÉPÍTŐ"},{"$f":"RANK(B4,B$4:B$11,B$2)","v":2},{"$f":"RANK(C4,C$4:C$11,C$2)","v":1},2,2,2,2,2,2,6,2,6,8,4,5,{"$f":"P4","v":1000}]
[{"$f":"A5","v":"ELNÖK"},{"$f":"RANK(B5,B$4:B$11,B$2)","v":2},2,2,2,2,2,2,5,8,8,2,3,6,3,{"$f":"P5","v":1000}]
["SERKENTŐ",{"$f":"RANK(B6,B$4:B$11,B$2)","v":2},2,2,2,2,2,2,3,4,6,7,5,3,8,1000]
["ÖTLETGYÁRTÓ",{"$f":"RANK(B7,B$4:B$11,B$2)","v":2},2,1,2,2,2,2,6,2,1,5,1,8,4,1000]
["FORRÁSFELTÁRÓ",{"$f":"RANK(B8,B$4:B$11,B$2)","v":1},2,2,2,2,2,1,6,6,4,3,4,2,1,1000]
["HELYZETÉRTÉKELŐ",{"$f":"RANK(B9,B$4:B$11,B$2)","v":2},2,2,1,1,2,2,1,5,3,1,6,5,7,1000]
["CSAPATJÁTÉKOS",{"$f":"RANK(B10,B$4:B$11,B$2)","v":2},2,2,2,2,2,2,8,3,5,8,6,7,2,1000]
["MEGVALÓSÍTÓ",{"$f":"RANK(B11,B$4:B$11,B$2)","v":2},2,2,2,2,1,2,4,1,7,4,2,1,6,1000]
[]
[]
[]
[]
[]
[]
[]
[]
[]
[null,"A naiv pontszám-összegző megoldás keretében, viszonylag homogén nyerspontok esetén nem feltétlenül létezik 2+2 kategória-halmaz, hiszen a példa szerinti 9 pont egyszerre a 7-es és a 11-es sáv szomszédja is. A súlyozott, anti-diszkrimanatív, optimalizált (érzékenységnövelt) értékelés eredményeként az ELNÖK eddig véletlenszerűen kizárt 7 pontos kategóriája immár jogszerűen nem a két legrosszabb kategória egyike, míg a korábbi két 11-es kategória valid módon megerősítésre került. A naiv2, azaz a csak súlyozott pontok és a naiv egy között több esetben (3) is ellentmondás lép fel (vö. zavar). Létrejött az elvárt 22 réteg, hiszen a minden kategória nem lehet másként egyforma elv két-lépéses kizáródása után a 8 kategória 7 sávba sorolódott, ahol a két 7. helyezés megfelelt az alsó sáv két elvárt kategória-elemének. A holtversenyek száma lehet vélelmezhetően több, mint 2 elemet érintő, viszont ezekben az esetekben fennáll, hogy több kategória is normaszerű lesz (1000 pont +/-1 pont), vagyis ebben az esetben kimondható, ami a naiv esetben nem, hogy az esetlegesen létre nem jövő 2+2 sáv azért nem jött létre, mert a normaszerűség se a leginkább jellemző, se a legkevésbé jellemző sávoknak nem része!"]

{"sheet":"step1_2","index":2,"n_rows":59,"n_cols":55,"rows_kept":59,"cut":false,"hidden":false,"merged":[]}
[]
[]
[]
[]
["Azonos�t�:",2863216,"Objektumok:",8,"Attrib�tumok:",14,"Lepcs�k:",8,"Eltol�s:",0,"Le�r�s:","COCO Y0: 2863216",null,null,null,null,null,null,null,null,null,null,null,null,null,null,"Azonos�t�:",3765436,"Objektumok:",8,"Attrib�tumok:",6,"Lepcs�k:",8,"Eltol�s:",0,"Le�r�s:","COCO Y0: 3765436",null,null,null,null,null,"Azonos�t�:",4753263,"Objektumok:",8,"Attrib�tumok:",6,"Lepcs�k:",8,"Eltol�s:",0,"Le�r�s:","COCO Y0: 4753263"]
[]
["Rangsor","X(A1)","X(A2)","X(A3)","X(A4)","X(A5)","X(A6)","X(A7)","X(A8)","X(A9)","X(A10)","X(A11)","X(A12)","X(A13)","X(A14)","Y(A15)",null,"Rangsor","X(A1)","X(A4)","X(A6)","X(A7)","X(A10)","X(A11)","Y(A15)",null,"Rangsor","X(A1)","X(A2)","X(A3)","X(A4)","X(A5)","X(A6)","Y(A7)",null,null,null,null,null,null,null,null,null,"Rangsor","X(A1)","X(A2)","X(A3)","X(A4)","X(A5)","X(A6)","Y(A7)"]
["O1",2,1,2,2,2,2,2,2,6,2,6,8,4,5,1000,null,"O1",2,2,2,2,2,6,1000,null,"O1",2,2,2,2,2,6,1000,null,{"$f":"9-AB8","v":7},{"$f":"9-AC8","v":7},{"$f":"9-AD8","v":7},{"$f":"9-AE8","v":7},{"$f":"9-AF8","v":7},{"$f":"9-AG8","v":3},{"$f":"AH8","v":1000},null,"O1",7,7,7,7,7,3,1000]
["O2",2,2,2,2,2,2,2,5,8,8,2,3,6,3,1000,null,"O2",2,2,2,2,8,2,1000,null,"O2",2,2,2,2,8,2,1000,null,{"$f":"9-AB9","v":7},7,7,7,1,7,{"$f":"AH9","v":1000},null,"O2",7,7,7,7,1,7,1000]
["O3",2,2,2,2,2,2,2,3,4,6,7,5,3,8,1000,null,"O3",2,2,2,2,6,7,1000,null,"O3",2,2,2,2,6,7,1000,null,7,7,7,7,3,2,1000,null,"O3",7,7,7,7,3,2,1000]
["O4",2,2,1,2,2,2,2,6,2,1,5,1,8,4,1000,null,"O4",2,2,2,2,1,5,1000,null,"O4",2,2,2,2,1,5,1000,null,7,7,7,7,8,4,1000,null,"O4",7,7,7,7,8,4,1000]
["O5",1,2,2,2,2,2,1,6,6,4,3,4,2,1,1000,null,"O5",1,2,2,1,4,3,1000,null,"O5",1,2,2,1,4,3,1000,null,8,7,7,8,5,6,1000,null,"O5",8,7,7,8,5,6,1000]
["O6",2,2,2,1,1,2,2,1,5,3,1,6,5,7,1000,null,"O6",2,1,2,2,3,1,1000,null,"O6",2,1,2,2,3,1,1000,null,7,8,7,7,6,8,1000,null,"O6",7,8,7,7,6,8,1000]
["O7",2,2,2,2,2,2,2,8,3,5,8,6,7,2,1000,null,"O7",2,2,2,2,5,8,1000,null,"O7",2,2,2,2,5,8,1000,null,7,7,7,7,4,1,1000,null,"O7",7,7,7,7,4,1,1000]
["O8",2,2,2,2,2,1,2,4,1,7,4,2,1,6,1000,null,"O8",2,2,1,2,7,4,1000,null,"O8",2,2,1,2,7,4,1000,null,7,7,8,7,2,5,1000,null,"O8",7,7,8,7,2,5,1000]
[]
["L�pcs�k(1)","X(A1)","X(A2)","X(A3)","X(A4)","X(A5)","X(A6)","X(A7)","X(A8)","X(A9)","X(A10)","X(A11)","X(A12)","X(A13)","X(A14)",null,null,null,null,null,null,null,null,null,null,null,"L�pcs�k(1)","X(A1)","X(A2)","X(A3)","X(A4)","X(A5)","X(A6)",null,null,null,null,null,null,null,null,null,null,"L�pcs�k(1)","X(A1)","X(A2)","X(A3)","X(A4)","X(A5)","X(A6)"]
["S1","(0+7)/(1)=7","(0+13)/(1)=13","(0+19)/(1)=19","(0+7)/(1)=7","(0+7)/(1)=7","(0+7)/(1)=7","(0+7)/(1)=7","(0+935)/(1)=935","(0+32)/(1)=32","(0+7)/(1)=7","(0+7)/(1)=7","(0+898)/(1)=898","(0+17)/(1)=17","(0+923)/(1)=923",null,null,null,null,null,null,null,null,null,null,null,"S1","(9+7)/(2)=8","(7+7)/(2)=7","(14+7)/(2)=10.5","(7+7)/(2)=7","(972.9+10)/(2)=491.45","(7+976.9)/(2)=491.95",null,null,null,null,null,null,null,null,null,null,"S1","(7+7)/(2)=7","(7+7)/(2)=7","(7+14)/(2)=10.5","(7+9)/(2)=8","(995.1+993.1)/(2)=994.05","(7+7)/(2)=7"]
["S2","(0+6)/(1)=6","(0+6)/(1)=6","(0+6)/(1)=6","(0+6)/(1)=6","(0+6)/(1)=6","(0+6)/(1)=6","(0+6)/(1)=6","(0+934)/(1)=934","(0+31)/(1)=31","(0+6)/(1)=6","(0+6)/(1)=6","(0+897)/(1)=897","(0+16)/(1)=16","(0+922)/(1)=922",null,null,null,null,null,null,null,null,null,null,null,"S2","(6+6)/(2)=6","(6+6)/(2)=6","(6+6)/(2)=6","(6+6)/(2)=6","(971.9+9)/(2)=490.45","(6+975.9)/(2)=490.95",null,null,null,null,null,null,null,null,null,null,"S2","(6+6)/(2)=6","(6+6)/(2)=6","(6+13)/(2)=9.5","(6+8)/(2)=7","(994.1+992.1)/(2)=993.05","(6+6)/(2)=6"]
["S3","(0+5)/(1)=5","(0+5)/(1)=5","(0+5)/(1)=5","(0+5)/(1)=5","(0+5)/(1)=5","(0+5)/(1)=5","(0+5)/(1)=5","(0+933)/(1)=933","(0+30)/(1)=30","(0+5)/(1)=5","(0+5)/(1)=5","(0+896)/(1)=896","(0+15)/(1)=15","(0+51)/(1)=51",null,null,null,null,null,null,null,null,null,null,null,"S3","(5+5)/(2)=5","(5+5)/(2)=5","(5+5)/(2)=5","(5+5)/(2)=5","(967.9+8)/(2)=487.95","(5+974.9)/(2)=489.95",null,null,null,null,null,null,null,null,null,null,"S3","(5+5)/(2)=5","(5+5)/(2)=5","(5+12)/(2)=8.5","(5+7)/(2)=6","(990.1+991.1)/(2)=990.55","(5+5)/(2)=5"]
["S4","(0+4)/(1)=4","(0+4)/(1)=4","(0+4)/(1)=4","(0+4)/(1)=4","(0+4)/(1)=4","(0+4)/(1)=4","(0+4)/(1)=4","(0+4)/(1)=4","(0+4)/(1)=4","(0+4)/(1)=4","(0+4)/(1)=4","(0+4)/(1)=4","(0+4)/(1)=4","(0+4)/(1)=4",null,null,null,null,null,null,null,null,null,null,null,"S4","(4+4)/(2)=4","(4+4)/(2)=4","(4+4)/(2)=4","(4+4)/(2)=4","(966.9+7)/(2)=486.95","(4+973.9)/(2)=488.95",null,null,null,null,null,null,null,null,null,null,"S4","(4+4)/(2)=4","(4+4)/(2)=4","(4+11)/(2)=7.5","(4+6)/(2)=5","(989.1+990.1)/(2)=989.55","(4+4)/(2)=4"]
["S5","(0+3)/(1)=3","(0+3)/(1)=3","(0+3)/(1)=3","(0+3)/(1)=3","(0+3)/(1)=3","(0+3)/(1)=3","(0+3)/(1)=3","(0+3)/(1)=3","(0+3)/(1)=3","(0+3)/(1)=3","(0+3)/(1)=3","(0+3)/(1)=3","(0+3)/(1)=3","(0+3)/(1)=3",null,null,null,null,null,null,null,null,null,null,null,"S5","(3+3)/(2)=3","(3+3)/(2)=3","(3+3)/(2)=3","(3+3)/(2)=3","(965.9+6)/(2)=485.95","(3+972.9)/(2)=487.95",null,null,null,null,null,null,null,null,null,null,"S5","(3+3)/(2)=3","(3+3)/(2)=3","(3+10)/(2)=6.5","(3+5)/(2)=4","(988.1+989.1)/(2)=988.55","(3+3)/(2)=3"]
["S6","(0+2)/(1)=2","(0+2)/(1)=2","(0+2)/(1)=2","(0+2)/(1)=2","(0+2)/(1)=2","(0+2)/(1)=2","(0+2)/(1)=2","(0+2)/(1)=2","(0+2)/(1)=2","(0+2)/(1)=2","(0+2)/(1)=2","(0+2)/(1)=2","(0+2)/(1)=2","(0+2)/(1)=2",null,null,null,null,null,null,null,null,null,null,null,"S6","(2+2)/(2)=2","(2+2)/(2)=2","(2+2)/(2)=2","(2+2)/(2)=2","(964.9+5)/(2)=484.95","(2+971.9)/(2)=486.95",null,null,null,null,null,null,null,null,null,null,"S6","(2+2)/(2)=2","(2+2)/(2)=2","(2+9)/(2)=5.5","(2+4)/(2)=3","(987.1+988.1)/(2)=987.55","(2+2)/(2)=2"]
["S7","(0+1)/(1)=1","(0+1)/(1)=1","(0+1)/(1)=1","(0+1)/(1)=1","(0+1)/(1)=1","(0+1)/(1)=1","(0+1)/(1)=1","(0+1)/(1)=1","(0+1)/(1)=1","(0+1)/(1)=1","(0+1)/(1)=1","(0+1)/(1)=1","(0+1)/(1)=1","(0+1)/(1)=1",null,null,null,null,null,null,null,null,null,null,null,"S7","(1+1)/(2)=1","(1+1)/(2)=1","(1+1)/(2)=1","(1+1)/(2)=1","(963.9+1)/(2)=482.45","(1+970.9)/(2)=485.95",null,null,null,null,null,null,null,null,null,null,"S7","(1+1)/(2)=1","(1+1)/(2)=1","(1+8)/(2)=4.5","(1+3)/(2)=2","(986.1+984.1)/(2)=985.05","(1+1)/(2)=1"]
["S8","(0+0)/(1)=0","(0+0)/(1)=0","(0+0)/(1)=0","(0+0)/(1)=0","(0+0)/(1)=0","(0+0)/(1)=0","(0+0)/(1)=0","(0+0)/(1)=0","(0+0)/(1)=0","(0+0)/(1)=0","(0+0)/(1)=0","(0+0)/(1)=0","(0+0)/(1)=0","(0+0)/(1)=0",null,null,null,null,null,null,null,null,null,null,null,"S8","(0+0)/(2)=0","(0+0)/(2)=0","(0+0)/(2)=0","(0+0)/(2)=0","(962.9+0)/(2)=481.45","(0+969.9)/(2)=484.95",null,null,null,null,null,null,null,null,null,null,"S8","(0+0)/(2)=0","(0+0)/(2)=0","(0+0)/(2)=0","(0+0)/(2)=0","(985.1+983.1)/(2)=984.05","(0+0)/(2)=0"]
[]
["L�pcs�k(2)","X(A1)","X(A2)","X(A3)","X(A4)","X(A5)","X(A6)","X(A7)","X(A8)","X(A9)","X(A10)","X(A11)","X(A12)","X(A13)","X(A14)",null,null,null,null,null,null,null,null,null,null,null,"L�pcs�k(2)","X(A1)","X(A2)","X(A3)","X(A4)","X(A5)","X(A6)",null,null,null,null,null,null,null,null,null,null,"L�pcs�k(2)","X(A1)","X(A2)","X(A3)","X(A4)","X(A5)","X(A6)"]
["S1",7,13,19,7,7,7,7,935,32,7,7,898,17,923,null,null,null,null,null,null,null,null,null,null,null,"S1",8,7,10.5,7,491.5,492,null,null,null,null,null,null,null,null,null,null,"S1",7,7,10.5,8,994.1,7]
["S2",6,6,6,6,6,6,6,934,31,6,6,897,16,922,null,null,null,null,null,null,null,null,null,null,null,"S2",6,6,6,6,490.5,491,null,null,null,null,null,null,null,null,null,null,"S2",6,6,9.5,7,993.1,6]
["S3",5,5,5,5,5,5,5,933,30,5,5,896,15,51,null,null,null,null,null,null,null,null,null,null,null,"S3",5,5,5,5,488,490,null,null,null,null,null,null,null,null,null,null,"S3",5,5,8.5,6,990.6,5]
["S4",4,4,4,4,4,4,4,4,4,4,4,4,4,4,null,null,null,null,null,null,null,null,null,null,null,"S4",4,4,4,4,487,489,null,null,null,null,null,null,null,null,null,null,"S4",4,4,7.5,5,989.6,4]
["S5",3,3,3,3,3,3,3,3,3,3,3,3,3,3,null,null,null,null,null,null,null,null,null,null,null,"S5",3,3,3,3,486,488,null,null,null,null,null,null,null,null,null,null,"S5",3,3,6.5,4,988.6,3]
["S6",2,2,2,2,2,2,2,2,2,2,2,2,2,2,null,null,null,null,null,null,null,null,null,null,null,"S6",2,2,2,2,485,487,null,null,null,null,null,null,null,null,null,null,"S6",2,2,5.5,3,987.6,2]
["S7",1,1,1,1,1,1,1,1,1,1,1,1,1,1,null,null,null,null,null,null,null,null,null,null,null,"S7",1,1,1,1,482.5,486,null,null,null,null,null,null,null,null,null,null,"S7",1,1,4.5,2,985.1,1]
["S8",0,0,0,0,0,0,0,0,0,0,0,0,0,0,null,null,null,null,null,null,null,null,null,null,null,"S8",0,0,0,0,481.5,485,null,null,null,null,null,null,null,null,null,null,"S8",0,0,0,0,984.1,0]
[]
["COCO:Y0","X(A1)","X(A2)","X(A3)","X(A4)","X(A5)","X(A6)","X(A7)","X(A8)","X(A9)","X(A10)","X(A11)","X(A12)","X(A13)","X(A14)","Becsl�s","T�ny+0","Delta","Delta/T�ny",null,null,null,null,null,null,null,"COCO:Y0","X(A1)","X(A2)","X(A3)","X(A4)","X(A5)","X(A6)","Becsl�s","T�ny+0","Delta","Delta/T�ny",null,null,null,null,null,null,"COCO:Y0","X(A1)","X(A2)","X(A3)","X(A4)","X(A5)","X(A6)","Becsl�s","T�ny+0","Delta","Delta/T�ny"]
["O1",6,13,6,6,6,6,6,934,2,6,2,0,4,3,1000,1000,0,0,null,null,null,null,null,null,null,"O1",6,6,6,6,490.5,487,1001.4,1000,-1.4,-0.14000000000000001,null,null,null,null,null,null,"O1",1,1,4.5,2,985.1,5,998.6,1000,1.4,0.14000000000000001]
["O2",6,6,6,6,6,6,6,3,0,0,6,896,2,51,1000,1000,0,0,null,null,null,null,null,null,null,"O2",6,6,6,6,481.5,491,996.4,1000,3.6,0.36,null,null,null,null,null,null,"O2",1,1,4.5,2,994.1,1,1003.6,1000,-3.6,-0.36]
["O3",6,6,6,6,6,6,6,933,4,2,1,3,15,0,1000,1000,0,0,null,null,null,null,null,null,null,"O3",6,6,6,6,485,486,994.9,1000,5.0999999999999996,0.51,null,null,null,null,null,null,"O3",1,1,4.5,2,990.6,6,1005.1,1000,-5.0999999999999996,-0.51]
["O4",6,6,19,6,6,6,6,2,31,7,3,898,0,4,1000,1000,0,0,null,null,null,null,null,null,null,"O4",6,6,6,6,491.5,488,1003.4,1000,-3.4,-0.34,null,null,null,null,null,null,"O4",1,1,4.5,2,984.1,4,996.6,1000,3.4,0.34]
["O5",7,6,6,6,6,6,7,2,2,4,5,4,16,923,1000,1000,0,0,null,null,null,null,null,null,null,"O5",8,6,6,7,487,490,1003.9,1000,-3.9,-0.39,null,null,null,null,null,null,"O5",0,1,4.5,0,988.6,2,996.1,1000,3.9,0.39]
["O6",6,6,6,7,7,6,6,935,3,5,7,2,3,1,1000,1000,0,0,null,null,null,null,null,null,null,"O6",6,7,6,6,488,492,1004.9,1000,-4.9000000000000004,-0.49,null,null,null,null,null,null,"O6",1,0,4.5,2,987.6,0,995.1,1000,4.9000000000000004,0.49]
["O7",6,6,6,6,6,6,6,0,30,3,0,2,1,922,1000,1000,0,0,null,null,null,null,null,null,null,"O7",6,6,6,6,486,485,994.9,1000,5.0999999999999996,0.51,null,null,null,null,null,null,"O7",1,1,4.5,2,989.6,7,1005.1,1000,-5.0999999999999996,-0.51]
["O8",6,6,6,6,6,7,6,4,32,1,4,897,17,2,1000,1000,0,0,null,null,null,null,null,null,null,"O8",6,6,10.5,6,482.5,489,999.9,1000,0.1,0.01,null,null,null,null,null,null,"O8",1,1,0,2,993.1,3,1000.1,1000,-0.1,-0.01]
[]
["S1 �sszeg:",2886,null,null,null,null,null,null,null,null,null,null,null,null,null,null,null,null,null,null,null,null,null,null,null,null,"S1 �sszeg:",1016,null,null,null,null,null,null,null,null,null,null,null,null,null,null,null,"S1 �sszeg:",1033.5999999999999]
["S8 �sszeg:",0,null,null,null,null,null,null,null,null,null,null,null,null,null,null,null,null,null,null,null,null,null,null,null,null,"S8 �sszeg:",966.5,null,null,null,null,null,null,null,null,null,null,null,null,null,null,null,"S8 �sszeg:",984.1]
["Becsl�s �sszeg:",8000,null,null,null,null,null,null,null,null,null,null,null,null,null,null,null,null,null,null,null,null,null,null,null,null,"Becsl�s �sszeg:",7999.7,null,null,null,null,null,null,null,null,null,null,null,null,null,null,null,"Becsl�s �sszeg:",8000.3]
["T�ny �sszeg:",8000,null,null,null,null,null,null,null,null,null,null,null,null,null,null,null,null,null,null,null,null,null,null,null,null,"T�ny �sszeg:",8000,null,null,null,null,null,null,null,null,null,null,null,null,null,null,null,"T�ny �sszeg:",8000]
["T�ny-becsl�s elt�r�s:",0,null,null,null,null,null,null,null,null,null,null,null,null,null,null,null,null,null,null,null,null,null,null,null,null,"T�ny-becsl�s elt�r�s:",-0.3,null,null,null,null,null,null,null,null,null,null,null,null,null,null,null,"T�ny-becsl�s elt�r�s:",0.3]
["T�ny n�gyzet�sszeg:",null,null,null,null,null,null,null,null,null,null,null,null,null,null,null,null,null,null,null,null,null,null,null,null,null,"T�ny n�gyzet�sszeg:",null,null,null,null,null,null,null,null,null,null,null,null,null,null,null,null,"T�ny n�gyzet�sszeg:"]
["Becsl�s n�gyzet�sszeg:",null,null,null,null,null,null,null,null,null,null,null,null,null,null,null,null,null,null,null,null,null,null,null,null,null,"Becsl�s n�gyzet�sszeg:",null,null,null,null,null,null,null,null,null,null,null,null,null,null,null,null,"Becsl�s n�gyzet�sszeg:"]
["N�gyzet�sszeg hiba:",0,null,null,null,null,null,null,null,null,null,null,null,null,null,null,null,null,null,null,null,null,null,null,null,null,"N�gyzet�sszeg hiba:",0,null,null,null,null,null,null,null,null,null,null,null,null,null,null,null,"N�gyzet�sszeg hiba:",0]
[]
["Open url",null,null,null,null,null,null,null,null,null,null,null,null,null,null,null,null,null,null,null,null,null,null,null,null,null,"Open url",null,null,null,null,null,null,null,null,null,null,null,null,null,null,null,null,"Open url"]
[]
["Maxim�lis mem�ria haszn�lat: 1.43 Mb",null,null,null,null,null,null,null,null,null,null,null,null,null,null,null,null,null,null,null,null,null,null,null,null,null,"Maxim�lis mem�ria haszn�lat: 1.41 Mb",null,null,null,null,null,null,null,null,null,null,null,null,null,null,null,null,"Maxim�lis mem�ria haszn�lat: 1.41 Mb"]
["A futtat�s id�tartama: 0.13 mp (0 p)",null,null,null,null,null,null,null,null,null,null,null,null,null,null,null,null,null,null,null,null,null,null,null,null,null,"A futtat�s id�tartama: 0.17 mp (0 p)",null,null,null,null,null,null,null,null,null,null,null,null,null,null,null,null,"A futtat�s id�tartama: 0.17 mp (0 p)"]