{"text_format":"1","workbook":"xlsx","n_sheets":3,"sheets":["munkarend","outputmunkarend","outputmunkarendora"],"not_rendered":{"charts":0,"images":0,"macros":1,"external_links":0,"defined_names":1,"comments":0,"pivot_tables":3},"unopened":[],"bounds":{"document_bytes":16777216,"sheet_cells":100000,"rows_first":2000,"rows_last":500,"rows_between":2000,"halvings":0,"cell_chars":16384,"cell_head_chars":4096},"cells_cut":0,"cells_raw":0,"read":"whole","date_system":"1900"}

{"sheet":"munkarend","index":0,"n_rows":19,"n_cols":41,"rows_kept":19,"cut":false,"hidden":false,"merged":[]}
["azonosito","2021-10-01","2021-10-02","2021-10-03","2021-10-04","2021-10-05","2021-10-06","2021-10-07","2021-10-08","2021-10-09","2021-10-10","2021-10-11","2021-10-12","2021-10-13","2021-10-14","2021-10-15","2021-10-16","2021-10-17","2021-10-18","2021-10-19","2021-10-20","2021-10-21","2021-10-22","2021-10-23","2021-10-24","2021-10-25","2021-10-26","2021-10-27","2021-10-28","2021-10-29","2021-10-30","2021-10-31","Beosztás szerinti munkaidő","pihenőnap","munkaszüneti nap","munkanap","összes nap","megjegyzés","Kód",null,"Ellenőrzés"]
[1,8,"P","P",8,8,8,8,8,"P","P",8,8,8,8,8,"P","P",8,8,8,8,8,"P","P",8,8,8,8,8,"P","P",{"$f":"SUM(B2:AF2)","v":168},{"$f":"COUNTIF($B2:$AF2,\"P\")","v":10},{"$f":"COUNTIF($B2:$AF2,\"U\")","v":0},{"$f":"COUNTIF(B2:AF2,\">0,1\")","v":21},{"$f":"SUM(AH2:AJ2)","v":31},null,1,"Munkanap",{"$f":"17*31-AO3-AO4","v":332}]
[2,"P",12,12,12,"P","P","P",12,12,12,"P","P","P",12,12,12,"P","P","P","P","P",12,12,12,"P","P","P",12,12,"P","P",{"$f":"SUM(B3:AF3)","v":168},{"$f":"COUNTIF($B3:$AF3,\"P\")","v":17},{"$f":"COUNTIF($B3:$AF3,\"U\")","v":0},{"$f":"COUNTIF(B3:AF3,\">0,1\")","v":14},{"$f":"SUM(AH3:AJ3)","v":31},null,2,"Pihenőnap",{"$f":"COUNTIF($B$2:$AF$18,\"P\")","v":194}]
[3,8,"P","P",8,8,8,8,8,"P","P",8,8,8,8,8,"P","P",8,8,8,8,8,"P","P",8,8,8,8,8,"P","P",168,10,0,21,31,null,3,"Munkaszüneti nap",{"$f":"COUNTIF($B$2:$AF$18,\"U\")","v":1}]
[4,4,"P","P",4,4,4,4,4,"P","P",4,4,4,4,4,"P","P",4,4,4,4,4,"P","P",4,4,4,4,4,"P","P",84,10,0,21,31,"részm 4 órás",null,"összes nap",{"$f":"SUM(AO2:AO4)","v":527}]
[5,"U","P","P",8,8,8,8,8,"P","P",8,8,8,8,8,"P","P",8,8,8,8,8,"P","P",8,8,8,8,8,"P","P",160,10,1,20,31,null,null,"17*31"]
[6,6,"P","P",6,6,6,6,6,"P","P",6,6,6,6,6,"P","P",6,6,6,6,6,"P","P",6,6,6,6,6,"P","P",126,10,0,21,31,"részm 6 órás"]
[7,7,"P","P",7,7,7,7,7,"P","P",7,7,7,7,7,"P","P",7,7,7,7,7,"P","P",7,7,7,7,7,"P","P",147,10,0,21,31,"részm 7 órás"]
[8,8,"P","P",8,8,8,8,8,"P","P",8,8,8,8,8,"P","P",8,8,8,8,8,"P","P",8,8,8,8,8,"P","P",168,10,0,21,31]
[9,8,"P","P",8,8,8,8,8,"P","P",8,8,8,8,8,"P","P",8,8,8,8,8,"P","P",8,8,8,8,8,"P","P",168,10,0,21,31]
[10,8,"P","P",8,8,8,8,8,"P","P",8,8,8,8,8,"P","P",8,8,8,8,8,"P","P",8,8,8,8,8,"P","P",168,10,0,21,31]
[11,8,"P","P",8,8,8,8,8,"P","P",8,8,8,8,8,"P","P",8,8,8,8,8,"P","P",8,8,8,8,8,"P","P",168,10,0,21,31]
[12,8,"P","P",8,8,8,8,8,"P","P",8,8,8,8,8,"P","P",8,8,8,8,8,"P","P",8,8,8,8,8,"P","P",168,10,0,21,31]
[13,8,"P","P",8,8,8,8,8,"P","P",8,8,8,8,8,"P","P",8,8,8,8,8,"P","P",8,8,8,8,8,"P","P",168,10,0,21,31]
[14,8,"P","P",8,8,8,8,8,"P","P",8,8,8,8,8,"P","P",8,8,8,8,8,"P","P",8,8,8,8,8,"P","P",168,10,0,21,31]
[15,8,"P","P",8,8,8,8,8,"P","P",8,8,8,8,8,"P","P",8,8,8,8,8,"P","P",8,8,8,8,8,"P","P",168,10,0,21,31]
[16,8,"P","P",8,8,8,8,8,"P","P",8,8,8,8,8,"P","P",8,8,8,8,8,"P","P",8,8,8,8,8,"P","P",168,10,0,21,31]
[17,"P","P","P","P","P","P","P",1,"P","P","P","P","P","P",1,"P","P","P","P","P","P",1,"P","P","P","P","P","P",1,"P","P",4,27,0,4,31,"részm 0,2 órás"]
[null,null,null,null,null,null,null,null,null,null,null,null,null,null,null,null,null,null,null,null,null,null,null,null,null,null,null,null,null,null,null,null,{"$f":"SUM(AG2:AG18)","v":2537},{"$f":"SUM(AH2:AH18)","v":194},1,332,527]

{"sheet":"outputmunkarend","index":1,"n_rows":1211,"n_cols":8,"rows_kept":1211,"cut":false,"hidden":false,"merged":[]}
["azonosito","kod","datum1","datum2",null,null,"Ellenőrzés 1"]
[1,1,"2021-10-01","2021-10-01",null,null,"Sorcímkék","Mennyiség / kod"]
[1,1,"2021-10-02","2021-10-02",null,null,1,527]
[1,2,"2021-10-02","2021-10-02",null,null,2,194]
[1,1,"2021-10-03","2021-10-03",null,null,3,1]
[1,2,"2021-10-03","2021-10-03",null,null,"(üres)"]
[1,1,"2021-10-04","2021-10-04",null,null,"Végösszeg",722]
[1,1,"2021-10-05","2021-10-05"]
[1,1,"2021-10-06","2021-10-06",null,null,"Ellenőrzés 2"]
[1,1,"2021-10-07","2021-10-07",null,null,"Sorcímkék","Mennyiség / kod"]
[1,1,"2021-10-08","2021-10-08",null,null,1,41]
[1,1,"2021-10-09","2021-10-09",null,null,2,48]
[1,2,"2021-10-09","2021-10-09",null,null,3,41]
[1,1,"2021-10-10","2021-10-10",null,null,4,41]
[1,2,"2021-10-10","2021-10-10",null,null,5,42]
[1,1,"2021-10-11","2021-10-11",null,null,6,41]
[1,1,"2021-10-12","2021-10-12",null,null,7,41]
[1,1,"2021-10-13","2021-10-13",null,null,8,41]
[1,1,"2021-10-14","2021-10-14",null,null,9,41]
[1,1,"2021-10-15","2021-10-15",null,null,10,41]
[1,1,"2021-10-16","2021-10-16",null,null,11,41]
[1,2,"2021-10-16","2021-10-16",null,null,12,41]
[1,1,"2021-10-17","2021-10-17",null,null,13,41]
[1,2,"2021-10-17","2021-10-17",null,null,14,41]
[1,1,"2021-10-18","2021-10-18",null,null,15,41]
[1,1,"2021-10-19","2021-10-19",null,null,16,41]
[1,1,"2021-10-20","2021-10-20",null,null,17,58]
[1,1,"2021-10-21","2021-10-21",null,null,"(üres)"]
[1,1,"2021-10-22","2021-10-22",null,null,"Végösszeg",722]
[1,1,"2021-10-23","2021-10-23"]
[1,2,"2021-10-23","2021-10-23"]
[1,1,"2021-10-24","2021-10-24"]
[1,2,"2021-10-24","2021-10-24"]
[1,1,"2021-10-25","2021-10-25"]
[1,1,"2021-10-26","2021-10-26"]
[1,1,"2021-10-27","2021-10-27"]
[1,1,"2021-10-28","2021-10-28"]
[1,1,"2021-10-29","2021-10-29"]
[1,1,"2021-10-30","2021-10-30"]
[1,2,"2021-10-30","2021-10-30"]
[1,1,"2021-10-31","2021-10-31"]
[1,2,"2021-10-31","2021-10-31"]
[2,1,"2021-10-01","2021-10-01"]
[2,2,"2021-10-01","2021-10-01"]
[2,1,"2021-10-02","2021-10-02"]
[2,1,"2021-10-03","2021-10-03"]
[2,1,"2021-10-04","2021-10-04"]
[2,1,"2021-10-05","2021-10-05"]
[2,2,"2021-10-05","2021-10-05"]
[2,1,"2021-10-06","2021-10-06"]
[2,2,"2021-10-06","2021-10-06"]
[2,1,"2021-10-07","2021-10-07"]
[2,2,"2021-10-07","2021-10-07"]
[2,1,"2021-10-08","2021-10-08"]
[2,1,"2021-10-09","2021-10-09"]
[2,1,"2021-10-10","2021-10-10"]
[2,1,"2021-10-11","2021-10-11"]
[2,2,"2021-10-11","2021-10-11"]
[2,1,"2021-10-12","2021-10-12"]
[2,2,"2021-10-12","2021-10-12"]
[2,1,"2021-10-13","2021-10-13"]
[2,2,"2021-10-13","2021-10-13"]
[2,1,"2021-10-14","2021-10-14"]
[2,1,"2021-10-15","2021-10-15"]
[2,1,"2021-10-16","2021-10-16"]
[2,1,"2021-10-17","2021-10-17"]
[2,2,"2021-10-17","2021-10-17"]
[2,1,"2021-10-18","2021-10-18"]
[2,2,"2021-10-18","2021-10-18"]
[2,1,"2021-10-19","2021-10-19"]
[2,2,"2021-10-19","2021-10-19"]
[2,1,"2021-10-20","2021-10-20"]
[2,2,"2021-10-20","2021-10-20"]
[2,1,"2021-10-21","2021-10-21"]
[2,2,"2021-10-21","2021-10-21"]
[2,1,"2021-10-22","2021-10-22"]
[2,1,"2021-10-23","2021-10-23"]
[2,1,"2021-10-24","2021-10-24"]
[2,1,"2021-10-25","2021-10-25"]
[2,2,"2021-10-25","2021-10-25"]
[2,1,"2021-10-26","2021-10-26"]
[2,2,"2021-10-26","2021-10-26"]
[2,1,"2021-10-27","2021-10-27"]
[2,2,"2021-10-27","2021-10-27"]
[2,1,"2021-10-28","2021-10-28"]
[2,1,"2021-10-29","2021-10-29"]
[2,1,"2021-10-30","2021-10-30"]
[2,2,"2021-10-30","2021-10-30"]
[2,1,"2021-10-31","2021-10-31"]
[2,2,"2021-10-31","2021-10-31"]
[3,1,"2021-10-01","2021-10-01"]
[3,1,"2021-10-02","2021-10-02"]
[3,2,"2021-10-02","2021-10-02"]
[3,1,"2021-10-03","2021-10-03"]
[3,2,"2021-10-03","2021-10-03"]
[3,1,"2021-10-04","2021-10-04"]
[3,1,"2021-10-05","2021-10-05"]
[3,1,"2021-10-06","2021-10-06"]
[3,1,"2021-10-07","2021-10-07"]
[3,1,"2021-10-08","2021-10-08"]
[3,1,"2021-10-09","2021-10-09"]
[3,2,"2021-10-09","2021-10-09"]
[3,1,"2021-10-10","2021-10-10"]
[3,2,"2021-10-10","2021-10-10"]
[3,1,"2021-10-11","2021-10-11"]
[3,1,"2021-10-12","2021-10-12"]
[3,1,"2021-10-13","2021-10-13"]
[3,1,"2021-10-14","2021-10-14"]
[3,1,"2021-10-15","2021-10-15"]
[3,1,"2021-10-16","2021-10-16"]
[3,2,"2021-10-16","2021-10-16"]
[3,1,"2021-10-17","2021-10-17"]
[3,2,"2021-10-17","2021-10-17"]
[3,1,"2021-10-18","2021-10-18"]
[3,1,"2021-10-19","2021-10-19"]
[3,1,"2021-10-20","2021-10-20"]
[3,1,"2021-10-21","2021-10-21"]
[3,1,"2021-10-22","2021-10-22"]
[3,1,"2021-10-23","2021-10-23"]
[3,2,"2021-10-23","2021-10-23"]
[3,1,"2021-10-24","2021-10-24"]
[3,2,"2021-10-24","2021-10-24"]
[3,1,"2021-10-25","2021-10-25"]
[3,1,"2021-10-26","2021-10-26"]
[3,1,"2021-10-27","2021-10-27"]
[3,1,"2021-10-28","2021-10-28"]
[3,1,"2021-10-29","2021-10-29"]
[3,1,"2021-10-30","2021-10-30"]
[3,2,"2021-10-30","2021-10-30"]
[3,1,"2021-10-31","2021-10-31"]
[3,2,"2021-10-31","2021-10-31"]
[4,1,"2021-10-01","2021-10-01"]
[4,1,"2021-10-02","2021-10-02"]
[4,2,"2021-10-02","2021-10-02"]
[4,1,"2021-10-03","2021-10-03"]
[4,2,"2021-10-03","2021-10-03"]
[4,1,"2021-10-04","2021-10-04"]
[4,1,"2021-10-05","2021-10-05"]
[4,1,"2021-10-06","2021-10-06"]
[4,1,"2021-10-07","2021-10-07"]
[4,1,"2021-10-08","2021-10-08"]
[4,1,"2021-10-09","2021-10-09"]
[4,2,"2021-10-09","2021-10-09"]
[4,1,"2021-10-10","2021-10-10"]
[4,2,"2021-10-10","2021-10-10"]
[4,1,"2021-10-11","2021-10-11"]
[4,1,"2021-10-12","2021-10-12"]
[4,1,"2021-10-13","2021-10-13"]
[4,1,"2021-10-14","2021-10-14"]
[4,1,"2021-10-15","2021-10-15"]
[4,1,"2021-10-16","2021-10-16"]
[4,2,"2021-10-16","2021-10-16"]
[4,1,"2021-10-17","2021-10-17"]
[4,2,"2021-10-17","2021-10-17"]
[4,1,"2021-10-18","2021-10-18"]
[4,1,"2021-10-19","2021-10-19"]
[4,1,"2021-10-20","2021-10-20"]
[4,1,"2021-10-21","2021-10-21"]
[4,1,"2021-10-22","2021-10-22"]
[4,1,"2021-10-23","2021-10-23"]
[4,2,"2021-10-23","2021-10-23"]
[4,1,"2021-10-24","2021-10-24"]
[4,2,"2021-10-24","2021-10-24"]
[4,1,"2021-10-25","2021-10-25"]
[4,1,"2021-10-26","2021-10-26"]
[4,1,"2021-10-27","2021-10-27"]
[4,1,"2021-10-28","2021-10-28"]
[4,1,"2021-10-29","2021-10-29"]
[4,1,"2021-10-30","2021-10-30"]
[4,2,"2021-10-30","2021-10-30"]
[4,1,"2021-10-31","2021-10-31"]
[4,2,"2021-10-31","2021-10-31"]
[5,1,"2021-10-01","2021-10-01"]
[5,3,"2021-10-01","2021-10-01"]
[5,1,"2021-10-02","2021-10-02"]
[5,2,"2021-10-02","2021-10-02"]
[5,1,"2021-10-03","2021-10-03"]
[5,2,"2021-10-03","2021-10-03"]
[5,1,"2021-10-04","2021-10-04"]
[5,1,"2021-10-05","2021-10-05"]
[5,1,"2021-10-06","2021-10-06"]
[5,1,"2021-10-07","2021-10-07"]
[5,1,"2021-10-08","2021-10-08"]
[5,1,"2021-10-09","2021-10-09"]
[5,2,"2021-10-09","2021-10-09"]
[5,1,"2021-10-10","2021-10-10"]
[5,2,"2021-10-10","2021-10-10"]
[5,1,"2021-10-11","2021-10-11"]
[5,1,"2021-10-12","2021-10-12"]
[5,1,"2021-10-13","2021-10-13"]
[5,1,"2021-10-14","2021-10-14"]
[5,1,"2021-10-15","2021-10-15"]
[5,1,"2021-10-16","2021-10-16"]
[5,2,"2021-10-16","2021-10-16"]
[5,1,"2021-10-17","2021-10-17"]
[5,2,"2021-10-17","2021-10-17"]
[5,1,"2021-10-18","2021-10-18"]
[5,1,"2021-10-19","2021-10-19"]
[5,1,"2021-10-20","2021-10-20"]
[5,1,"2021-10-21","2021-10-21"]
{"$rows_left_out":1012}
{"sheet":"outputmunkarendora","index":2,"n_rows":1210,"n_cols":9,"rows_kept":1210,"cut":false,"hidden":false,"merged":[]}
["azonosito","ora","datum1","datum2",null,null,"Ellenőrzés"]
[1,8,"2021-10-01","2021-10-01",null,null,"Sorcímkék","Összeg / ora","Ellenőrzés összes óra"]
[1,"P","2021-10-02","2021-10-02",null,null,1,168,{"$f":"VLOOKUP(outputmunkarendora!G3:G19,munkarend!A:AG,33,0)","v":168}]
[1,"P","2021-10-03","2021-10-03",null,null,2,168,{"$f":"VLOOKUP(outputmunkarendora!G4:G20,munkarend!A:AG,33,0)","v":168}]
[1,8,"2021-10-04","2021-10-04",null,null,3,168,{"$f":"VLOOKUP(outputmunkarendora!G5:G21,munkarend!A:AG,33,0)","v":168}]
[1,8,"2021-10-05","2021-10-05",null,null,4,84,{"$f":"VLOOKUP(outputmunkarendora!G6:G22,munkarend!A:AG,33,0)","v":84}]
[1,8,"2021-10-06","2021-10-06",null,null,5,160,{"$f":"VLOOKUP(outputmunkarendora!G7:G23,munkarend!A:AG,33,0)","v":160}]
[1,8,"2021-10-07","2021-10-07",null,null,6,126,{"$f":"VLOOKUP(outputmunkarendora!G8:G24,munkarend!A:AG,33,0)","v":126}]
[1,8,"2021-10-08","2021-10-08",null,null,7,147,{"$f":"VLOOKUP(outputmunkarendora!G9:G25,munkarend!A:AG,33,0)","v":147}]
[1,"P","2021-10-09","2021-10-09",null,null,8,168,{"$f":"VLOOKUP(outputmunkarendora!G10:G26,munkarend!A:AG,33,0)","v":168}]
[1,"P","2021-10-10","2021-10-10",null,null,9,168,{"$f":"VLOOKUP(outputmunkarendora!G11:G27,munkarend!A:AG,33,0)","v":168}]
[1,8,"2021-10-11","2021-10-11",null,null,10,168,{"$f":"VLOOKUP(outputmunkarendora!G12:G28,munkarend!A:AG,33,0)","v":168}]
[1,8,"2021-10-12","2021-10-12",null,null,11,168,{"$f":"VLOOKUP(outputmunkarendora!G13:G29,munkarend!A:AG,33,0)","v":168}]
[1,8,"2021-10-13","2021-10-13",null,null,12,168,{"$f":"VLOOKUP(outputmunkarendora!G14:G30,munkarend!A:AG,33,0)","v":168}]
[1,8,"2021-10-14","2021-10-14",null,null,13,168,{"$f":"VLOOKUP(outputmunkarendora!G15:G31,munkarend!A:AG,33,0)","v":168}]
[1,8,"2021-10-15","2021-10-15",null,null,14,168,{"$f":"VLOOKUP(outputmunkarendora!G16:G32,munkarend!A:AG,33,0)","v":168}]
[1,"P","2021-10-16","2021-10-16",null,null,15,168,{"$f":"VLOOKUP(outputmunkarendora!G17:G33,munkarend!A:AG,33,0)","v":168}]
[1,"P","2021-10-17","2021-10-17",null,null,16,168,{"$f":"VLOOKUP(outputmunkarendora!G18:G34,munkarend!A:AG,33,0)","v":168}]
[1,8,"2021-10-18","2021-10-18",null,null,17,4,{"$f":"VLOOKUP(outputmunkarendora!G19:G35,munkarend!A:AG,33,0)","v":4}]
[1,8,"2021-10-19","2021-10-19",null,null,"(üres)"]
[1,8,"2021-10-20","2021-10-20",null,null,"Végösszeg",2537,{"$f":"SUM(I3:I19)","v":2537}]
[1,8,"2021-10-21","2021-10-21"]
[1,8,"2021-10-22","2021-10-22"]
[1,"P","2021-10-23","2021-10-23"]
[1,"P","2021-10-24","2021-10-24"]
[1,8,"2021-10-25","2021-10-25"]
[1,8,"2021-10-26","2021-10-26"]
[1,8,"2021-10-27","2021-10-27"]
[1,8,"2021-10-28","2021-10-28"]
[1,8,"2021-10-29","2021-10-29"]
[1,"P","2021-10-30","2021-10-30"]
[1,"P","2021-10-31","2021-10-31"]
[2,"P","2021-10-01","2021-10-01"]
[2,12,"2021-10-02","2021-10-02"]
[2,12,"2021-10-03","2021-10-03"]
[2,12,"2021-10-04","2021-10-04"]
[2,"P","2021-10-05","2021-10-05"]
[2,"P","2021-10-06","2021-10-06"]
[2,"P","2021-10-07","2021-10-07"]
[2,12,"2021-10-08","2021-10-08"]
[2,12,"2021-10-09","2021-10-09"]
[2,12,"2021-10-10","2021-10-10"]
[2,"P","2021-10-11","2021-10-11"]
[2,"P","2021-10-12","2021-10-12"]
[2,"P","2021-10-13","2021-10-13"]
[2,12,"2021-10-14","2021-10-14"]
[2,12,"2021-10-15","2021-10-15"]
[2,12,"2021-10-16","2021-10-16"]
[2,"P","2021-10-17","2021-10-17"]
[2,"P","2021-10-18","2021-10-18"]
[2,"P","2021-10-19","2021-10-19"]
[2,"P","2021-10-20","2021-10-20"]
[2,"P","2021-10-21","2021-10-21"]
[2,12,"2021-10-22","2021-10-22"]
[2,12,"2021-10-23","2021-10-23"]
[2,12,"2021-10-24","2021-10-24"]
[2,"P","2021-10-25","2021-10-25"]
[2,"P","2021-10-26","2021-10-26"]
[2,"P","2021-10-27","2021-10-27"]
[2,12,"2021-10-28","2021-10-28"]
[2,12,"2021-10-29","2021-10-29"]
[2,"P","2021-10-30","2021-10-30"]
[2,"P","2021-10-31","2021-10-31"]
[3,8,"2021-10-01","2021-10-01"]
[3,"P","2021-10-02","2021-10-02"]
[3,"P","2021-10-03","2021-10-03"]
[3,8,"2021-10-04","2021-10-04"]
[3,8,"2021-10-05","2021-10-05"]
[3,8,"2021-10-06","2021-10-06"]
[3,8,"2021-10-07","2021-10-07"]
[3,8,"2021-10-08","2021-10-08"]
[3,"P","2021-10-09","2021-10-09"]
[3,"P","2021-10-10","2021-10-10"]
[3,8,"2021-10-11","2021-10-11"]
[3,8,"2021-10-12","2021-10-12"]
[3,8,"2021-10-13","2021-10-13"]
[3,8,"2021-10-14","2021-10-14"]
[3,8,"2021-10-15","2021-10-15"]
[3,"P","2021-10-16","2021-10-16"]
[3,"P","2021-10-17","2021-10-17"]
[3,8,"2021-10-18","2021-10-18"]
[3,8,"2021-10-19","2021-10-19"]
[3,8,"2021-10-20","2021-10-20"]
[3,8,"2021-10-21","2021-10-21"]
[3,8,"2021-10-22","2021-10-22"]
[3,"P","2021-10-23","2021-10-23"]
[3,"P","2021-10-24","2021-10-24"]
[3,8,"2021-10-25","2021-10-25"]
[3,8,"2021-10-26","2021-10-26"]
[3,8,"2021-10-27","2021-10-27"]
[3,8,"2021-10-28","2021-10-28"]
[3,8,"2021-10-29","2021-10-29"]
[3,"P","2021-10-30","2021-10-30"]
[3,"P","2021-10-31","2021-10-31"]
[4,4,"2021-10-01","2021-10-01"]
[4,"P","2021-10-02","2021-10-02"]
[4,"P","2021-10-03","2021-10-03"]
[4,4,"2021-10-04","2021-10-04"]
[4,4,"2021-10-05","2021-10-05"]
[4,4,"2021-10-06","2021-10-06"]
[4,4,"2021-10-07","2021-10-07"]
[4,4,"2021-10-08","2021-10-08"]
[4,"P","2021-10-09","2021-10-09"]
[4,"P","2021-10-10","2021-10-10"]
[4,4,"2021-10-11","2021-10-11"]
[4,4,"2021-10-12","2021-10-12"]
[4,4,"2021-10-13","2021-10-13"]
[4,4,"2021-10-14","2021-10-14"]
[4,4,"2021-10-15","2021-10-15"]
[4,"P","2021-10-16","2021-10-16"]
[4,"P","2021-10-17","2021-10-17"]
[4,4,"2021-10-18","2021-10-18"]
[4,4,"2021-10-19","2021-10-19"]
[4,4,"2021-10-20","2021-10-20"]
[4,4,"2021-10-21","2021-10-21"]
[4,4,"2021-10-22","2021-10-22"]
[4,"P","2021-10-23","2021-10-23"]
[4,"P","2021-10-24","2021-10-24"]
[4,4,"2021-10-25","2021-10-25"]
[4,4,"2021-10-26","2021-10-26"]
[4,4,"2021-10-27","2021-10-27"]
[4,4,"2021-10-28","2021-10-28"]
[4,4,"2021-10-29","2021-10-29"]
[4,"P","2021-10-30","2021-10-30"]
[4,"P","2021-10-31","2021-10-31"]
[5,"U","2021-10-01","2021-10-01"]
[5,"P","2021-10-02","2021-10-02"]
[5,"P","2021-10-03","2021-10-03"]
[5,8,"2021-10-04","2021-10-04"]
[5,8,"2021-10-05","2021-10-05"]
[5,8,"2021-10-06","2021-10-06"]
[5,8,"2021-10-07","2021-10-07"]
[5,8,"2021-10-08","2021-10-08"]
[5,"P","2021-10-09","2021-10-09"]
[5,"P","2021-10-10","2021-10-10"]
[5,8,"2021-10-11","2021-10-11"]
[5,8,"2021-10-12","2021-10-12"]
[5,8,"2021-10-13","2021-10-13"]
[5,8,"2021-10-14","2021-10-14"]
[5,8,"2021-10-15","2021-10-15"]
[5,"P","2021-10-16","2021-10-16"]
[5,"P","2021-10-17","2021-10-17"]
[5,8,"2021-10-18","2021-10-18"]
[5,8,"2021-10-19","2021-10-19"]
[5,8,"2021-10-20","2021-10-20"]
[5,8,"2021-10-21","2021-10-21"]
[5,8,"2021-10-22","2021-10-22"]
[5,"P","2021-10-23","2021-10-23"]
[5,"P","2021-10-24","2021-10-24"]
[5,8,"2021-10-25","2021-10-25"]
[5,8,"2021-10-26","2021-10-26"]
[5,8,"2021-10-27","2021-10-27"]
[5,8,"2021-10-28","2021-10-28"]
[5,8,"2021-10-29","2021-10-29"]
[5,"P","2021-10-30","2021-10-30"]
[5,"P","2021-10-31","2021-10-31"]
[6,6,"2021-10-01","2021-10-01"]
[6,"P","2021-10-02","2021-10-02"]
[6,"P","2021-10-03","2021-10-03"]
[6,6,"2021-10-04","2021-10-04"]
[6,6,"2021-10-05","2021-10-05"]
[6,6,"2021-10-06","2021-10-06"]
[6,6,"2021-10-07","2021-10-07"]
[6,6,"2021-10-08","2021-10-08"]
[6,"P","2021-10-09","2021-10-09"]
[6,"P","2021-10-10","2021-10-10"]
[6,6,"2021-10-11","2021-10-11"]
[6,6,"2021-10-12","2021-10-12"]
[6,6,"2021-10-13","2021-10-13"]
[6,6,"2021-10-14","2021-10-14"]
[6,6,"2021-10-15","2021-10-15"]
[6,"P","2021-10-16","2021-10-16"]
[6,"P","2021-10-17","2021-10-17"]
[6,6,"2021-10-18","2021-10-18"]
[6,6,"2021-10-19","2021-10-19"]
[6,6,"2021-10-20","2021-10-20"]
[6,6,"2021-10-21","2021-10-21"]
[6,6,"2021-10-22","2021-10-22"]
[6,"P","2021-10-23","2021-10-23"]
[6,"P","2021-10-24","2021-10-24"]
[6,6,"2021-10-25","2021-10-25"]
[6,6,"2021-10-26","2021-10-26"]
[6,6,"2021-10-27","2021-10-27"]
[6,6,"2021-10-28","2021-10-28"]
[6,6,"2021-10-29","2021-10-29"]
[6,"P","2021-10-30","2021-10-30"]
[6,"P","2021-10-31","2021-10-31"]
[7,7,"2021-10-01","2021-10-01"]
[7,"P","2021-10-02","2021-10-02"]
[7,"P","2021-10-03","2021-10-03"]
[7,7,"2021-10-04","2021-10-04"]
[7,7,"2021-10-05","2021-10-05"]
[7,7,"2021-10-06","2021-10-06"]
[7,7,"2021-10-07","2021-10-07"]
[7,7,"2021-10-08","2021-10-08"]
[7,"P","2021-10-09","2021-10-09"]
[7,"P","2021-10-10","2021-10-10"]
[7,7,"2021-10-11","2021-10-11"]
[7,7,"2021-10-12","2021-10-12"]
[7,7,"2021-10-13","2021-10-13"]
{"$rows_left_out":1010}