{"text_format":"1","workbook":"xlsx","n_sheets":3,"sheets":["idoadat","outputidoadat","outputidoadatora"],"not_rendered":{"charts":0,"images":0,"macros":1,"external_links":0,"defined_names":0,"comments":0,"pivot_tables":3},"unopened":[],"bounds":{"document_bytes":16777216,"sheet_cells":100000,"rows_first":2000,"rows_last":500,"rows_between":2000,"halvings":0,"cell_chars":16384,"cell_head_chars":4096},"cells_cut":0,"cells_raw":0,"read":"whole","date_system":"1900"}

{"sheet":"idoadat","index":0,"n_rows":19,"n_cols":40,"rows_kept":19,"cut":false,"hidden":false,"merged":[]}
["azonosito","2021-10-01","2021-10-02","2021-10-03","2021-10-04","2021-10-05","2021-10-06","2021-10-07","2021-10-08","2021-10-09","2021-10-10","2021-10-11","2021-10-12","2021-10-13","2021-10-14","2021-10-15","2021-10-16","2021-10-17","2021-10-18","2021-10-19","2021-10-20","2021-10-21","2021-10-22","2021-10-23","2021-10-24","2021-10-25","2021-10-26","2021-10-27","2021-10-28","2021-10-29","2021-10-30","2021-10-31","szabadság","betegség","ledolgozott nap","ledolgozott óra",null,"Kód",null,"Ellenőrzés"]
[1,"B","P","P",8,8,8,8,8,"P","P",8,8,8,8,8,"P","P",8,8,8,8,8,"P","P",8,8,8,8,8,"P","B",{"$f":"COUNTIF($B2:$AF2,\"SZ\")","v":0},{"$f":"COUNTIF($B2:$AF2,\"B\")","v":2},{"$f":"COUNT($B2:$AF2)","v":20},{"$f":"SUM(B2:AF2)","v":160},null,"-","Munkanap",{"$f":"17*31-AN3-AN4-AN5-AN6","v":310}]
[2,"P",12,12,12,"P","P","P",12,12,12,"P","P","P",12,12,12,"P","P","P","P","P",12,12,12,"P","P","P",12,12,"P","P",{"$f":"COUNTIF($B3:$AF3,\"SZ\")","v":0},{"$f":"COUNTIF($B3:$AF3,\"B\")","v":0},{"$f":"COUNT($B3:$AF3)","v":14},{"$f":"SUM(B3:AF3)","v":168},null,4,"szabadság",{"$f":"COUNTIF($B$2:$AF$18,\"sz\")","v":21}]
[3,8,"P","P",8,8,8,8,8,"P","P",8,8,8,8,8,"P","P",8,8,8,8,8,"P","P",8,8,8,8,8,"P","P",0,0,21,168,null,34,"betegség",{"$f":"COUNTIF($B$2:$AF$18,\"b\")","v":15}]
[4,4,"P","P",4,"SZ","SZ","SZ","SZ","P","P",4,4,4,4,4,"P","P",4,4,4,4,4,"P","P","SZ","SZ","SZ","SZ","SZ","P","P",9,0,12,48,null,"-","pihenő",{"$f":"COUNTIF($B$2:$AF$18,\"p\")","v":180}]
[5,"U","P","P","SZ","SZ",8,8,8,"P","P",8,8,8,8,8,"P","P",8,8,8,8,8,"P","P",8,8,8,8,8,"P","P",2,0,18,144,null,"-","munkaszüneti nap",{"$f":"COUNTIF($B$2:$AF$18,\"u\")","v":1}]
[6,6,"P","P",6,6,6,6,6,"P","P",6,6,6,6,6,"P","P",6,6,6,6,6,"P","P",6,6,6,6,6,"P","P",0,0,21,126,null,null,"összes nap",{"$f":"SUM(AN2:AN6)","v":527}]
[7,7,"P","P",7,7,7,7,7,"P","P",7,7,7,7,7,"P","P",7,7,7,7,7,"P","P",7,7,7,7,7,"P","P",0,0,21,147,null,null,"17*31"]
[8,8,"P","P","SZ",8,8,8,8,"P","P",8,8,8,8,"B","B","B","B",8,8,8,8,"P","P",8,8,8,8,8,"P","P",1,4,18,144]
[9,8,"P","P",8,8,8,8,8,"P","P",8,8,8,8,8,"P","P","SZ",8,8,8,8,"P","P",8,8,8,8,8,"P","P",1,0,20,160]
[10,8,"P","P",8,8,"SZ",8,8,"P","P",8,8,8,8,8,"P","P",8,8,8,8,8,"P","P",8,8,8,8,8,"P","P",1,0,20,160]
[11,8,"P","P",8,8,8,8,8,"P","P",8,8,8,8,8,"P","P",8,8,8,8,8,"SZ","SZ",8,8,8,8,8,"P","P",2,0,21,168]
[12,8,"P","P",8,8,8,8,8,"P","P",8,8,8,8,8,"P","P",8,8,8,8,8,"P","P",8,8,8,8,8,"P","P",0,0,21,168]
[13,8,"P","P",8,8,8,8,8,"P","P",8,8,8,8,8,"P","P",8,8,8,8,8,"P","SZ",8,8,8,8,8,"P","P",1,0,21,168]
[14,8,"P","P",8,8,8,8,8,"P","P","SZ",8,8,8,8,"P","P",8,8,8,8,8,"P","P",8,8,8,8,8,"P","P",1,0,20,160]
[15,8,"P","P",8,8,8,8,8,"P","P",8,8,"SZ","SZ",8,"P","P",8,8,8,8,8,"P","P",8,8,8,8,8,"P","P",2,0,19,152]
[16,8,"P","P",8,8,8,8,8,"P","P",8,8,8,8,8,"P","P",8,8,8,8,8,"P","P",8,8,8,8,8,"P","P",0,0,21,168]
[17,"B","B","B","B","B","B","B","B","P","P","P","P","P","P","SZ","P","P","P","P","P","P",1,"P","P","P","P","P","P",1,"P","B",1,9,2,2]
[null,null,null,null,null,null,null,null,null,null,null,null,null,null,null,null,null,null,null,null,null,null,null,null,null,null,null,null,null,null,null,null,{"$f":"SUM(AG2:AG18)","v":21},{"$f":"SUM(AH2:AH18)","v":15},{"$f":"SUM(AI2:AI18)","v":310},{"$f":"SUM(AJ2:AJ18)","v":2411}]

{"sheet":"outputidoadat","index":1,"n_rows":37,"n_cols":13,"rows_kept":37,"cut":false,"hidden":false,"merged":[]}
["azonosito","kod","datum1","datum2",null,"Ellenőrzés"]
[1,34,"2021-10-01","2021-10-01",null,"Sorcímkék","Mennyiség / kod"]
[1,34,"2021-10-31","2021-10-31",null,4,21]
[4,4,"2021-10-05","2021-10-05",null,34,15]
[4,4,"2021-10-06","2021-10-06",null,"(üres)"]
[4,4,"2021-10-07","2021-10-07",null,"Végösszeg",36]
[4,4,"2021-10-08","2021-10-08"]
[4,4,"2021-10-25","2021-10-25",null,"Mennyiség / kod","Oszlopcímkék"]
[4,4,"2021-10-26","2021-10-26",null,"Sorcímkék",4,34,"(üres)","Végösszeg"]
[4,4,"2021-10-27","2021-10-27",null,1,null,2,null,2,{"$f":"VLOOKUP($F$10:$F$20,idoadat!$A:$AH,33,0)","v":0},{"$f":"VLOOKUP($F$10:$F$20,idoadat!$A:$AH,34,0)","v":2}]
[4,4,"2021-10-28","2021-10-28",null,4,9,null,null,9,{"$f":"VLOOKUP($F$10:$F$20,idoadat!$A:$AH,33,0)","v":9},{"$f":"VLOOKUP($F$10:$F$20,idoadat!$A:$AH,34,0)","v":0}]
[4,4,"2021-10-29","2021-10-29",null,5,2,null,null,2,{"$f":"VLOOKUP($F$10:$F$20,idoadat!$A:$AH,33,0)","v":2},{"$f":"VLOOKUP($F$10:$F$20,idoadat!$A:$AH,34,0)","v":0}]
[5,4,"2021-10-04","2021-10-04",null,8,1,4,null,5,{"$f":"VLOOKUP($F$10:$F$20,idoadat!$A:$AH,33,0)","v":1},{"$f":"VLOOKUP($F$10:$F$20,idoadat!$A:$AH,34,0)","v":4}]
[5,4,"2021-10-05","2021-10-05",null,9,1,null,null,1,{"$f":"VLOOKUP($F$10:$F$20,idoadat!$A:$AH,33,0)","v":1},{"$f":"VLOOKUP($F$10:$F$20,idoadat!$A:$AH,34,0)","v":0}]
[8,4,"2021-10-04","2021-10-04",null,10,1,null,null,1,{"$f":"VLOOKUP($F$10:$F$20,idoadat!$A:$AH,33,0)","v":1},{"$f":"VLOOKUP($F$10:$F$20,idoadat!$A:$AH,34,0)","v":0}]
[8,34,"2021-10-15","2021-10-15",null,11,2,null,null,2,{"$f":"VLOOKUP($F$10:$F$20,idoadat!$A:$AH,33,0)","v":2},{"$f":"VLOOKUP($F$10:$F$20,idoadat!$A:$AH,34,0)","v":0}]
[8,34,"2021-10-16","2021-10-16",null,13,1,null,null,1,{"$f":"VLOOKUP($F$10:$F$20,idoadat!$A:$AH,33,0)","v":1},{"$f":"VLOOKUP($F$10:$F$20,idoadat!$A:$AH,34,0)","v":0}]
[8,34,"2021-10-17","2021-10-17",null,14,1,null,null,1,{"$f":"VLOOKUP($F$10:$F$20,idoadat!$A:$AH,33,0)","v":1},{"$f":"VLOOKUP($F$10:$F$20,idoadat!$A:$AH,34,0)","v":0}]
[8,34,"2021-10-18","2021-10-18",null,15,2,null,null,2,{"$f":"VLOOKUP($F$10:$F$20,idoadat!$A:$AH,33,0)","v":2},{"$f":"VLOOKUP($F$10:$F$20,idoadat!$A:$AH,34,0)","v":0}]
[9,4,"2021-10-18","2021-10-18",null,17,1,9,null,10,{"$f":"VLOOKUP($F$10:$F$20,idoadat!$A:$AH,33,0)","v":1},{"$f":"VLOOKUP($F$10:$F$20,idoadat!$A:$AH,34,0)","v":9}]
[10,4,"2021-10-06","2021-10-06",null,"(üres)"]
[11,4,"2021-10-23","2021-10-23",null,"Végösszeg",21,15,null,36,{"$f":"SUM(K10:K20)","v":21},{"$f":"SUM(L10:L20)","v":15},{"$f":"SUM(K22:L22)","v":36}]
[11,4,"2021-10-24","2021-10-24"]
[13,4,"2021-10-24","2021-10-24"]
[14,4,"2021-10-11","2021-10-11"]
[15,4,"2021-10-13","2021-10-13"]
[15,4,"2021-10-14","2021-10-14"]
[17,34,"2021-10-01","2021-10-01"]
[17,34,"2021-10-02","2021-10-02"]
[17,34,"2021-10-03","2021-10-03"]
[17,34,"2021-10-04","2021-10-04"]
[17,34,"2021-10-05","2021-10-05"]
[17,34,"2021-10-06","2021-10-06"]
[17,34,"2021-10-07","2021-10-07"]
[17,34,"2021-10-08","2021-10-08"]
[17,4,"2021-10-15","2021-10-15"]
[17,34,"2021-10-31","2021-10-31"]

{"sheet":"outputidoadatora","index":2,"n_rows":528,"n_cols":8,"rows_kept":528,"cut":false,"hidden":false,"merged":[]}
["azonosito","ora","datum1","datum2",null,"Ellenőrzés"]
[1,"B","2021-10-01","2021-10-01",null,"Sorcímkék","Összeg / ora"]
[1,"P","2021-10-02","2021-10-02",null,1,160,{"$f":"VLOOKUP(F3:F19,idoadat!A:AJ,36,0)","v":160}]
[1,"P","2021-10-03","2021-10-03",null,2,168,{"$f":"VLOOKUP(F4:F20,idoadat!A:AJ,36,0)","v":168}]
[1,8,"2021-10-04","2021-10-04",null,3,168,{"$f":"VLOOKUP(F5:F21,idoadat!A:AJ,36,0)","v":168}]
[1,8,"2021-10-05","2021-10-05",null,4,48,{"$f":"VLOOKUP(F6:F22,idoadat!A:AJ,36,0)","v":48}]
[1,8,"2021-10-06","2021-10-06",null,5,144,{"$f":"VLOOKUP(F7:F23,idoadat!A:AJ,36,0)","v":144}]
[1,8,"2021-10-07","2021-10-07",null,6,126,{"$f":"VLOOKUP(F8:F24,idoadat!A:AJ,36,0)","v":126}]
[1,8,"2021-10-08","2021-10-08",null,7,147,{"$f":"VLOOKUP(F9:F25,idoadat!A:AJ,36,0)","v":147}]
[1,"P","2021-10-09","2021-10-09",null,8,144,{"$f":"VLOOKUP(F10:F26,idoadat!A:AJ,36,0)","v":144}]
[1,"P","2021-10-10","2021-10-10",null,9,160,{"$f":"VLOOKUP(F11:F27,idoadat!A:AJ,36,0)","v":160}]
[1,8,"2021-10-11","2021-10-11",null,10,160,{"$f":"VLOOKUP(F12:F28,idoadat!A:AJ,36,0)","v":160}]
[1,8,"2021-10-12","2021-10-12",null,11,168,{"$f":"VLOOKUP(F13:F29,idoadat!A:AJ,36,0)","v":168}]
[1,8,"2021-10-13","2021-10-13",null,12,168,{"$f":"VLOOKUP(F14:F30,idoadat!A:AJ,36,0)","v":168}]
[1,8,"2021-10-14","2021-10-14",null,13,168,{"$f":"VLOOKUP(F15:F31,idoadat!A:AJ,36,0)","v":168}]
[1,8,"2021-10-15","2021-10-15",null,14,160,{"$f":"VLOOKUP(F16:F32,idoadat!A:AJ,36,0)","v":160}]
[1,"P","2021-10-16","2021-10-16",null,15,152,{"$f":"VLOOKUP(F17:F33,idoadat!A:AJ,36,0)","v":152}]
[1,"P","2021-10-17","2021-10-17",null,16,168,{"$f":"VLOOKUP(F18:F34,idoadat!A:AJ,36,0)","v":168}]
[1,8,"2021-10-18","2021-10-18",null,17,2,{"$f":"VLOOKUP(F19:F35,idoadat!A:AJ,36,0)","v":2}]
[1,8,"2021-10-19","2021-10-19",null,"(üres)"]
[1,8,"2021-10-20","2021-10-20",null,"Végösszeg",2411,{"$f":"SUM(H3:H19)","v":2411}]
[1,8,"2021-10-21","2021-10-21"]
[1,8,"2021-10-22","2021-10-22"]
[1,"P","2021-10-23","2021-10-23"]
[1,"P","2021-10-24","2021-10-24"]
[1,8,"2021-10-25","2021-10-25"]
[1,8,"2021-10-26","2021-10-26"]
[1,8,"2021-10-27","2021-10-27"]
[1,8,"2021-10-28","2021-10-28"]
[1,8,"2021-10-29","2021-10-29"]
[1,"P","2021-10-30","2021-10-30"]
[1,"B","2021-10-31","2021-10-31"]
[2,"P","2021-10-01","2021-10-01"]
[2,12,"2021-10-02","2021-10-02"]
[2,12,"2021-10-03","2021-10-03"]
[2,12,"2021-10-04","2021-10-04"]
[2,"P","2021-10-05","2021-10-05"]
[2,"P","2021-10-06","2021-10-06"]
[2,"P","2021-10-07","2021-10-07"]
[2,12,"2021-10-08","2021-10-08"]
[2,12,"2021-10-09","2021-10-09"]
[2,12,"2021-10-10","2021-10-10"]
[2,"P","2021-10-11","2021-10-11"]
[2,"P","2021-10-12","2021-10-12"]
[2,"P","2021-10-13","2021-10-13"]
[2,12,"2021-10-14","2021-10-14"]
[2,12,"2021-10-15","2021-10-15"]
[2,12,"2021-10-16","2021-10-16"]
[2,"P","2021-10-17","2021-10-17"]
[2,"P","2021-10-18","2021-10-18"]
[2,"P","2021-10-19","2021-10-19"]
[2,"P","2021-10-20","2021-10-20"]
[2,"P","2021-10-21","2021-10-21"]
[2,12,"2021-10-22","2021-10-22"]
[2,12,"2021-10-23","2021-10-23"]
[2,12,"2021-10-24","2021-10-24"]
[2,"P","2021-10-25","2021-10-25"]
[2,"P","2021-10-26","2021-10-26"]
[2,"P","2021-10-27","2021-10-27"]
[2,12,"2021-10-28","2021-10-28"]
[2,12,"2021-10-29","2021-10-29"]
[2,"P","2021-10-30","2021-10-30"]
[2,"P","2021-10-31","2021-10-31"]
[3,8,"2021-10-01","2021-10-01"]
[3,"P","2021-10-02","2021-10-02"]
[3,"P","2021-10-03","2021-10-03"]
[3,8,"2021-10-04","2021-10-04"]
[3,8,"2021-10-05","2021-10-05"]
[3,8,"2021-10-06","2021-10-06"]
[3,8,"2021-10-07","2021-10-07"]
[3,8,"2021-10-08","2021-10-08"]
[3,"P","2021-10-09","2021-10-09"]
[3,"P","2021-10-10","2021-10-10"]
[3,8,"2021-10-11","2021-10-11"]
[3,8,"2021-10-12","2021-10-12"]
[3,8,"2021-10-13","2021-10-13"]
[3,8,"2021-10-14","2021-10-14"]
[3,8,"2021-10-15","2021-10-15"]
[3,"P","2021-10-16","2021-10-16"]
[3,"P","2021-10-17","2021-10-17"]
[3,8,"2021-10-18","2021-10-18"]
[3,8,"2021-10-19","2021-10-19"]
[3,8,"2021-10-20","2021-10-20"]
[3,8,"2021-10-21","2021-10-21"]
[3,8,"2021-10-22","2021-10-22"]
[3,"P","2021-10-23","2021-10-23"]
[3,"P","2021-10-24","2021-10-24"]
[3,8,"2021-10-25","2021-10-25"]
[3,8,"2021-10-26","2021-10-26"]
[3,8,"2021-10-27","2021-10-27"]
[3,8,"2021-10-28","2021-10-28"]
[3,8,"2021-10-29","2021-10-29"]
[3,"P","2021-10-30","2021-10-30"]
[3,"P","2021-10-31","2021-10-31"]
[4,4,"2021-10-01","2021-10-01"]
[4,"P","2021-10-02","2021-10-02"]
[4,"P","2021-10-03","2021-10-03"]
[4,4,"2021-10-04","2021-10-04"]
[4,"SZ","2021-10-05","2021-10-05"]
[4,"SZ","2021-10-06","2021-10-06"]
[4,"SZ","2021-10-07","2021-10-07"]
[4,"SZ","2021-10-08","2021-10-08"]
[4,"P","2021-10-09","2021-10-09"]
[4,"P","2021-10-10","2021-10-10"]
[4,4,"2021-10-11","2021-10-11"]
[4,4,"2021-10-12","2021-10-12"]
[4,4,"2021-10-13","2021-10-13"]
[4,4,"2021-10-14","2021-10-14"]
[4,4,"2021-10-15","2021-10-15"]
[4,"P","2021-10-16","2021-10-16"]
[4,"P","2021-10-17","2021-10-17"]
[4,4,"2021-10-18","2021-10-18"]
[4,4,"2021-10-19","2021-10-19"]
[4,4,"2021-10-20","2021-10-20"]
[4,4,"2021-10-21","2021-10-21"]
[4,4,"2021-10-22","2021-10-22"]
[4,"P","2021-10-23","2021-10-23"]
[4,"P","2021-10-24","2021-10-24"]
[4,"SZ","2021-10-25","2021-10-25"]
[4,"SZ","2021-10-26","2021-10-26"]
[4,"SZ","2021-10-27","2021-10-27"]
[4,"SZ","2021-10-28","2021-10-28"]
[4,"SZ","2021-10-29","2021-10-29"]
[4,"P","2021-10-30","2021-10-30"]
[4,"P","2021-10-31","2021-10-31"]
[5,"U","2021-10-01","2021-10-01"]
[5,"P","2021-10-02","2021-10-02"]
[5,"P","2021-10-03","2021-10-03"]
[5,"SZ","2021-10-04","2021-10-04"]
[5,"SZ","2021-10-05","2021-10-05"]
[5,8,"2021-10-06","2021-10-06"]
[5,8,"2021-10-07","2021-10-07"]
[5,8,"2021-10-08","2021-10-08"]
[5,"P","2021-10-09","2021-10-09"]
[5,"P","2021-10-10","2021-10-10"]
[5,8,"2021-10-11","2021-10-11"]
[5,8,"2021-10-12","2021-10-12"]
[5,8,"2021-10-13","2021-10-13"]
[5,8,"2021-10-14","2021-10-14"]
[5,8,"2021-10-15","2021-10-15"]
[5,"P","2021-10-16","2021-10-16"]
[5,"P","2021-10-17","2021-10-17"]
[5,8,"2021-10-18","2021-10-18"]
[5,8,"2021-10-19","2021-10-19"]
[5,8,"2021-10-20","2021-10-20"]
[5,8,"2021-10-21","2021-10-21"]
[5,8,"2021-10-22","2021-10-22"]
[5,"P","2021-10-23","2021-10-23"]
[5,"P","2021-10-24","2021-10-24"]
[5,8,"2021-10-25","2021-10-25"]
[5,8,"2021-10-26","2021-10-26"]
[5,8,"2021-10-27","2021-10-27"]
[5,8,"2021-10-28","2021-10-28"]
[5,8,"2021-10-29","2021-10-29"]
[5,"P","2021-10-30","2021-10-30"]
[5,"P","2021-10-31","2021-10-31"]
[6,6,"2021-10-01","2021-10-01"]
[6,"P","2021-10-02","2021-10-02"]
[6,"P","2021-10-03","2021-10-03"]
[6,6,"2021-10-04","2021-10-04"]
[6,6,"2021-10-05","2021-10-05"]
[6,6,"2021-10-06","2021-10-06"]
[6,6,"2021-10-07","2021-10-07"]
[6,6,"2021-10-08","2021-10-08"]
[6,"P","2021-10-09","2021-10-09"]
[6,"P","2021-10-10","2021-10-10"]
[6,6,"2021-10-11","2021-10-11"]
[6,6,"2021-10-12","2021-10-12"]
[6,6,"2021-10-13","2021-10-13"]
[6,6,"2021-10-14","2021-10-14"]
[6,6,"2021-10-15","2021-10-15"]
[6,"P","2021-10-16","2021-10-16"]
[6,"P","2021-10-17","2021-10-17"]
[6,6,"2021-10-18","2021-10-18"]
[6,6,"2021-10-19","2021-10-19"]
[6,6,"2021-10-20","2021-10-20"]
[6,6,"2021-10-21","2021-10-21"]
[6,6,"2021-10-22","2021-10-22"]
[6,"P","2021-10-23","2021-10-23"]
[6,"P","2021-10-24","2021-10-24"]
[6,6,"2021-10-25","2021-10-25"]
[6,6,"2021-10-26","2021-10-26"]
[6,6,"2021-10-27","2021-10-27"]
[6,6,"2021-10-28","2021-10-28"]
[6,6,"2021-10-29","2021-10-29"]
[6,"P","2021-10-30","2021-10-30"]
[6,"P","2021-10-31","2021-10-31"]
[7,7,"2021-10-01","2021-10-01"]
[7,"P","2021-10-02","2021-10-02"]
[7,"P","2021-10-03","2021-10-03"]
[7,7,"2021-10-04","2021-10-04"]
[7,7,"2021-10-05","2021-10-05"]
[7,7,"2021-10-06","2021-10-06"]
[7,7,"2021-10-07","2021-10-07"]
[7,7,"2021-10-08","2021-10-08"]
[7,"P","2021-10-09","2021-10-09"]
[7,"P","2021-10-10","2021-10-10"]
[7,7,"2021-10-11","2021-10-11"]
[7,7,"2021-10-12","2021-10-12"]
[7,7,"2021-10-13","2021-10-13"]
[7,7,"2021-10-14","2021-10-14"]
[7,7,"2021-10-15","2021-10-15"]
[7,"P","2021-10-16","2021-10-16"]
[7,"P","2021-10-17","2021-10-17"]
[7,7,"2021-10-18","2021-10-18"]
[7,7,"2021-10-19","2021-10-19"]
[7,7,"2021-10-20","2021-10-20"]
[7,7,"2021-10-21","2021-10-21"]
[7,7,"2021-10-22","2021-10-22"]
[7,"P","2021-10-23","2021-10-23"]
[7,"P","2021-10-24","2021-10-24"]
[7,7,"2021-10-25","2021-10-25"]
[7,7,"2021-10-26","2021-10-26"]
[7,7,"2021-10-27","2021-10-27"]
[7,7,"2021-10-28","2021-10-28"]
[7,7,"2021-10-29","2021-10-29"]
[7,"P","2021-10-30","2021-10-30"]
[7,"P","2021-10-31","2021-10-31"]
[8,8,"2021-10-01","2021-10-01"]
[8,"P","2021-10-02","2021-10-02"]
[8,"P","2021-10-03","2021-10-03"]
[8,"SZ","2021-10-04","2021-10-04"]
[8,8,"2021-10-05","2021-10-05"]
[8,8,"2021-10-06","2021-10-06"]
[8,8,"2021-10-07","2021-10-07"]
[8,8,"2021-10-08","2021-10-08"]
[8,"P","2021-10-09","2021-10-09"]
[8,"P","2021-10-10","2021-10-10"]
[8,8,"2021-10-11","2021-10-11"]
[8,8,"2021-10-12","2021-10-12"]
[8,8,"2021-10-13","2021-10-13"]
[8,8,"2021-10-14","2021-10-14"]
[8,"B","2021-10-15","2021-10-15"]
[8,"B","2021-10-16","2021-10-16"]
[8,"B","2021-10-17","2021-10-17"]
[8,"B","2021-10-18","2021-10-18"]
[8,8,"2021-10-19","2021-10-19"]
[8,8,"2021-10-20","2021-10-20"]
[8,8,"2021-10-21","2021-10-21"]
[8,8,"2021-10-22","2021-10-22"]
[8,"P","2021-10-23","2021-10-23"]
[8,"P","2021-10-24","2021-10-24"]
[8,8,"2021-10-25","2021-10-25"]
[8,8,"2021-10-26","2021-10-26"]
[8,8,"2021-10-27","2021-10-27"]
[8,8,"2021-10-28","2021-10-28"]
[8,8,"2021-10-29","2021-10-29"]
[8,"P","2021-10-30","2021-10-30"]
[8,"P","2021-10-31","2021-10-31"]
[9,8,"2021-10-01","2021-10-01"]
[9,"P","2021-10-02","2021-10-02"]
[9,"P","2021-10-03","2021-10-03"]
[9,8,"2021-10-04","2021-10-04"]
[9,8,"2021-10-05","2021-10-05"]
[9,8,"2021-10-06","2021-10-06"]
[9,8,"2021-10-07","2021-10-07"]
[9,8,"2021-10-08","2021-10-08"]
[9,"P","2021-10-09","2021-10-09"]
[9,"P","2021-10-10","2021-10-10"]
[9,8,"2021-10-11","2021-10-11"]
[9,8,"2021-10-12","2021-10-12"]
[9,8,"2021-10-13","2021-10-13"]
[9,8,"2021-10-14","2021-10-14"]
[9,8,"2021-10-15","2021-10-15"]
[9,"P","2021-10-16","2021-10-16"]
[9,"P","2021-10-17","2021-10-17"]
[9,"SZ","2021-10-18","2021-10-18"]
[9,8,"2021-10-19","2021-10-19"]
[9,8,"2021-10-20","2021-10-20"]
[9,8,"2021-10-21","2021-10-21"]
[9,8,"2021-10-22","2021-10-22"]
[9,"P","2021-10-23","2021-10-23"]
[9,"P","2021-10-24","2021-10-24"]
[9,8,"2021-10-25","2021-10-25"]
[9,8,"2021-10-26","2021-10-26"]
[9,8,"2021-10-27","2021-10-27"]
[9,8,"2021-10-28","2021-10-28"]
[9,8,"2021-10-29","2021-10-29"]
[9,"P","2021-10-30","2021-10-30"]
[9,"P","2021-10-31","2021-10-31"]
[10,8,"2021-10-01","2021-10-01"]
[10,"P","2021-10-02","2021-10-02"]
[10,"P","2021-10-03","2021-10-03"]
[10,8,"2021-10-04","2021-10-04"]
[10,8,"2021-10-05","2021-10-05"]
[10,"SZ","2021-10-06","2021-10-06"]
[10,8,"2021-10-07","2021-10-07"]
[10,8,"2021-10-08","2021-10-08"]
[10,"P","2021-10-09","2021-10-09"]
[10,"P","2021-10-10","2021-10-10"]
[10,8,"2021-10-11","2021-10-11"]
[10,8,"2021-10-12","2021-10-12"]
[10,8,"2021-10-13","2021-10-13"]
[10,8,"2021-10-14","2021-10-14"]
[10,8,"2021-10-15","2021-10-15"]
[10,"P","2021-10-16","2021-10-16"]
[10,"P","2021-10-17","2021-10-17"]
[10,8,"2021-10-18","2021-10-18"]
[10,8,"2021-10-19","2021-10-19"]
[10,8,"2021-10-20","2021-10-20"]
[10,8,"2021-10-21","2021-10-21"]
[10,8,"2021-10-22","2021-10-22"]
[10,"P","2021-10-23","2021-10-23"]
[10,"P","2021-10-24","2021-10-24"]
[10,8,"2021-10-25","2021-10-25"]
[10,8,"2021-10-26","2021-10-26"]
[10,8,"2021-10-27","2021-10-27"]
[10,8,"2021-10-28","2021-10-28"]
[10,8,"2021-10-29","2021-10-29"]
[10,"P","2021-10-30","2021-10-30"]
[10,"P","2021-10-31","2021-10-31"]
[11,8,"2021-10-01","2021-10-01"]
[11,"P","2021-10-02","2021-10-02"]
[11,"P","2021-10-03","2021-10-03"]
[11,8,"2021-10-04","2021-10-04"]
[11,8,"2021-10-05","2021-10-05"]
[11,8,"2021-10-06","2021-10-06"]
[11,8,"2021-10-07","2021-10-07"]
[11,8,"2021-10-08","2021-10-08"]
[11,"P","2021-10-09","2021-10-09"]
[11,"P","2021-10-10","2021-10-10"]
[11,8,"2021-10-11","2021-10-11"]
[11,8,"2021-10-12","2021-10-12"]
[11,8,"2021-10-13","2021-10-13"]
[11,8,"2021-10-14","2021-10-14"]
[11,8,"2021-10-15","2021-10-15"]
[11,"P","2021-10-16","2021-10-16"]
[11,"P","2021-10-17","2021-10-17"]
[11,8,"2021-10-18","2021-10-18"]
[11,8,"2021-10-19","2021-10-19"]
[11,8,"2021-10-20","2021-10-20"]
[11,8,"2021-10-21","2021-10-21"]
[11,8,"2021-10-22","2021-10-22"]
[11,"SZ","2021-10-23","2021-10-23"]
[11,"SZ","2021-10-24","2021-10-24"]
[11,8,"2021-10-25","2021-10-25"]
[11,8,"2021-10-26","2021-10-26"]
[11,8,"2021-10-27","2021-10-27"]
[11,8,"2021-10-28","2021-10-28"]
[11,8,"2021-10-29","2021-10-29"]
[11,"P","2021-10-30","2021-10-30"]
[11,"P","2021-10-31","2021-10-31"]
[12,8,"2021-10-01","2021-10-01"]
[12,"P","2021-10-02","2021-10-02"]
[12,"P","2021-10-03","2021-10-03"]
[12,8,"2021-10-04","2021-10-04"]
[12,8,"2021-10-05","2021-10-05"]
[12,8,"2021-10-06","2021-10-06"]
[12,8,"2021-10-07","2021-10-07"]
[12,8,"2021-10-08","2021-10-08"]
[12,"P","2021-10-09","2021-10-09"]
[12,"P","2021-10-10","2021-10-10"]
[12,8,"2021-10-11","2021-10-11"]
[12,8,"2021-10-12","2021-10-12"]
[12,8,"2021-10-13","2021-10-13"]
[12,8,"2021-10-14","2021-10-14"]
[12,8,"2021-10-15","2021-10-15"]
[12,"P","2021-10-16","2021-10-16"]
[12,"P","2021-10-17","2021-10-17"]
[12,8,"2021-10-18","2021-10-18"]
[12,8,"2021-10-19","2021-10-19"]
[12,8,"2021-10-20","2021-10-20"]
[12,8,"2021-10-21","2021-10-21"]
[12,8,"2021-10-22","2021-10-22"]
[12,"P","2021-10-23","2021-10-23"]
[12,"P","2021-10-24","2021-10-24"]
[12,8,"2021-10-25","2021-10-25"]
[12,8,"2021-10-26","2021-10-26"]
[12,8,"2021-10-27","2021-10-27"]
[12,8,"2021-10-28","2021-10-28"]
[12,8,"2021-10-29","2021-10-29"]
[12,"P","2021-10-30","2021-10-30"]
[12,"P","2021-10-31","2021-10-31"]
[13,8,"2021-10-01","2021-10-01"]
[13,"P","2021-10-02","2021-10-02"]
[13,"P","2021-10-03","2021-10-03"]
[13,8,"2021-10-04","2021-10-04"]
[13,8,"2021-10-05","2021-10-05"]
[13,8,"2021-10-06","2021-10-06"]
[13,8,"2021-10-07","2021-10-07"]
[13,8,"2021-10-08","2021-10-08"]
[13,"P","2021-10-09","2021-10-09"]
[13,"P","2021-10-10","2021-10-10"]
[13,8,"2021-10-11","2021-10-11"]
[13,8,"2021-10-12","2021-10-12"]
[13,8,"2021-10-13","2021-10-13"]
[13,8,"2021-10-14","2021-10-14"]
[13,8,"2021-10-15","2021-10-15"]
[13,"P","2021-10-16","2021-10-16"]
[13,"P","2021-10-17","2021-10-17"]
[13,8,"2021-10-18","2021-10-18"]
[13,8,"2021-10-19","2021-10-19"]
[13,8,"2021-10-20","2021-10-20"]
[13,8,"2021-10-21","2021-10-21"]
[13,8,"2021-10-22","2021-10-22"]
[13,"P","2021-10-23","2021-10-23"]
[13,"SZ","2021-10-24","2021-10-24"]
[13,8,"2021-10-25","2021-10-25"]
[13,8,"2021-10-26","2021-10-26"]
[13,8,"2021-10-27","2021-10-27"]
{"$rows_left_out":128}