{"text_format":"1","workbook":"xlsx","n_sheets":7,"sheets":["raw data","history","info","case1","cases","results","accuracy"],"not_rendered":{"charts":0,"images":0,"macros":1,"external_links":0,"defined_names":0,"comments":0,"pivot_tables":11},"unopened":[],"bounds":{"document_bytes":16777216,"sheet_cells":100000,"rows_first":2000,"rows_last":500,"rows_between":2000,"halvings":0,"cell_chars":16384,"cell_head_chars":4096},"cells_cut":0,"cells_raw":0,"read":"whole","date_system":"1900"}

{"sheet":"raw data","index":0,"n_rows":2002,"n_cols":10,"rows_kept":2002,"cut":false,"hidden":false,"merged":[]}
[2000,"1400+600","router-response","router-response","router-response","router-response","router-response","router-response","router-response","room where device located"]
["ID","Train/Test","X1","X2","X3","X4","X5","X6","X7","Y"]
[1,"Train",-58,-56,-52,-54,-52,-87,-84,4]
[2,"Train",-57,-59,-44,-60,-56,-87,-85,4]
[3,"Train",-48,-54,-52,-54,-58,-87,-89,3]
[4,"Train",-55,-53,-57,-67,-64,-80,-78,1]
[5,"Train",-14,-54,-57,-15,-69,-82,-71,2]
[6,"Train",-63,-59,-61,-68,-71,-81,-87,1]
[7,"Train",-41,-57,-55,-43,-65,-71,-76,2]
[8,"Train",-62,-63,-62,-65,-68,-87,-86,1]
[9,"Train",-40,-59,-57,-43,-74,-65,-66,2]
[10,"Train",-46,-54,-53,-48,-64,-78,-79,3]
[11,"Train",-57,-54,-49,-61,-43,-79,-85,4]
[12,"Train",-57,-51,-56,-57,-50,-88,-86,4]
[13,"Train",-53,-56,-51,-50,-61,-83,-81,3]
[14,"Train",-44,-57,-62,-41,-75,-65,-68,2]
[15,"Train",-51,-59,-51,-48,-67,-79,-79,3]
[16,"Train",-59,-59,-52,-60,-51,-87,-86,4]
[17,"Train",-61,-56,-55,-63,-47,-85,-89,4]
[18,"Train",-71,-62,-63,-69,-75,-85,-87,1]
[19,"Train",-38,-53,-53,-38,-66,-70,-69,2]
[20,"Train",-59,-49,-53,-59,-62,-81,-83,1]
[21,"Train",-51,-57,-59,-45,-77,-75,-81,2]
[22,"Train",-37,-52,-57,-36,-71,-66,-75,2]
[23,"Train",-48,-55,-58,-52,-64,-92,-79,3]
[24,"Train",-37,-57,-55,-40,-75,-71,-64,2]
[25,"Train",-40,-56,-58,-42,-67,-62,-71,2]
[26,"Train",-64,-57,-62,-68,-71,-85,-85,1]
[27,"Train",-38,-51,-53,-38,-63,-72,-73,2]
[28,"Train",-38,-50,-71,-39,-68,-78,-74,2]
[29,"Train",-35,-53,-58,-44,-63,-68,-71,2]
[30,"Train",-59,-52,-55,-59,-52,-88,-87,4]
[31,"Train",-57,-53,-54,-61,-73,-86,-81,1]
[32,"Train",-59,-55,-46,-66,-50,-86,-91,4]
[33,"Train",-48,-55,-54,-48,-67,-85,-81,3]
[34,"Train",-67,-56,-67,-70,-74,-81,-82,1]
[35,"Train",-63,-57,-65,-69,-77,-81,-85,1]
[36,"Train",-63,-58,-52,-59,-51,-88,-94,4]
[37,"Train",-59,-59,-48,-66,-50,-86,-94,4]
[38,"Train",-63,-54,-55,-64,-72,-84,-81,1]
[39,"Train",-64,-58,-47,-61,-52,-85,-86,4]
[40,"Train",-51,-52,-52,-50,-69,-78,-86,3]
[41,"Train",-65,-61,-63,-63,-69,-82,-84,1]
[42,"Train",-37,-55,-57,-42,-63,-65,-64,2]
[43,"Train",-51,-52,-51,-54,-61,-79,-76,3]
[44,"Train",-63,-54,-47,-64,-50,-83,-88,4]
[45,"Train",-49,-52,-56,-48,-55,-81,-82,3]
[46,"Train",-60,-57,-55,-65,-51,-94,-86,4]
[47,"Train",-62,-59,-62,-63,-65,-87,-87,1]
[48,"Train",-38,-58,-60,-42,-66,-82,-79,2]
[49,"Train",-58,-50,-43,-56,-55,-83,-87,4]
[50,"Train",-48,-55,-58,-50,-63,-81,-86,3]
[51,"Train",-64,-57,-52,-60,-40,-87,-87,4]
[52,"Train",-38,-53,-51,-39,-68,-76,-72,2]
[53,"Train",-66,-56,-54,-69,-65,-82,-82,1]
[54,"Train",-58,-54,-53,-60,-47,-82,-83,4]
[55,"Train",-58,-49,-55,-60,-70,-78,-80,1]
[56,"Train",-63,-56,-60,-62,-70,-84,-91,1]
[57,"Train",-59,-51,-49,-63,-45,-86,-83,4]
[58,"Train",-62,-57,-60,-64,-67,-80,-88,1]
{"$rows_left_out":1943}
{"sheet":"history","index":1,"n_rows":12,"n_cols":2,"rows_kept":12,"cut":false,"hidden":false,"merged":[]}
["id","urls"]
[1,"http://miau.my-x.hu/miau/239/konzisztencia_alapu_hibridizacio_v1.docx"]
[2,"https://miau.my-x.hu/miau/262/hipotezis_tervezes_phd.docx"]
[3,"https://miau.my-x.hu/miau/262/WiFi_experiment.xlsx"]
[4,"https://miau.my-x.hu/miau/262/wifi_y=1.xlsx"]
[5,"https://miau.my-x.hu/miau/263/Barta_Pitlik_final_no_remarks.docx"]
[6,"https://miau.my-x.hu/miau/263/wifi_plus.xlsx"]
[]
["id2","abstracts"]
[1,"Abstract: A specific case of the model hybridization is: analyzing partial conclusion spaces and integration of partial results based on statistics, logic/rules, and models. The aggregation of partial result for partial problems can be made in quasi unlimited ways. The more complex is the term of consistence behind the aggregation of partial results, the more chance can be expected for the success of the hybridization.\n\nKeywords: similarity analysis, logic, rule"]
[2,"Abstract: The goal of the paper is to demonstrate how can be articulated and evaluated a potential hypothesis for a real PhD-degree. The process is simple: a whole thinking experiment is needed where it is possible to build a benchmark (objective competition between alternative solutions). Parallel, it is relevant to be capable of defining a scale for the Goodness of models.\n\nKeywords: hermeneutics, automation, none-system-answer, consistence-based context-free and/or context-depending modelling"]
[5,"Abstract\n\nThe goal of the paper is to demonstrate how a potential hypothesis can be articulated and evaluated for a real PhD-degree. The process is simple: a whole thinking experiment is needed where it is possible to build a benchmark (objective competition between alternative solutions). Parallel, it is relevant to be capable of defining a scale for the goodness of models. The focus of the research of this article was to model and predict the location of indoor users, which, is the continuation of a previous research, attempted to consistently increase model accuracy based on the available data set.\n\nKeywords\n\nhermeneutics, automation, none-system-answer, consistence-based context-free and/or context-depending modelling"]

{"sheet":"info","index":2,"n_rows":13,"n_cols":2,"rows_kept":13,"cut":false,"hidden":false,"merged":[]}
["Task","A lot models should be developed for locating a mobile phone (device) in a building, if this device can be \"seen\" through routers (X1, …, X7) and we also know which router signs (which constellations of X1-2-3-4-5-6-7) belong to which room (Y=1,2,3,4) in the building. There are given 1400 constellation for learning and further 600 constellation for testing."]
[null,"1 model = 1 micro-project"]
[null,"System-modeling – Miau Wiki (my-x.hu)"]
[null,"https://miau.my-x.hu/mediawiki/index.php/System-modeling#Log-analysis"]
[]
["Sheets","Contents"]
["case1","Expertise: how to derive similarities"]
["cases","How to process all cases (incl. Macro)"]
["results","Stored data"]
["accuracy","How to calculate success levels for \"learning\" and testing"]
[]
["Conclusions","The expertise (estimation#1) seems to be quite simple and efficient."]
[null,"The expertise (estimation#2) is just a \"guessing machine\" compared to estimation#1."]

{"sheet":"case1","index":3,"n_rows":36,"n_cols":33,"rows_kept":36,"cut":false,"hidden":false,"merged":[]}
["Learning case#1",{"$f":"'raw data'!C3","v":-58},{"$f":"'raw data'!D3","v":-56},{"$f":"'raw data'!E3","v":-52},{"$f":"'raw data'!F3","v":-54},{"$f":"'raw data'!G3","v":-52},{"$f":"'raw data'!H3","v":-87},{"$f":"'raw data'!I3","v":-84},"Y",{"$f":"'raw data'!J3","v":4},null,null,null,null,null,null,null,null,{"$f":"VLOOKUP(MIN(S4:S7),S4:T7,2,0)","v":4},null,null,1,{"$f":"VLOOKUP(V1,W$4:$AD$7,W$8,0)","v":4},{"$f":"VLOOKUP(W1,X$4:$AD$7,X$8,0)","v":3},{"$f":"VLOOKUP(X1,Y$4:$AD$7,Y$8,0)","v":2},{"$f":"VLOOKUP(Y1,Z$4:$AD$7,Z$8,0)","v":4},{"$f":"VLOOKUP(Z1,AA$4:$AD$7,AA$8,0)","v":1},{"$f":"VLOOKUP(AA1,AB$4:$AD$7,AB$8,0)","v":4},{"$f":"VLOOKUP(AB1,AC$4:$AD$7,AC$8,0)","v":2},null,null,{"$f":"VLOOKUP(1,AF4:AG7,2,0)","v":4}]
[]
["Zeilenbeschriftungen","Mittelwert von X1","Mittelwert von X2","Mittelwert von X3","Mittelwert von X4","Mittelwert von X5","Mittelwert von X6","Mittelwert von X7","MITTELWERT","STD_ABW",null,"diff_x1","diff_x2","diff_x3","diff_x4","diff_x5","diff_x6","diff_x7","total","Room_id",null,"Room_id","rank_x1","rank_x2","rank_x3","rank_x4","rank_x5","rank_x6","rank_x7","Room_id","Frequency","rangzahl","Room_id"]
[1,-62.475218658892125,-56.373177842565596,-60.4868804664723,-64.172011661807574,-70.180758017492707,-82.801749271137027,-83.967930029154516,{"$f":"AVERAGE(B4:H4)","v":-68.636817992503126},{"$f":"STDEV(B4:H4)","v":10.899466183667617},null,{"$f":"ABS(B$1-B4)","v":4.4752186588921248},{"$f":"ABS(C$1-C4)","v":0.37317784256559605},{"$f":"ABS(D$1-D4)","v":8.4868804664723001},{"$f":"ABS(E$1-E4)","v":10.172011661807574},{"$f":"ABS(F$1-F4)","v":18.180758017492707},{"$f":"ABS(G$1-G4)","v":4.1982507288629733},{"$f":"ABS(H$1-H4)","v":3.2069970845483908E-2},{"$f":"SUM(L4:R4)","v":45.918367346938759},{"$f":"V4","v":1},null,{"$f":"A4","v":1},{"$f":"RANK(L4,L$4:L$7,1)","v":2},{"$f":"RANK(M4,M$4:M$7,1)","v":2},{"$f":"RANK(N4,N$4:N$7,1)","v":4},{"$f":"RANK(O4,O$4:O$7,1)","v":3},{"$f":"RANK(P4,P$4:P$7,1)","v":4},{"$f":"RANK(Q4,Q$4:Q$7,1)","v":2},{"$f":"RANK(R4,R$4:R$7,1)","v":1},{"$f":"V4","v":1},{"$f":"SUMIF($W$1:$AC$1,V4,$W$1:$AC$1)/V4","v":1},{"$f":"RANK(AE4,AE$4:AE$7,0)","v":3},{"$f":"AD4","v":1}]
[2,-36.633237822349571,-56.160458452722061,-55.945558739255013,-37.707736389684811,-67.57306590257879,-72.252148997134668,-73.289398280802288,{"$f":"AVERAGE(B5:H5)","v":-57.080229226361027},{"$f":"STDEV(B5:H5)","v":15.267232471610392},null,{"$f":"ABS(B$1-B5)","v":21.366762177650429},0.16045845272206094,3.9455587392550129,16.292263610315189,15.57306590257879,14.747851002865332,10.710601719197712,{"$f":"SUM(L5:R5)","v":82.796561604584525},{"$f":"V5","v":2},null,{"$f":"A5","v":2},{"$f":"RANK(L5,L$4:L$7,1)","v":4},{"$f":"RANK(M5,M$4:M$7,1)","v":1},{"$f":"RANK(N5,N$4:N$7,1)","v":3},{"$f":"RANK(O5,O$4:O$7,1)","v":4},{"$f":"RANK(P5,P$4:P$7,1)","v":3},{"$f":"RANK(Q5,Q$4:Q$7,1)","v":4},{"$f":"RANK(R5,R$4:R$7,1)","v":4},{"$f":"V5","v":2},{"$f":"SUMIF($W$1:$AC$1,V5,$W$1:$AC$1)/V5","v":2},{"$f":"RANK(AE5,AE$4:AE$7,0)","v":2},{"$f":"AD5","v":2}]
[3,-49.743515850144092,-54.991354466858787,-52.89048991354467,-50.659942363112393,-63.322766570605189,-81.443804034582129,-82.380403458213252,-62.204610951008647,14.176280715301866,null,8.2564841498559076,1.0086455331412125,0.89048991354466978,3.3400576368876074,11.322766570605189,5.5561959654178708,1.6195965417867484,31.994236311239206,3,null,3,{"$f":"RANK(L6,L$4:L$7,1)","v":3},{"$f":"RANK(M6,M$4:M$7,1)","v":4},{"$f":"RANK(N6,N$4:N$7,1)","v":1},{"$f":"RANK(O6,O$4:O$7,1)","v":1},{"$f":"RANK(P6,P$4:P$7,1)","v":2},{"$f":"RANK(Q6,Q$4:Q$7,1)","v":3},{"$f":"RANK(R6,R$4:R$7,1)","v":2},3,1,3,3]
[4,-60.210526315789473,-55.329639889196677,-50.73130193905817,-61.412742382271468,-49.46260387811634,-87.13296398891967,-87.013850415512465,-64.470518401266318,16.056385086991398,null,2.2105263157894726,0.67036011080332258,1.2686980609418299,7.4127423822714675,2.5373961218836598,0.13296398891966987,3.013850415512465,17.246537396121887,4,null,4,{"$f":"RANK(L7,L$4:L$7,1)","v":1},{"$f":"RANK(M7,M$4:M$7,1)","v":3},{"$f":"RANK(N7,N$4:N$7,1)","v":2},{"$f":"RANK(O7,O$4:O$7,1)","v":2},{"$f":"RANK(P7,P$4:P$7,1)","v":1},{"$f":"RANK(Q7,Q$4:Q$7,1)","v":1},{"$f":"RANK(R7,R$4:R$7,1)","v":3},4,3,1,4]
["Gesamtergebnis",-52.293571428571425,-55.708571428571432,-54.956428571428575,-53.514285714285712,-62.488571428571426,-80.95214285714286,-81.697857142857146,null,null,null,null,null,null,null,null,null,null,null,null,null,"return",8,7,6,5,4,3,2,null,{"$f":"SUM(AE4:AE7)","v":7}]
[]
["Zeilenbeschriftungen","Max. von X1","Max. von X2","Max. von X3","Max. von X4","Max. von X5","Max. von X6","Max. von X7","MAX","STD_ABW"]
[1,-55,-47,-50,-54,-60,-74,-74,{"$f":"MAX(B11:H11)","v":-47},{"$f":"STDEV(B11:H11)","v":10.930516478016498}]
[2,-10,-46,-46,-11,-56,-62,-63,{"$f":"MAX(B12:H12)","v":-10},{"$f":"STDEV(B12:H12)","v":22.561028345356956}]
[3,-43,-46,-45,-40,-54,-74,-73,-40,14.269514624508]
[4,-55,-48,-40,-52,-36,-76,-79,-36,16.63759369048071]
["Gesamtergebnis",-10,-46,-40,-11,-36,-62,-63]
[]
["Zeilenbeschriftungen","Min. von X1","Min. von X2","Min. von X3","Min. von X4","Min. von X5","Min. von X6","Min. von X7","MIN","STD_ABW"]
[1,-74,-64,-70,-76,-89,-97,-94,{"$f":"MIN(B18:H18)","v":-97},{"$f":"STDEV(B18:H18)","v":12.726051271010205}]
[2,-52,-74,-71,-53,-84,-89,-92,{"$f":"MIN(B19:H19)","v":-92},{"$f":"STDEV(B19:H19)","v":16.236349578000809}]
[3,-63,-68,-73,-63,-77,-92,-93,-93,12.620844436317]
[4,-71,-66,-60,-74,-62,-96,-98,-98,15.606775085565523]
["Gesamtergebnis",-74,-74,-73,-76,-89,-97,-98]
[]
["Zeilenbeschriftungen","STABW von X1","STABW von X2","STABW von X3","STABW von X4","STABW von X5","STABW von X6","STABW von X7","STD_ABW","STD_ABW"]
[1,3.4077394535149579,3.1363895304940574,3.6657458820320858,3.6614202146390493,4.6398959591189488,3.7073180949870892,4.0481918678094146,{"$f":"MIN(B25:H25)","v":3.1363895304940574},{"$f":"STDEV(B25:H25)","v":0.48152887272789296}]
[2,8.8156493624567318,3.4101835014197164,4.1584858595178167,8.1265474409259575,5.3157180772383583,4.4643578550779326,4.7160068504938675,{"$f":"MIN(B26:H26)","v":3.4101835014197164},{"$f":"STDEV(B26:H26)","v":2.0713812295261942}]
[3,2.7445020767553716,3.7835107956056224,3.2735755039559233,3.6682803766238954,3.6014809670933867,3.6349516294951916,4.2879676874684485,2.7445020767553716,0.47350553632673492]
[4,3.0276503540974917,3.214452110385245,4.182282832274165,3.854110859070377,3.5322896069902927,3.4958776232918751,3.520941614872406,3.0276503540974917,0.38334539795998229]
["Gesamtergebnis",11.435693408502996,3.438118027396031,5.3052863263151346,11.625429789397721,9.144531527472509,6.6609824596438907,6.601881680527125]
[]
["Zeilenbeschriftungen","Anzahl von X1","Anzahl von X2","Anzahl von X3","Anzahl von X4","Anzahl von X5","Anzahl von X6","Anzahl von X7","ANZAHL","STD_ABW"]
[1,343,343,343,343,343,343,343,{"$f":"MIN(B32:H32)","v":343},{"$f":"STDEV(B32:H32)","v":0}]
[2,349,349,349,349,349,349,349,{"$f":"MIN(B33:H33)","v":349},{"$f":"STDEV(B33:H33)","v":0}]
[3,347,347,347,347,347,347,347,347,0]
[4,361,361,361,361,361,361,361,361,0]
["Gesamtergebnis",1400,1400,1400,1400,1400,1400,1400]

{"sheet":"cases","index":4,"n_rows":36,"n_cols":33,"rows_kept":36,"cut":false,"hidden":false,"merged":[]}
[2000,{"$f":"VLOOKUP($A1,'raw data'!$A$3:$J$2002,B2,0)","v":-63},{"$f":"VLOOKUP($A1,'raw data'!$A$3:$J$2002,C2,0)","v":-60},{"$f":"VLOOKUP($A1,'raw data'!$A$3:$J$2002,D2,0)","v":-60},{"$f":"VLOOKUP($A1,'raw data'!$A$3:$J$2002,E2,0)","v":-67},{"$f":"VLOOKUP($A1,'raw data'!$A$3:$J$2002,F2,0)","v":-76},{"$f":"VLOOKUP($A1,'raw data'!$A$3:$J$2002,G2,0)","v":-85},{"$f":"VLOOKUP($A1,'raw data'!$A$3:$J$2002,H2,0)","v":-84},"Y",{"$f":"VLOOKUP($A1,'raw data'!$A$3:$J$2002,J2,0)","v":1},null,null,null,null,null,null,null,null,{"$f":"VLOOKUP(MIN(S4:S7),S4:T7,2,0)","v":1},null,null,1,{"$f":"VLOOKUP(V1,W$4:$AD$7,W$8,0)","v":1},{"$f":"VLOOKUP(W1,X$4:$AD$7,X$8,0)","v":1},{"$f":"VLOOKUP(X1,Y$4:$AD$7,Y$8,0)","v":1},{"$f":"VLOOKUP(Y1,Z$4:$AD$7,Z$8,0)","v":1},{"$f":"VLOOKUP(Z1,AA$4:$AD$7,AA$8,0)","v":1},{"$f":"VLOOKUP(AA1,AB$4:$AD$7,AB$8,0)","v":4},{"$f":"VLOOKUP(AB1,AC$4:$AD$7,AC$8,0)","v":2},null,null,{"$f":"VLOOKUP(1,AF4:AG7,2,0)","v":1}]
["return",3,4,5,6,7,8,9,null,10]
["Zeilenbeschriftungen","Mittelwert von X1","Mittelwert von X2","Mittelwert von X3","Mittelwert von X4","Mittelwert von X5","Mittelwert von X6","Mittelwert von X7","MITTELWERT","STD_ABW",null,"diff_x1","diff_x2","diff_x3","diff_x4","diff_x5","diff_x6","diff_x7","total","Room_id",null,"Room_id","rank_x1","rank_x2","rank_x3","rank_x4","rank_x5","rank_x6","rank_x7","Room_id","Frequency","rangzahl","Room_id"]
[1,-62.475218658892125,-56.373177842565596,-60.4868804664723,-64.172011661807574,-70.180758017492707,-82.801749271137027,-83.967930029154516,{"$f":"AVERAGE(B4:H4)","v":-68.636817992503126},{"$f":"STDEV(B4:H4)","v":10.899466183667617},null,{"$f":"ABS(B$1-B4)","v":0.52478134110787522},{"$f":"ABS(C$1-C4)","v":3.6268221574344039},0.4868804664723001,2.8279883381924265,5.8192419825072932,2.1982507288629733,3.2069970845483908E-2,{"$f":"SUM(L4:R4)","v":15.516034985422756},{"$f":"V4","v":1},null,{"$f":"A4","v":1},{"$f":"RANK(L4,L$4:L$7,1)","v":1},{"$f":"RANK(M4,M$4:M$7,1)","v":1},{"$f":"RANK(N4,N$4:N$7,1)","v":1},{"$f":"RANK(O4,O$4:O$7,1)","v":1},{"$f":"RANK(P4,P$4:P$7,1)","v":1},{"$f":"RANK(Q4,Q$4:Q$7,1)","v":2},{"$f":"RANK(R4,R$4:R$7,1)","v":1},{"$f":"V4","v":1},{"$f":"SUMIF($W$1:$AC$1,V4,$W$1:$AC$1)/V4","v":5},{"$f":"RANK(AE4,AE$4:AE$7,0)","v":1},{"$f":"AD4","v":1}]
[2,-36.633237822349571,-56.160458452722061,-55.945558739255013,-37.707736389684811,-67.57306590257879,-72.252148997134668,-73.289398280802288,{"$f":"AVERAGE(B5:H5)","v":-57.080229226361027},{"$f":"STDEV(B5:H5)","v":15.267232471610392},null,{"$f":"ABS(B$1-B5)","v":26.366762177650429},3.8395415472779391,4.0544412607449871,29.292263610315189,8.4269340974212099,12.747851002865332,10.710601719197712,{"$f":"SUM(L5:R5)","v":95.438395415472797},{"$f":"V5","v":2},null,{"$f":"A5","v":2},{"$f":"RANK(L5,L$4:L$7,1)","v":4},{"$f":"RANK(M5,M$4:M$7,1)","v":2},{"$f":"RANK(N5,N$4:N$7,1)","v":2},{"$f":"RANK(O5,O$4:O$7,1)","v":4},{"$f":"RANK(P5,P$4:P$7,1)","v":2},{"$f":"RANK(Q5,Q$4:Q$7,1)","v":4},{"$f":"RANK(R5,R$4:R$7,1)","v":4},{"$f":"V5","v":2},{"$f":"SUMIF($W$1:$AC$1,V5,$W$1:$AC$1)/V5","v":1},{"$f":"RANK(AE5,AE$4:AE$7,0)","v":2},{"$f":"AD5","v":2}]
[3,-49.743515850144092,-54.991354466858787,-52.89048991354467,-50.659942363112393,-63.322766570605189,-81.443804034582129,-82.380403458213252,-62.204610951008647,14.176280715301866,null,13.256484149855908,5.0086455331412125,7.1095100864553302,16.340057636887607,12.677233429394811,3.5561959654178708,1.6195965417867484,59.567723342939487,3,null,3,{"$f":"RANK(L6,L$4:L$7,1)","v":3},{"$f":"RANK(M6,M$4:M$7,1)","v":4},{"$f":"RANK(N6,N$4:N$7,1)","v":3},{"$f":"RANK(O6,O$4:O$7,1)","v":3},{"$f":"RANK(P6,P$4:P$7,1)","v":3},{"$f":"RANK(Q6,Q$4:Q$7,1)","v":3},{"$f":"RANK(R6,R$4:R$7,1)","v":2},3,0,4,3]
[4,-60.210526315789473,-55.329639889196677,-50.73130193905817,-61.412742382271468,-49.46260387811634,-87.13296398891967,-87.013850415512465,-64.470518401266318,16.056385086991398,null,2.7894736842105274,4.6703601108033226,9.2686980609418299,5.5872576177285325,26.53739612188366,2.1329639889196699,3.013850415512465,54.000000000000007,4,null,4,{"$f":"RANK(L7,L$4:L$7,1)","v":2},{"$f":"RANK(M7,M$4:M$7,1)","v":3},{"$f":"RANK(N7,N$4:N$7,1)","v":4},{"$f":"RANK(O7,O$4:O$7,1)","v":2},{"$f":"RANK(P7,P$4:P$7,1)","v":4},{"$f":"RANK(Q7,Q$4:Q$7,1)","v":1},{"$f":"RANK(R7,R$4:R$7,1)","v":3},4,1,2,4]
["Gesamtergebnis",-52.293571428571425,-55.708571428571432,-54.956428571428575,-53.514285714285712,-62.488571428571426,-80.95214285714286,-81.697857142857146,null,null,null,null,null,null,null,null,null,null,null,null,null,"return",8,7,6,5,4,3,2,null,{"$f":"SUM(AE4:AE7)","v":7}]
[]
["Zeilenbeschriftungen","Max. von X1","Max. von X2","Max. von X3","Max. von X4","Max. von X5","Max. von X6","Max. von X7","MAX","STD_ABW"]
[1,-55,-47,-50,-54,-60,-74,-74,{"$f":"MAX(B11:H11)","v":-47},{"$f":"STDEV(B11:H11)","v":10.930516478016498}]
[2,-10,-46,-46,-11,-56,-62,-63,{"$f":"MAX(B12:H12)","v":-10},{"$f":"STDEV(B12:H12)","v":22.561028345356956}]
[3,-43,-46,-45,-40,-54,-74,-73,-40,14.269514624508]
[4,-55,-48,-40,-52,-36,-76,-79,-36,16.63759369048071]
["Gesamtergebnis",-10,-46,-40,-11,-36,-62,-63]
[]
["Zeilenbeschriftungen","Min. von X1","Min. von X2","Min. von X3","Min. von X4","Min. von X5","Min. von X6","Min. von X7","MIN","STD_ABW"]
[1,-74,-64,-70,-76,-89,-97,-94,{"$f":"MIN(B18:H18)","v":-97},{"$f":"STDEV(B18:H18)","v":12.726051271010205}]
[2,-52,-74,-71,-53,-84,-89,-92,{"$f":"MIN(B19:H19)","v":-92},{"$f":"STDEV(B19:H19)","v":16.236349578000809}]
[3,-63,-68,-73,-63,-77,-92,-93,-93,12.620844436317]
[4,-71,-66,-60,-74,-62,-96,-98,-98,15.606775085565523]
["Gesamtergebnis",-74,-74,-73,-76,-89,-97,-98]
[]
["Zeilenbeschriftungen","STABW von X1","STABW von X2","STABW von X3","STABW von X4","STABW von X5","STABW von X6","STABW von X7","STD_ABW","STD_ABW"]
[1,3.4077394535149579,3.1363895304940574,3.6657458820320858,3.6614202146390493,4.6398959591189488,3.7073180949870892,4.0481918678094146,{"$f":"MIN(B25:H25)","v":3.1363895304940574},{"$f":"STDEV(B25:H25)","v":0.48152887272789296}]
[2,8.8156493624567318,3.4101835014197164,4.1584858595178167,8.1265474409259575,5.3157180772383583,4.4643578550779326,4.7160068504938675,{"$f":"MIN(B26:H26)","v":3.4101835014197164},{"$f":"STDEV(B26:H26)","v":2.0713812295261942}]
[3,2.7445020767553716,3.7835107956056224,3.2735755039559233,3.6682803766238954,3.6014809670933867,3.6349516294951916,4.2879676874684485,2.7445020767553716,0.47350553632673492]
[4,3.0276503540974917,3.214452110385245,4.182282832274165,3.854110859070377,3.5322896069902927,3.4958776232918751,3.520941614872406,3.0276503540974917,0.38334539795998229]
["Gesamtergebnis",11.435693408502996,3.438118027396031,5.3052863263151346,11.625429789397721,9.144531527472509,6.6609824596438907,6.601881680527125]
[]
["Zeilenbeschriftungen","Anzahl von X1","Anzahl von X2","Anzahl von X3","Anzahl von X4","Anzahl von X5","Anzahl von X6","Anzahl von X7","ANZAHL","STD_ABW"]
[1,343,343,343,343,343,343,343,{"$f":"MIN(B32:H32)","v":343},{"$f":"STDEV(B32:H32)","v":0}]
[2,349,349,349,349,349,349,349,{"$f":"MIN(B33:H33)","v":349},{"$f":"STDEV(B33:H33)","v":0}]
[3,347,347,347,347,347,347,347,347,0]
[4,361,361,361,361,361,361,361,361,0]
["Gesamtergebnis",1400,1400,1400,1400,1400,1400,1400]

{"sheet":"results","index":5,"n_rows":2002,"n_cols":7,"rows_kept":2002,"cut":false,"hidden":false,"merged":[]}
["ID","Train/Test",{"$f":"'raw data'!J2","v":"Y"},"Estimation1","Estimation2","diff1","diff2"]
[1,"Train",{"$f":"'raw data'!J3","v":4},{"$f":"case1!S1","v":4},{"$f":"case1!AF1","v":4},{"$f":"IF(C2=D2,0,1)","v":0},{"$f":"IF(C2=E2,0,1)","v":0}]
[2,"Train",{"$f":"'raw data'!J4","v":4},4,4,{"$f":"IF(C3=D3,0,1)","v":0},{"$f":"IF(C3=E3,0,1)","v":0}]
[3,"Train",{"$f":"'raw data'!J5","v":3},3,2,0,1]
[4,"Train",{"$f":"'raw data'!J6","v":1},1,2,0,1]
[5,"Train",{"$f":"'raw data'!J7","v":2},2,1,0,1]
[6,"Train",{"$f":"'raw data'!J8","v":1},1,1,0,0]
[7,"Train",{"$f":"'raw data'!J9","v":2},2,4,0,1]
[8,"Train",{"$f":"'raw data'!J10","v":1},1,1,0,0]
[9,"Train",{"$f":"'raw data'!J11","v":2},2,2,0,0]
[10,"Train",{"$f":"'raw data'!J12","v":3},3,1,0,1]
[11,"Train",{"$f":"'raw data'!J13","v":4},4,4,0,0]
[12,"Train",{"$f":"'raw data'!J14","v":4},4,1,0,1]
[13,"Train",{"$f":"'raw data'!J15","v":3},3,1,0,1]
[14,"Train",{"$f":"'raw data'!J16","v":2},2,1,0,1]
[15,"Train",{"$f":"'raw data'!J17","v":3},3,3,0,0]
[16,"Train",{"$f":"'raw data'!J18","v":4},4,1,0,1]
[17,"Train",{"$f":"'raw data'!J19","v":4},4,3,0,1]
[18,"Train",{"$f":"'raw data'!J20","v":1},1,1,0,0]
[19,"Train",{"$f":"'raw data'!J21","v":2},2,2,0,0]
[20,"Train",{"$f":"'raw data'!J22","v":1},3,3,1,1]
[21,"Train",{"$f":"'raw data'!J23","v":2},3,1,1,1]
[22,"Train",{"$f":"'raw data'!J24","v":2},2,1,0,1]
[23,"Train",{"$f":"'raw data'!J25","v":3},3,1,0,1]
[24,"Train",{"$f":"'raw data'!J26","v":2},2,4,0,1]
[25,"Train",{"$f":"'raw data'!J27","v":2},2,2,0,0]
[26,"Train",{"$f":"'raw data'!J28","v":1},1,1,0,0]
[27,"Train",{"$f":"'raw data'!J29","v":2},2,2,0,0]
[28,"Train",{"$f":"'raw data'!J30","v":2},2,2,0,0]
[29,"Train",{"$f":"'raw data'!J31","v":2},2,1,0,1]
[30,"Train",{"$f":"'raw data'!J32","v":4},4,1,0,1]
[31,"Train",{"$f":"'raw data'!J33","v":1},1,3,0,1]
[32,"Train",{"$f":"'raw data'!J34","v":4},4,3,0,1]
[33,"Train",{"$f":"'raw data'!J35","v":3},3,2,0,1]
[34,"Train",{"$f":"'raw data'!J36","v":1},1,2,0,1]
[35,"Train",{"$f":"'raw data'!J37","v":1},1,1,0,0]
[36,"Train",{"$f":"'raw data'!J38","v":4},4,1,0,1]
[37,"Train",{"$f":"'raw data'!J39","v":4},4,4,0,0]
[38,"Train",{"$f":"'raw data'!J40","v":1},1,2,0,1]
[39,"Train",{"$f":"'raw data'!J41","v":4},4,3,0,1]
[40,"Train",{"$f":"'raw data'!J42","v":3},3,3,0,0]
[41,"Train",{"$f":"'raw data'!J43","v":1},1,1,0,0]
[42,"Train",{"$f":"'raw data'!J44","v":2},2,1,0,1]
[43,"Train",{"$f":"'raw data'!J45","v":3},3,3,0,0]
[44,"Train",{"$f":"'raw data'!J46","v":4},4,1,0,1]
[45,"Train",{"$f":"'raw data'!J47","v":3},3,3,0,0]
[46,"Train",{"$f":"'raw data'!J48","v":4},4,3,0,1]
[47,"Train",{"$f":"'raw data'!J49","v":1},1,1,0,0]
[48,"Train",{"$f":"'raw data'!J50","v":2},2,2,0,0]
[49,"Train",{"$f":"'raw data'!J51","v":4},4,4,0,0]
[50,"Train",{"$f":"'raw data'!J52","v":3},3,3,0,0]
[51,"Train",{"$f":"'raw data'!J53","v":4},4,1,0,1]
[52,"Train",{"$f":"'raw data'!J54","v":2},2,2,0,0]
[53,"Train",{"$f":"'raw data'!J55","v":1},1,2,0,1]
[54,"Train",{"$f":"'raw data'!J56","v":4},4,3,0,1]
[55,"Train",{"$f":"'raw data'!J57","v":1},1,1,0,0]
[56,"Train",{"$f":"'raw data'!J58","v":1},1,1,0,0]
[57,"Train",{"$f":"'raw data'!J59","v":4},4,4,0,0]
[58,"Train",{"$f":"'raw data'!J60","v":1},1,1,0,0]
[59,"Train",{"$f":"'raw data'!J61","v":3},3,3,0,0]
{"$rows_left_out":1943}
{"sheet":"accuracy","index":6,"n_rows":15,"n_cols":10,"rows_kept":15,"cut":false,"hidden":false,"merged":[]}
["Estimation#1"]
[]
["Anzahl von ID","estimated room_id",null,null,null,null,"without any learning process"]
["real room_id",1,2,3,4,"Gesamtergebnis","Correct estimated","Accuracy","Check1","Check2"]
["Test",155,127,178,140,600,{"$f":"B6+C7+D8+E9","v":573},{"$f":"G5/F5","v":0.95499999999999996}]
[1,155,null,2,null,157]
[2,null,127,24,null,151]
[3,null,null,152,1,153]
[4,null,null,null,139,139]
["Train",334,318,383,365,1400,{"$f":"B11+C12+D13+E14","v":1347},{"$f":"G10/F10","v":0.96214285714285719}]
[1,330,null,11,2,343]
[2,null,318,31,null,349]
[3,3,null,340,4,347]
[4,1,null,1,359,361]
["Gesamtergebnis",489,445,561,505,2000,{"$f":"G10+G5","v":1920},{"$f":"G15/F15","v":0.96},{"$f":"F15-G15","v":80},{"$f":"results!F2002","v":80}]