{"text_format":"1","workbook":"xlsx","n_sheets":13,"sheets":["TILES","BOARD_GRID","BOARD_TABLE","BOARD_EDGE_VIEW","MOVE_SIM","PLAYERS","TREASURE_CARDS","PLAYER_TREASURE","TURN_LOG","MOVE_EVAL","PLAYER_POS_LOG","GAME_VIEW","GV2_LOG"],"not_rendered":{"charts":0,"images":68,"macros":1,"external_links":0,"defined_names":1,"comments":0,"pivot_tables":0},"unopened":[],"bounds":{"document_bytes":16777216,"sheet_cells":100000,"rows_first":2000,"rows_last":500,"rows_between":2000,"halvings":0,"cell_chars":16384,"cell_head_chars":4096},"cells_cut":0,"cells_raw":0,"read":"whole","date_system":"1900"}

{"sheet":"TILES","index":0,"n_rows":51,"n_cols":16,"rows_kept":51,"cut":false,"hidden":false,"merged":[[1,15,24,23]]}
["TileID","Shape","Fixed","TreasureID","BaseOpen_N","BaseOpen_E","BaseOpen_S","BaseOpen_W","TilesImage"]
["F01","CORNER","YES",null,1,1,0,0,null,null,null,null,null,null,null,{"$error":"#VALUE!"}]
["F02","CORNER","YES",null,1,1,0,0]
["F03","CORNER","YES",null,1,1,0,0]
["F04","CORNER","YES",null,1,1,0,0]
["F05","T_JUNCTION","YES","BOOK",1,1,0,1]
["F06","T_JUNCTION","YES","MONEYBAG",1,1,0,1]
["F07","T_JUNCTION","YES","POSION",1,1,0,1]
{"$rows_left_out":44}
{"sheet":"BOARD_GRID","index":1,"n_rows":20,"n_cols":11,"rows_kept":20,"cut":false,"hidden":false,"merged":[[11,0,11,7],[2,0,2,7],[0,0,0,7]]}
["BOARD_GRID – tábla rács (a kékkel jelölt cellák kitöltendők)"]
[]
["TileID (7×7)",null,null,null,null,null,null,null,null,"Tartalék csempe (SpareTile)"]
["Row\\Col",0,1,2,3,4,5,6,null,"SpareTileID","M05"]
[0,"F01","M29","F05","M11","F06","M21","F02",null,"SpareRotation",270]
[1,"M30","M01","M10","M23","M27","M24","M04"]
[2,"F07","M31","F08","M32","F09","M13","F10"]
[3,"M19","M07","M25","M16","M33","M15","M22"]
{"$rows_left_out":13}
{"sheet":"BOARD_TABLE","index":2,"n_rows":50,"n_cols":16,"rows_kept":50,"cut":false,"hidden":false,"merged":[]}
["Row","Col","PosID","TileID","Rotation","Fixed","Shape","TreasureID","BaseN","BaseE","BaseS","BaseW","OpenN","OpenE","OpenS","OpenW"]
[{"$f":"INT((ROW()-2)/7)","v":0},{"$f":"MOD(ROW()-2,7)","v":0},{"$f":"\"R\"&A2&\"C\"&B2","v":"R0C0"},{"$f":"INDEX(BOARD_GRID!$B$5:$H$11,A2+1,B2+1)","v":"F01"},{"$f":"INDEX(BOARD_GRID!$B$14:$H$20,A2+1,B2+1)","v":90},{"$f":"IF(D2=\"\",\"\",INDEX(TILES!$C:$C,MATCH(D2,TILES!$A:$A,0)))","v":"YES"},{"$f":"IF(D2=\"\",\"\",INDEX(TILES!$B:$B,MATCH(D2,TILES!$A:$A,0)))","v":"CORNER"},{"$f":"IF(D2=\"\",\"\",INDEX(TILES!$D:$D,MATCH(D2,TILES!$A:$A,0)))","v":0},{"$f":"IF(D2=\"\",\"\",INDEX(TILES!$E:$E,MATCH(D2,TILES!$A:$A,0)))","v":1},{"$f":"IF(D2=\"\",\"\",INDEX(TILES!$F:$F,MATCH(D2,TILES!$A:$A,0)))","v":1},{"$f":"IF(D2=\"\",\"\",INDEX(TILES!$G:$G,MATCH(D2,TILES!$A:$A,0)))","v":0},{"$f":"IF(D2=\"\",\"\",INDEX(TILES!$H:$H,MATCH(D2,TILES!$A:$A,0)))","v":0},{"$f":"IF(D2=\"\",\"\",IFERROR(CHOOSE(MATCH(MOD(E2,360),{0,90,180,270},0),I2,L2,K2,J2),\"\"))","v":0},{"$f":"IF(D2=\"\",\"\",IFERROR(CHOOSE(MATCH(MOD(E2,360),{0,90,180,270},0),J2,I2,L2,K2),\"\"))","v":1},{"$f":"IF(D2=\"\",\"\",IFERROR(CHOOSE(MATCH(MOD(E2,360),{0,90,180,270},0),K2,J2,I2,L2),\"\"))","v":1},{"$f":"IF(D2=\"\",\"\",IFERROR(CHOOSE(MATCH(MOD(E2,360),{0,90,180,270},0),L2,K2,J2,I2),\"\"))","v":0}]
[0,1,"R0C1",{"$f":"INDEX(BOARD_GRID!$B$5:$H$11,A3+1,B3+1)","v":"M29"},{"$f":"INDEX(BOARD_GRID!$B$14:$H$20,A3+1,B3+1)","v":180},{"$f":"IF(D3=\"\",\"\",INDEX(TILES!$C:$C,MATCH(D3,TILES!$A:$A,0)))","v":"NO"},{"$f":"IF(D3=\"\",\"\",INDEX(TILES!$B:$B,MATCH(D3,TILES!$A:$A,0)))","v":"STRAIGHT"},{"$f":"IF(D3=\"\",\"\",INDEX(TILES!$D:$D,MATCH(D3,TILES!$A:$A,0)))","v":0},{"$f":"IF(D3=\"\",\"\",INDEX(TILES!$E:$E,MATCH(D3,TILES!$A:$A,0)))","v":1},{"$f":"IF(D3=\"\",\"\",INDEX(TILES!$F:$F,MATCH(D3,TILES!$A:$A,0)))","v":0},{"$f":"IF(D3=\"\",\"\",INDEX(TILES!$G:$G,MATCH(D3,TILES!$A:$A,0)))","v":1},{"$f":"IF(D3=\"\",\"\",INDEX(TILES!$H:$H,MATCH(D3,TILES!$A:$A,0)))","v":0},{"$f":"IF(D3=\"\",\"\",IFERROR(CHOOSE(MATCH(MOD(E3,360),{0,90,180,270},0),I3,L3,K3,J3),\"\"))","v":1},{"$f":"IF(D3=\"\",\"\",IFERROR(CHOOSE(MATCH(MOD(E3,360),{0,90,180,270},0),J3,I3,L3,K3),\"\"))","v":0},{"$f":"IF(D3=\"\",\"\",IFERROR(CHOOSE(MATCH(MOD(E3,360),{0,90,180,270},0),K3,J3,I3,L3),\"\"))","v":1},{"$f":"IF(D3=\"\",\"\",IFERROR(CHOOSE(MATCH(MOD(E3,360),{0,90,180,270},0),L3,K3,J3,I3),\"\"))","v":0}]
[0,2,"R0C2",{"$f":"INDEX(BOARD_GRID!$B$5:$H$11,A4+1,B4+1)","v":"F05"},{"$f":"INDEX(BOARD_GRID!$B$14:$H$20,A4+1,B4+1)","v":180},{"$f":"IF(D4=\"\",\"\",INDEX(TILES!$C:$C,MATCH(D4,TILES!$A:$A,0)))","v":"YES"},{"$f":"IF(D4=\"\",\"\",INDEX(TILES!$B:$B,MATCH(D4,TILES!$A:$A,0)))","v":"T_JUNCTION"},{"$f":"IF(D4=\"\",\"\",INDEX(TILES!$D:$D,MATCH(D4,TILES!$A:$A,0)))","v":"BOOK"},{"$f":"IF(D4=\"\",\"\",INDEX(TILES!$E:$E,MATCH(D4,TILES!$A:$A,0)))","v":1},{"$f":"IF(D4=\"\",\"\",INDEX(TILES!$F:$F,MATCH(D4,TILES!$A:$A,0)))","v":1},{"$f":"IF(D4=\"\",\"\",INDEX(TILES!$G:$G,MATCH(D4,TILES!$A:$A,0)))","v":0},{"$f":"IF(D4=\"\",\"\",INDEX(TILES!$H:$H,MATCH(D4,TILES!$A:$A,0)))","v":1},{"$f":"IF(D4=\"\",\"\",IFERROR(CHOOSE(MATCH(MOD(E4,360),{0,90,180,270},0),I4,L4,K4,J4),\"\"))","v":0},{"$f":"IF(D4=\"\",\"\",IFERROR(CHOOSE(MATCH(MOD(E4,360),{0,90,180,270},0),J4,I4,L4,K4),\"\"))","v":1},{"$f":"IF(D4=\"\",\"\",IFERROR(CHOOSE(MATCH(MOD(E4,360),{0,90,180,270},0),K4,J4,I4,L4),\"\"))","v":1},{"$f":"IF(D4=\"\",\"\",IFERROR(CHOOSE(MATCH(MOD(E4,360),{0,90,180,270},0),L4,K4,J4,I4),\"\"))","v":1}]
[0,3,"R0C3",{"$f":"INDEX(BOARD_GRID!$B$5:$H$11,A5+1,B5+1)","v":"M11"},{"$f":"INDEX(BOARD_GRID!$B$14:$H$20,A5+1,B5+1)","v":180},{"$f":"IF(D5=\"\",\"\",INDEX(TILES!$C:$C,MATCH(D5,TILES!$A:$A,0)))","v":"NO"},{"$f":"IF(D5=\"\",\"\",INDEX(TILES!$B:$B,MATCH(D5,TILES!$A:$A,0)))","v":"T_JUNCTION"},{"$f":"IF(D5=\"\",\"\",INDEX(TILES!$D:$D,MATCH(D5,TILES!$A:$A,0)))","v":"DRAGON"},{"$f":"IF(D5=\"\",\"\",INDEX(TILES!$E:$E,MATCH(D5,TILES!$A:$A,0)))","v":1},{"$f":"IF(D5=\"\",\"\",INDEX(TILES!$F:$F,MATCH(D5,TILES!$A:$A,0)))","v":1},{"$f":"IF(D5=\"\",\"\",INDEX(TILES!$G:$G,MATCH(D5,TILES!$A:$A,0)))","v":0},{"$f":"IF(D5=\"\",\"\",INDEX(TILES!$H:$H,MATCH(D5,TILES!$A:$A,0)))","v":1},{"$f":"IF(D5=\"\",\"\",IFERROR(CHOOSE(MATCH(MOD(E5,360),{0,90,180,270},0),I5,L5,K5,J5),\"\"))","v":0},{"$f":"IF(D5=\"\",\"\",IFERROR(CHOOSE(MATCH(MOD(E5,360),{0,90,180,270},0),J5,I5,L5,K5),\"\"))","v":1},{"$f":"IF(D5=\"\",\"\",IFERROR(CHOOSE(MATCH(MOD(E5,360),{0,90,180,270},0),K5,J5,I5,L5),\"\"))","v":1},{"$f":"IF(D5=\"\",\"\",IFERROR(CHOOSE(MATCH(MOD(E5,360),{0,90,180,270},0),L5,K5,J5,I5),\"\"))","v":1}]
[0,4,"R0C4",{"$f":"INDEX(BOARD_GRID!$B$5:$H$11,A6+1,B6+1)","v":"F06"},{"$f":"INDEX(BOARD_GRID!$B$14:$H$20,A6+1,B6+1)","v":180},{"$f":"IF(D6=\"\",\"\",INDEX(TILES!$C:$C,MATCH(D6,TILES!$A:$A,0)))","v":"YES"},{"$f":"IF(D6=\"\",\"\",INDEX(TILES!$B:$B,MATCH(D6,TILES!$A:$A,0)))","v":"T_JUNCTION"},{"$f":"IF(D6=\"\",\"\",INDEX(TILES!$D:$D,MATCH(D6,TILES!$A:$A,0)))","v":"MONEYBAG"},{"$f":"IF(D6=\"\",\"\",INDEX(TILES!$E:$E,MATCH(D6,TILES!$A:$A,0)))","v":1},{"$f":"IF(D6=\"\",\"\",INDEX(TILES!$F:$F,MATCH(D6,TILES!$A:$A,0)))","v":1},{"$f":"IF(D6=\"\",\"\",INDEX(TILES!$G:$G,MATCH(D6,TILES!$A:$A,0)))","v":0},{"$f":"IF(D6=\"\",\"\",INDEX(TILES!$H:$H,MATCH(D6,TILES!$A:$A,0)))","v":1},{"$f":"IF(D6=\"\",\"\",IFERROR(CHOOSE(MATCH(MOD(E6,360),{0,90,180,270},0),I6,L6,K6,J6),\"\"))","v":0},{"$f":"IF(D6=\"\",\"\",IFERROR(CHOOSE(MATCH(MOD(E6,360),{0,90,180,270},0),J6,I6,L6,K6),\"\"))","v":1},{"$f":"IF(D6=\"\",\"\",IFERROR(CHOOSE(MATCH(MOD(E6,360),{0,90,180,270},0),K6,J6,I6,L6),\"\"))","v":1},{"$f":"IF(D6=\"\",\"\",IFERROR(CHOOSE(MATCH(MOD(E6,360),{0,90,180,270},0),L6,K6,J6,I6),\"\"))","v":1}]
[0,5,"R0C5",{"$f":"INDEX(BOARD_GRID!$B$5:$H$11,A7+1,B7+1)","v":"M21"},{"$f":"INDEX(BOARD_GRID!$B$14:$H$20,A7+1,B7+1)","v":270},{"$f":"IF(D7=\"\",\"\",INDEX(TILES!$C:$C,MATCH(D7,TILES!$A:$A,0)))","v":"NO"},{"$f":"IF(D7=\"\",\"\",INDEX(TILES!$B:$B,MATCH(D7,TILES!$A:$A,0)))","v":"CORNER"},{"$f":"IF(D7=\"\",\"\",INDEX(TILES!$D:$D,MATCH(D7,TILES!$A:$A,0)))","v":0},{"$f":"IF(D7=\"\",\"\",INDEX(TILES!$E:$E,MATCH(D7,TILES!$A:$A,0)))","v":1},{"$f":"IF(D7=\"\",\"\",INDEX(TILES!$F:$F,MATCH(D7,TILES!$A:$A,0)))","v":1},{"$f":"IF(D7=\"\",\"\",INDEX(TILES!$G:$G,MATCH(D7,TILES!$A:$A,0)))","v":0},{"$f":"IF(D7=\"\",\"\",INDEX(TILES!$H:$H,MATCH(D7,TILES!$A:$A,0)))","v":0},{"$f":"IF(D7=\"\",\"\",IFERROR(CHOOSE(MATCH(MOD(E7,360),{0,90,180,270},0),I7,L7,K7,J7),\"\"))","v":1},{"$f":"IF(D7=\"\",\"\",IFERROR(CHOOSE(MATCH(MOD(E7,360),{0,90,180,270},0),J7,I7,L7,K7),\"\"))","v":0},{"$f":"IF(D7=\"\",\"\",IFERROR(CHOOSE(MATCH(MOD(E7,360),{0,90,180,270},0),K7,J7,I7,L7),\"\"))","v":0},{"$f":"IF(D7=\"\",\"\",IFERROR(CHOOSE(MATCH(MOD(E7,360),{0,90,180,270},0),L7,K7,J7,I7),\"\"))","v":1}]
[0,6,"R0C6",{"$f":"INDEX(BOARD_GRID!$B$5:$H$11,A8+1,B8+1)","v":"F02"},{"$f":"INDEX(BOARD_GRID!$B$14:$H$20,A8+1,B8+1)","v":180},{"$f":"IF(D8=\"\",\"\",INDEX(TILES!$C:$C,MATCH(D8,TILES!$A:$A,0)))","v":"YES"},{"$f":"IF(D8=\"\",\"\",INDEX(TILES!$B:$B,MATCH(D8,TILES!$A:$A,0)))","v":"CORNER"},{"$f":"IF(D8=\"\",\"\",INDEX(TILES!$D:$D,MATCH(D8,TILES!$A:$A,0)))","v":0},{"$f":"IF(D8=\"\",\"\",INDEX(TILES!$E:$E,MATCH(D8,TILES!$A:$A,0)))","v":1},{"$f":"IF(D8=\"\",\"\",INDEX(TILES!$F:$F,MATCH(D8,TILES!$A:$A,0)))","v":1},{"$f":"IF(D8=\"\",\"\",INDEX(TILES!$G:$G,MATCH(D8,TILES!$A:$A,0)))","v":0},{"$f":"IF(D8=\"\",\"\",INDEX(TILES!$H:$H,MATCH(D8,TILES!$A:$A,0)))","v":0},{"$f":"IF(D8=\"\",\"\",IFERROR(CHOOSE(MATCH(MOD(E8,360),{0,90,180,270},0),I8,L8,K8,J8),\"\"))","v":0},{"$f":"IF(D8=\"\",\"\",IFERROR(CHOOSE(MATCH(MOD(E8,360),{0,90,180,270},0),J8,I8,L8,K8),\"\"))","v":0},{"$f":"IF(D8=\"\",\"\",IFERROR(CHOOSE(MATCH(MOD(E8,360),{0,90,180,270},0),K8,J8,I8,L8),\"\"))","v":1},{"$f":"IF(D8=\"\",\"\",IFERROR(CHOOSE(MATCH(MOD(E8,360),{0,90,180,270},0),L8,K8,J8,I8),\"\"))","v":1}]
{"$rows_left_out":43}
{"sheet":"BOARD_EDGE_VIEW","index":3,"n_rows":28,"n_cols":31,"rows_kept":28,"cut":false,"hidden":false,"merged":[]}
[null,"BOARD_EDGE_VIEW (from BOARD_TABLE OpenN/E/S/W)"]
[null,null,{"$f":"IF(INDEX(BOARD_GRID!$B$5:$H$11,1,1)=\"\",\"\",IFERROR(INDEX(BOARD_TABLE!$M$2:$M$50,MATCH(\"R\"&0&\"C\"&0,BOARD_TABLE!$C$2:$C$50,0)),\"\"))","v":0},null,null,null,{"$f":"IF(INDEX(BOARD_GRID!$B$5:$H$11,1,2)=\"\",\"\",IFERROR(INDEX(BOARD_TABLE!$M$2:$M$50,MATCH(\"R\"&0&\"C\"&1,BOARD_TABLE!$C$2:$C$50,0)),\"\"))","v":1},null,null,null,{"$f":"IF(INDEX(BOARD_GRID!$B$5:$H$11,1,3)=\"\",\"\",IFERROR(INDEX(BOARD_TABLE!$M$2:$M$50,MATCH(\"R\"&0&\"C\"&2,BOARD_TABLE!$C$2:$C$50,0)),\"\"))","v":0},null,null,null,{"$f":"IF(INDEX(BOARD_GRID!$B$5:$H$11,1,4)=\"\",\"\",IFERROR(INDEX(BOARD_TABLE!$M$2:$M$50,MATCH(\"R\"&0&\"C\"&3,BOARD_TABLE!$C$2:$C$50,0)),\"\"))","v":0},null,null,null,{"$f":"IF(INDEX(BOARD_GRID!$B$5:$H$11,1,5)=\"\",\"\",IFERROR(INDEX(BOARD_TABLE!$M$2:$M$50,MATCH(\"R\"&0&\"C\"&4,BOARD_TABLE!$C$2:$C$50,0)),\"\"))","v":0},null,null,null,{"$f":"IF(INDEX(BOARD_GRID!$B$5:$H$11,1,6)=\"\",\"\",IFERROR(INDEX(BOARD_TABLE!$M$2:$M$50,MATCH(\"R\"&0&\"C\"&5,BOARD_TABLE!$C$2:$C$50,0)),\"\"))","v":1},null,null,null,{"$f":"IF(INDEX(BOARD_GRID!$B$5:$H$11,1,7)=\"\",\"\",IFERROR(INDEX(BOARD_TABLE!$M$2:$M$50,MATCH(\"R\"&0&\"C\"&6,BOARD_TABLE!$C$2:$C$50,0)),\"\"))","v":0},null,null,null,"Legend"]
[null,{"$f":"IF(INDEX(BOARD_GRID!$B$5:$H$11,1,1)=\"\",\"\",IFERROR(INDEX(BOARD_TABLE!$P$2:$P$50,MATCH(\"R\"&0&\"C\"&0,BOARD_TABLE!$C$2:$C$50,0)),\"\"))","v":0},{"$f":"IF(INDEX(BOARD_GRID!$B$5:$H$11,1,1)=\"\",\"\",INDEX(BOARD_GRID!$B$5:$H$11,1,1)&\" / \"&INDEX(BOARD_GRID!$B$14:$H$20,1,1))","v":"F01 / 90"},{"$f":"IF(INDEX(BOARD_GRID!$B$5:$H$11,1,1)=\"\",\"\",IFERROR(INDEX(BOARD_TABLE!$N$2:$N$50,MATCH(\"R\"&0&\"C\"&0,BOARD_TABLE!$C$2:$C$50,0)),\"\"))","v":1},null,{"$f":"IF(INDEX(BOARD_GRID!$B$5:$H$11,1,2)=\"\",\"\",IFERROR(INDEX(BOARD_TABLE!$P$2:$P$50,MATCH(\"R\"&0&\"C\"&1,BOARD_TABLE!$C$2:$C$50,0)),\"\"))","v":0},{"$f":"IF(INDEX(BOARD_GRID!$B$5:$H$11,1,2)=\"\",\"\",INDEX(BOARD_GRID!$B$5:$H$11,1,2)&\" / \"&INDEX(BOARD_GRID!$B$14:$H$20,1,2))","v":"M29 / 180"},{"$f":"IF(INDEX(BOARD_GRID!$B$5:$H$11,1,2)=\"\",\"\",IFERROR(INDEX(BOARD_TABLE!$N$2:$N$50,MATCH(\"R\"&0&\"C\"&1,BOARD_TABLE!$C$2:$C$50,0)),\"\"))","v":0},null,{"$f":"IF(INDEX(BOARD_GRID!$B$5:$H$11,1,3)=\"\",\"\",IFERROR(INDEX(BOARD_TABLE!$P$2:$P$50,MATCH(\"R\"&0&\"C\"&2,BOARD_TABLE!$C$2:$C$50,0)),\"\"))","v":1},{"$f":"IF(INDEX(BOARD_GRID!$B$5:$H$11,1,3)=\"\",\"\",INDEX(BOARD_GRID!$B$5:$H$11,1,3)&\" / \"&INDEX(BOARD_GRID!$B$14:$H$20,1,3))","v":"F05 / 180"},{"$f":"IF(INDEX(BOARD_GRID!$B$5:$H$11,1,3)=\"\",\"\",IFERROR(INDEX(BOARD_TABLE!$N$2:$N$50,MATCH(\"R\"&0&\"C\"&2,BOARD_TABLE!$C$2:$C$50,0)),\"\"))","v":1},null,{"$f":"IF(INDEX(BOARD_GRID!$B$5:$H$11,1,4)=\"\",\"\",IFERROR(INDEX(BOARD_TABLE!$P$2:$P$50,MATCH(\"R\"&0&\"C\"&3,BOARD_TABLE!$C$2:$C$50,0)),\"\"))","v":1},{"$f":"IF(INDEX(BOARD_GRID!$B$5:$H$11,1,4)=\"\",\"\",INDEX(BOARD_GRID!$B$5:$H$11,1,4)&\" / \"&INDEX(BOARD_GRID!$B$14:$H$20,1,4))","v":"M11 / 180"},{"$f":"IF(INDEX(BOARD_GRID!$B$5:$H$11,1,4)=\"\",\"\",IFERROR(INDEX(BOARD_TABLE!$N$2:$N$50,MATCH(\"R\"&0&\"C\"&3,BOARD_TABLE!$C$2:$C$50,0)),\"\"))","v":1},null,{"$f":"IF(INDEX(BOARD_GRID!$B$5:$H$11,1,5)=\"\",\"\",IFERROR(INDEX(BOARD_TABLE!$P$2:$P$50,MATCH(\"R\"&0&\"C\"&4,BOARD_TABLE!$C$2:$C$50,0)),\"\"))","v":1},{"$f":"IF(INDEX(BOARD_GRID!$B$5:$H$11,1,5)=\"\",\"\",INDEX(BOARD_GRID!$B$5:$H$11,1,5)&\" / \"&INDEX(BOARD_GRID!$B$14:$H$20,1,5))","v":"F06 / 180"},{"$f":"IF(INDEX(BOARD_GRID!$B$5:$H$11,1,5)=\"\",\"\",IFERROR(INDEX(BOARD_TABLE!$N$2:$N$50,MATCH(\"R\"&0&\"C\"&4,BOARD_TABLE!$C$2:$C$50,0)),\"\"))","v":1},null,{"$f":"IF(INDEX(BOARD_GRID!$B$5:$H$11,1,6)=\"\",\"\",IFERROR(INDEX(BOARD_TABLE!$P$2:$P$50,MATCH(\"R\"&0&\"C\"&5,BOARD_TABLE!$C$2:$C$50,0)),\"\"))","v":1},{"$f":"IF(INDEX(BOARD_GRID!$B$5:$H$11,1,6)=\"\",\"\",INDEX(BOARD_GRID!$B$5:$H$11,1,6)&\" / \"&INDEX(BOARD_GRID!$B$14:$H$20,1,6))","v":"M21 / 270"},{"$f":"IF(INDEX(BOARD_GRID!$B$5:$H$11,1,6)=\"\",\"\",IFERROR(INDEX(BOARD_TABLE!$N$2:$N$50,MATCH(\"R\"&0&\"C\"&5,BOARD_TABLE!$C$2:$C$50,0)),\"\"))","v":0},null,{"$f":"IF(INDEX(BOARD_GRID!$B$5:$H$11,1,7)=\"\",\"\",IFERROR(INDEX(BOARD_TABLE!$P$2:$P$50,MATCH(\"R\"&0&\"C\"&6,BOARD_TABLE!$C$2:$C$50,0)),\"\"))","v":1},{"$f":"IF(INDEX(BOARD_GRID!$B$5:$H$11,1,7)=\"\",\"\",INDEX(BOARD_GRID!$B$5:$H$11,1,7)&\" / \"&INDEX(BOARD_GRID!$B$14:$H$20,1,7))","v":"F02 / 180"},{"$f":"IF(INDEX(BOARD_GRID!$B$5:$H$11,1,7)=\"\",\"\",IFERROR(INDEX(BOARD_TABLE!$N$2:$N$50,MATCH(\"R\"&0&\"C\"&6,BOARD_TABLE!$C$2:$C$50,0)),\"\"))","v":0},null,null,"Center: TileID / Rotation"]
[null,null,{"$f":"IF(INDEX(BOARD_GRID!$B$5:$H$11,1,1)=\"\",\"\",IFERROR(INDEX(BOARD_TABLE!$O$2:$O$50,MATCH(\"R\"&0&\"C\"&0,BOARD_TABLE!$C$2:$C$50,0)),\"\"))","v":1},null,null,null,{"$f":"IF(INDEX(BOARD_GRID!$B$5:$H$11,1,2)=\"\",\"\",IFERROR(INDEX(BOARD_TABLE!$O$2:$O$50,MATCH(\"R\"&0&\"C\"&1,BOARD_TABLE!$C$2:$C$50,0)),\"\"))","v":1},null,null,null,{"$f":"IF(INDEX(BOARD_GRID!$B$5:$H$11,1,3)=\"\",\"\",IFERROR(INDEX(BOARD_TABLE!$O$2:$O$50,MATCH(\"R\"&0&\"C\"&2,BOARD_TABLE!$C$2:$C$50,0)),\"\"))","v":1},null,null,null,{"$f":"IF(INDEX(BOARD_GRID!$B$5:$H$11,1,4)=\"\",\"\",IFERROR(INDEX(BOARD_TABLE!$O$2:$O$50,MATCH(\"R\"&0&\"C\"&3,BOARD_TABLE!$C$2:$C$50,0)),\"\"))","v":1},null,null,null,{"$f":"IF(INDEX(BOARD_GRID!$B$5:$H$11,1,5)=\"\",\"\",IFERROR(INDEX(BOARD_TABLE!$O$2:$O$50,MATCH(\"R\"&0&\"C\"&4,BOARD_TABLE!$C$2:$C$50,0)),\"\"))","v":1},null,null,null,{"$f":"IF(INDEX(BOARD_GRID!$B$5:$H$11,1,6)=\"\",\"\",IFERROR(INDEX(BOARD_TABLE!$O$2:$O$50,MATCH(\"R\"&0&\"C\"&5,BOARD_TABLE!$C$2:$C$50,0)),\"\"))","v":0},null,null,null,{"$f":"IF(INDEX(BOARD_GRID!$B$5:$H$11,1,7)=\"\",\"\",IFERROR(INDEX(BOARD_TABLE!$O$2:$O$50,MATCH(\"R\"&0&\"C\"&6,BOARD_TABLE!$C$2:$C$50,0)),\"\"))","v":1},null,null,null,"Edges: OpenN/E/S/W (0/1)"]
[]
[null,null,{"$f":"IF(INDEX(BOARD_GRID!$B$5:$H$11,2,1)=\"\",\"\",IFERROR(INDEX(BOARD_TABLE!$M$2:$M$50,MATCH(\"R\"&1&\"C\"&0,BOARD_TABLE!$C$2:$C$50,0)),\"\"))","v":0},null,null,null,{"$f":"IF(INDEX(BOARD_GRID!$B$5:$H$11,2,2)=\"\",\"\",IFERROR(INDEX(BOARD_TABLE!$M$2:$M$50,MATCH(\"R\"&1&\"C\"&1,BOARD_TABLE!$C$2:$C$50,0)),\"\"))","v":1},null,null,null,{"$f":"IF(INDEX(BOARD_GRID!$B$5:$H$11,2,3)=\"\",\"\",IFERROR(INDEX(BOARD_TABLE!$M$2:$M$50,MATCH(\"R\"&1&\"C\"&2,BOARD_TABLE!$C$2:$C$50,0)),\"\"))","v":0},null,null,null,{"$f":"IF(INDEX(BOARD_GRID!$B$5:$H$11,2,4)=\"\",\"\",IFERROR(INDEX(BOARD_TABLE!$M$2:$M$50,MATCH(\"R\"&1&\"C\"&3,BOARD_TABLE!$C$2:$C$50,0)),\"\"))","v":0},null,null,null,{"$f":"IF(INDEX(BOARD_GRID!$B$5:$H$11,2,5)=\"\",\"\",IFERROR(INDEX(BOARD_TABLE!$M$2:$M$50,MATCH(\"R\"&1&\"C\"&4,BOARD_TABLE!$C$2:$C$50,0)),\"\"))","v":1},null,null,null,{"$f":"IF(INDEX(BOARD_GRID!$B$5:$H$11,2,6)=\"\",\"\",IFERROR(INDEX(BOARD_TABLE!$M$2:$M$50,MATCH(\"R\"&1&\"C\"&5,BOARD_TABLE!$C$2:$C$50,0)),\"\"))","v":1},null,null,null,{"$f":"IF(INDEX(BOARD_GRID!$B$5:$H$11,2,7)=\"\",\"\",IFERROR(INDEX(BOARD_TABLE!$M$2:$M$50,MATCH(\"R\"&1&\"C\"&6,BOARD_TABLE!$C$2:$C$50,0)),\"\"))","v":1}]
[null,{"$f":"IF(INDEX(BOARD_GRID!$B$5:$H$11,2,1)=\"\",\"\",IFERROR(INDEX(BOARD_TABLE!$P$2:$P$50,MATCH(\"R\"&1&\"C\"&0,BOARD_TABLE!$C$2:$C$50,0)),\"\"))","v":1},{"$f":"IF(INDEX(BOARD_GRID!$B$5:$H$11,2,1)=\"\",\"\",INDEX(BOARD_GRID!$B$5:$H$11,2,1)&\" / \"&INDEX(BOARD_GRID!$B$14:$H$20,2,1))","v":"M30 / 90"},{"$f":"IF(INDEX(BOARD_GRID!$B$5:$H$11,2,1)=\"\",\"\",IFERROR(INDEX(BOARD_TABLE!$N$2:$N$50,MATCH(\"R\"&1&\"C\"&0,BOARD_TABLE!$C$2:$C$50,0)),\"\"))","v":1},null,{"$f":"IF(INDEX(BOARD_GRID!$B$5:$H$11,2,2)=\"\",\"\",IFERROR(INDEX(BOARD_TABLE!$P$2:$P$50,MATCH(\"R\"&1&\"C\"&1,BOARD_TABLE!$C$2:$C$50,0)),\"\"))","v":1},{"$f":"IF(INDEX(BOARD_GRID!$B$5:$H$11,2,2)=\"\",\"\",INDEX(BOARD_GRID!$B$5:$H$11,2,2)&\" / \"&INDEX(BOARD_GRID!$B$14:$H$20,2,2))","v":"M01 / 270"},{"$f":"IF(INDEX(BOARD_GRID!$B$5:$H$11,2,2)=\"\",\"\",IFERROR(INDEX(BOARD_TABLE!$N$2:$N$50,MATCH(\"R\"&1&\"C\"&1,BOARD_TABLE!$C$2:$C$50,0)),\"\"))","v":0},null,{"$f":"IF(INDEX(BOARD_GRID!$B$5:$H$11,2,3)=\"\",\"\",IFERROR(INDEX(BOARD_TABLE!$P$2:$P$50,MATCH(\"R\"&1&\"C\"&2,BOARD_TABLE!$C$2:$C$50,0)),\"\"))","v":1},{"$f":"IF(INDEX(BOARD_GRID!$B$5:$H$11,2,3)=\"\",\"\",INDEX(BOARD_GRID!$B$5:$H$11,2,3)&\" / \"&INDEX(BOARD_GRID!$B$14:$H$20,2,3))","v":"M10 / 180"},{"$f":"IF(INDEX(BOARD_GRID!$B$5:$H$11,2,3)=\"\",\"\",IFERROR(INDEX(BOARD_TABLE!$N$2:$N$50,MATCH(\"R\"&1&\"C\"&2,BOARD_TABLE!$C$2:$C$50,0)),\"\"))","v":0},null,{"$f":"IF(INDEX(BOARD_GRID!$B$5:$H$11,2,4)=\"\",\"\",IFERROR(INDEX(BOARD_TABLE!$P$2:$P$50,MATCH(\"R\"&1&\"C\"&3,BOARD_TABLE!$C$2:$C$50,0)),\"\"))","v":1},{"$f":"IF(INDEX(BOARD_GRID!$B$5:$H$11,2,4)=\"\",\"\",INDEX(BOARD_GRID!$B$5:$H$11,2,4)&\" / \"&INDEX(BOARD_GRID!$B$14:$H$20,2,4))","v":"M23 / 90"},{"$f":"IF(INDEX(BOARD_GRID!$B$5:$H$11,2,4)=\"\",\"\",IFERROR(INDEX(BOARD_TABLE!$N$2:$N$50,MATCH(\"R\"&1&\"C\"&3,BOARD_TABLE!$C$2:$C$50,0)),\"\"))","v":1},null,{"$f":"IF(INDEX(BOARD_GRID!$B$5:$H$11,2,5)=\"\",\"\",IFERROR(INDEX(BOARD_TABLE!$P$2:$P$50,MATCH(\"R\"&1&\"C\"&4,BOARD_TABLE!$C$2:$C$50,0)),\"\"))","v":0},{"$f":"IF(INDEX(BOARD_GRID!$B$5:$H$11,2,5)=\"\",\"\",INDEX(BOARD_GRID!$B$5:$H$11,2,5)&\" / \"&INDEX(BOARD_GRID!$B$14:$H$20,2,5))","v":"M27 / 180"},{"$f":"IF(INDEX(BOARD_GRID!$B$5:$H$11,2,5)=\"\",\"\",IFERROR(INDEX(BOARD_TABLE!$N$2:$N$50,MATCH(\"R\"&1&\"C\"&4,BOARD_TABLE!$C$2:$C$50,0)),\"\"))","v":0},null,{"$f":"IF(INDEX(BOARD_GRID!$B$5:$H$11,2,6)=\"\",\"\",IFERROR(INDEX(BOARD_TABLE!$P$2:$P$50,MATCH(\"R\"&1&\"C\"&5,BOARD_TABLE!$C$2:$C$50,0)),\"\"))","v":0},{"$f":"IF(INDEX(BOARD_GRID!$B$5:$H$11,2,6)=\"\",\"\",INDEX(BOARD_GRID!$B$5:$H$11,2,6)&\" / \"&INDEX(BOARD_GRID!$B$14:$H$20,2,6))","v":"M24 / 180"},{"$f":"IF(INDEX(BOARD_GRID!$B$5:$H$11,2,6)=\"\",\"\",IFERROR(INDEX(BOARD_TABLE!$N$2:$N$50,MATCH(\"R\"&1&\"C\"&5,BOARD_TABLE!$C$2:$C$50,0)),\"\"))","v":0},null,{"$f":"IF(INDEX(BOARD_GRID!$B$5:$H$11,2,7)=\"\",\"\",IFERROR(INDEX(BOARD_TABLE!$P$2:$P$50,MATCH(\"R\"&1&\"C\"&6,BOARD_TABLE!$C$2:$C$50,0)),\"\"))","v":1},{"$f":"IF(INDEX(BOARD_GRID!$B$5:$H$11,2,7)=\"\",\"\",INDEX(BOARD_GRID!$B$5:$H$11,2,7)&\" / \"&INDEX(BOARD_GRID!$B$14:$H$20,2,7))","v":"M04 / 270"},{"$f":"IF(INDEX(BOARD_GRID!$B$5:$H$11,2,7)=\"\",\"\",IFERROR(INDEX(BOARD_TABLE!$N$2:$N$50,MATCH(\"R\"&1&\"C\"&6,BOARD_TABLE!$C$2:$C$50,0)),\"\"))","v":0}]
[null,null,{"$f":"IF(INDEX(BOARD_GRID!$B$5:$H$11,2,1)=\"\",\"\",IFERROR(INDEX(BOARD_TABLE!$O$2:$O$50,MATCH(\"R\"&1&\"C\"&0,BOARD_TABLE!$C$2:$C$50,0)),\"\"))","v":0},null,null,null,{"$f":"IF(INDEX(BOARD_GRID!$B$5:$H$11,2,2)=\"\",\"\",IFERROR(INDEX(BOARD_TABLE!$O$2:$O$50,MATCH(\"R\"&1&\"C\"&1,BOARD_TABLE!$C$2:$C$50,0)),\"\"))","v":1},null,null,null,{"$f":"IF(INDEX(BOARD_GRID!$B$5:$H$11,2,3)=\"\",\"\",IFERROR(INDEX(BOARD_TABLE!$O$2:$O$50,MATCH(\"R\"&1&\"C\"&2,BOARD_TABLE!$C$2:$C$50,0)),\"\"))","v":1},null,null,null,{"$f":"IF(INDEX(BOARD_GRID!$B$5:$H$11,2,4)=\"\",\"\",IFERROR(INDEX(BOARD_TABLE!$O$2:$O$50,MATCH(\"R\"&1&\"C\"&3,BOARD_TABLE!$C$2:$C$50,0)),\"\"))","v":0},null,null,null,{"$f":"IF(INDEX(BOARD_GRID!$B$5:$H$11,2,5)=\"\",\"\",IFERROR(INDEX(BOARD_TABLE!$O$2:$O$50,MATCH(\"R\"&1&\"C\"&4,BOARD_TABLE!$C$2:$C$50,0)),\"\"))","v":1},null,null,null,{"$f":"IF(INDEX(BOARD_GRID!$B$5:$H$11,2,6)=\"\",\"\",IFERROR(INDEX(BOARD_TABLE!$O$2:$O$50,MATCH(\"R\"&1&\"C\"&5,BOARD_TABLE!$C$2:$C$50,0)),\"\"))","v":1},null,null,null,{"$f":"IF(INDEX(BOARD_GRID!$B$5:$H$11,2,7)=\"\",\"\",IFERROR(INDEX(BOARD_TABLE!$O$2:$O$50,MATCH(\"R\"&1&\"C\"&6,BOARD_TABLE!$C$2:$C$50,0)),\"\"))","v":1}]
{"$rows_left_out":21}
{"sheet":"MOVE_SIM","index":4,"n_rows":32,"n_cols":8,"rows_kept":32,"cut":false,"hidden":false,"merged":[]}
["MOVE_SIM — Push preview (nem módosítja a BOARD_GRID-et)"]
["Inputs:"]
["MoveType (ROW/COL):","ROW"]
["Line (2/4/6):",2]
["Direction (ROW: L/R, COL: U/D):","L"]
[]
["SpareTileID (from BOARD_GRID):",{"$f":"BOARD_GRID!$K$4","v":"M05"}]
["SpareRotation (from BOARD_GRID):",{"$f":"BOARD_GRID!$K$5","v":270}]
{"$rows_left_out":25}
{"sheet":"PLAYERS","index":5,"n_rows":5,"n_cols":11,"rows_kept":5,"cut":false,"hidden":false,"merged":[]}
["PlayerID","InGame","PlayerName","StartRow","StartCol","StartPosID","CurrentRow","CurrentCol","CurrentPosID","CurrentTargetTreasureID","Notes"]
["P1",{"$f":"GAME_VIEW!C19","v":"YES"},"Player 1",1,7,{"$f":"\"R\"&D2-1&\"C\"&E2-1","v":"R0C6"},1,1,{"$f":"\"R\"&G2-1&\"C\"&H2-1","v":"R0C0"}]
["P2",{"$f":"GAME_VIEW!C20","v":"YES"},"Player 2",7,7,{"$f":"\"R\"&D3-1&\"C\"&E3-1","v":"R6C6"},1,7,{"$f":"\"R\"&G3-1&\"C\"&H3-1","v":"R0C6"}]
["P3",{"$f":"GAME_VIEW!C21","v":"NO"},"Player 3",7,1,{"$f":"\"R\"&D4-1&\"C\"&E4-1","v":"R6C0"},7,1,{"$f":"\"R\"&G4-1&\"C\"&H4-1","v":"R6C0"},"SPIDER"]
["P4",{"$f":"GAME_VIEW!C22","v":"NO"},"Player 4",1,1,{"$f":"\"R\"&D5-1&\"C\"&E5-1","v":"R0C0"},1,1,{"$f":"\"R\"&G5-1&\"C\"&H5-1","v":"R0C0"},"OWL"]

{"sheet":"TREASURE_CARDS","index":6,"n_rows":25,"n_cols":7,"rows_kept":25,"cut":false,"hidden":false,"merged":[]}
["TreasureID","TileID","TileFixed","BaseOpen_N","BaseOpen_E","BaseOpen_S","BaseOpen_W"]
["ARMOR","F16","YES",1,1,0,1]
["BAT","M05","NO",1,1,0,1]
["BEETLE","M09","NO",1,1,0,0]
["BOOK","F05","YES",1,1,0,1]
["CANDLESTICK","F15","YES",1,1,0,1]
["CAT","M03","NO",1,1,0,0]
["CROWN","F08","YES",1,1,0,1]
{"$rows_left_out":18}
{"sheet":"PLAYER_TREASURE","index":7,"n_rows":25,"n_cols":6,"rows_kept":25,"cut":false,"hidden":false,"merged":[]}
["PlayerID","Seq","TreasureID","Status","Revealed","FoundTurn"]
["P1",1,"BOOK","PENDING","NO"]
["P1",2,"POSION","PENDING","NO"]
["P1",3,"DRAGON","PENDING","NO"]
["P1",4,"SWORD","PENDING","NO"]
["P1",5,"GOBLET","PENDING","NO"]
["P1",6,"BEETLE","PENDING","NO"]
["P1",7,"SPIDER","PENDING","NO"]
{"$rows_left_out":18}
{"sheet":"TURN_LOG","index":8,"n_rows":1,"n_cols":13,"rows_kept":1,"cut":false,"hidden":false,"merged":[]}
["Turn","ActivePlayerID","MoveType","Line","Direction","StartRow","StartCol","EndRow","EndCol","TargetTreasureID","TargetReached","Notes","Timestamp"]

{"sheet":"MOVE_EVAL","index":9,"n_rows":5,"n_cols":2,"rows_kept":5,"cut":false,"hidden":false,"merged":[]}
["MOVE_EVAL — SuggestBestMove2 inputs/results"]
["PlayerRow (1..7)",1]
["PlayerCol (1..7)",1]
["TargetTreasureID (e.g. BOOK)"]
["OR TargetTileID (optional)"]

{"sheet":"PLAYER_POS_LOG","index":10,"n_rows":1,"n_cols":11,"rows_kept":1,"cut":false,"hidden":false,"merged":[]}
["Turn","P1_Row","P1_Col","P2_Row","P2_Col","P3_Row","P3_Col","P4_Row","P4_Col","Notes","Timestamp"]

{"sheet":"GAME_VIEW","index":11,"n_rows":270,"n_cols":18,"rows_kept":270,"cut":false,"hidden":false,"merged":[[10,10,10,11],[1,13,7,16],[6,17,7,23]]}
["Row","GAME_VIEW",null,null,null,null,null,null,"SPARE"]
[1,null,null,null,null,null,null,null,null,null,null,null,null,"A PLAYERS (C19) állítsd be az aktív játékosokat(In Game)!\nA játék fázisokban működik (Phase lock)\n1) PUSH (betolás)\nA panelen állítsd be:\nSide: L / R / U / D\nLane: 2 / 4 / 6\nSpareRot: 0 / 90 / 180 / 270 (most még előkészítve van)\nNyomd meg: Commit\nbetolja a spare csempét\neltolja a megfelelő sort/oszlopot\nha játékos “kilökődne”, átkerül a túloldalra (shiftPlayers logika)\nfrissül a tábla és a tokenek megjelenítése.\n➡️ Ezután a fázis MOVE.\n2) MOVE (játékos lépés)\nA panelen add meg:\nTarget Row (1..7)\nTarget Col (1..7)\nNyomd meg: Move active player\ncsak akkor enged, ha a célmező elérhető (reachable)\nha a játékos a célkincsre lép, a kincs státusza frissül és új targetet kap\n➡️ Ezután a fázis END.\n3) END (kör vége)\nNyomd meg: Next Turn\naktív játékos vált a következő InGame játékosra\nfázis vissza PUSH-ra"]
[2]
[3]
[4]
[5]
[6,null,null,null,null,null,null,null,null,null,null,null,null,null,null,null,null,"Hasznos Gombok:\nRefresh GAME VIEW: a táblarajz és a spare csempe frissítése\nRefresh GAME HUD: HUD + tokenek frissítése\nUpdate Reachable: elérhető mezők újraszámolása (ha kell)\nReset Game - kiüríti a mozgatható csempéket.\nRandom Fill - Véletlenszerűen feltölti a mozgatható csempéket."]
[7]
{"$rows_left_out":263}
{"sheet":"GV2_LOG","index":12,"n_rows":17,"n_cols":9,"rows_kept":17,"cut":false,"hidden":false,"merged":[]}
["BoardPos(0based)","rr/cc(1based)","TileID(raw)","TileKey","Rot","TilesRow","ImgCell","FoundPic","Status"]
["(0,0)","2025-01-01","F01","F01",90,2,"I2","YES","OK"]
["(0,2)","2025-01-03","F05","F05",180,6,"I6","YES","OK"]
["(0,4)","2025-01-05","F06","F06",180,7,"I7","YES","OK"]
["(0,6)","2025-01-07","F02","F02",180,3,"I3","YES","OK"]
["(2,0)","2025-03-01","F07","F07",90,8,"I8","YES","OK"]
["(2,2)","2025-03-03","F08","F08",90,9,"I9","YES","OK"]
["(2,4)","2025-03-05","F09","F09",180,10,"I10","YES","OK"]
{"$rows_left_out":9}