{"text_format":"1","workbook":"xlsx","n_sheets":13,"sheets":["TILES","BOARD_GRID","BOARD_TABLE","BOARD_EDGE_VIEW","MOVE_SIM","PLAYERS","TREASURE_CARDS","PLAYER_TREASURE","TURN_LOG","MOVE_EVAL","PLAYER_POS_LOG","GAME_VIEW","GV2_LOG"],"not_rendered":{"charts":0,"images":68,"macros":1,"external_links":0,"defined_names":1,"comments":0,"pivot_tables":0},"unopened":[],"bounds":{"document_bytes":16777216,"sheet_cells":100000,"rows_first":2000,"rows_last":500,"rows_between":2000,"halvings":0,"cell_chars":16384,"cell_head_chars":4096},"cells_cut":0,"cells_raw":0,"read":"whole","date_system":"1900"}

{"sheet":"TILES","index":0,"n_rows":51,"n_cols":16,"rows_kept":51,"cut":false,"hidden":false,"merged":[[1,15,24,23]]}
["TileID","Shape","Fixed","TreasureID","BaseOpen_N","BaseOpen_E","BaseOpen_S","BaseOpen_W","TilesImage"]
["F01","CORNER","YES",null,1,1,0,0,null,null,null,null,null,null,null,{"$error":"#VALUE!"}]
["F02","CORNER","YES",null,1,1,0,0]
["F03","CORNER","YES",null,1,1,0,0]
["F04","CORNER","YES",null,1,1,0,0]
["F05","T_JUNCTION","YES","BOOK",1,1,0,1]
["F06","T_JUNCTION","YES","MONEYBAG",1,1,0,1]
["F07","T_JUNCTION","YES","POSION",1,1,0,1]
["F08","T_JUNCTION","YES","CROWN",1,1,0,1]
["F09","T_JUNCTION","YES","KEY",1,1,0,1]
["F10","T_JUNCTION","YES","GOBLET",1,1,0,1]
["F11","T_JUNCTION","YES","RING",1,1,0,1]
["F12","T_JUNCTION","YES","TREASURE_CHEST",1,1,0,1]
["F13","T_JUNCTION","YES","EMERALD",1,1,0,1]
["F14","T_JUNCTION","YES","SWORD",1,1,0,1]
["F15","T_JUNCTION","YES","CANDLESTICK",1,1,0,1]
["F16","T_JUNCTION","YES","ARMOR",1,1,0,1]
["M01","T_JUNCTION","NO","UNICORN",1,1,0,1]
["M02","CORNER","NO","OWL",1,1,0,0]
["M03","CORNER","NO","CAT",1,1,0,0]
["M04","T_JUNCTION","NO","GENIE",1,1,0,1]
["M05","T_JUNCTION","NO","BAT",1,1,0,1]
["M06","T_JUNCTION","NO","GHOST",1,1,0,1]
["M07","CORNER","NO","LIZARD",1,1,0,0]
["M08","CORNER","NO","MOUSE",1,1,0,0]
["M09","CORNER","NO","BEETLE",1,1,0,0]
["M10","CORNER","NO","SPIDER",1,1,0,0]
["M11","T_JUNCTION","NO","DRAGON",1,1,0,1]
["M12","T_JUNCTION","NO","GOBLIN",1,1,0,1]
["M13","CORNER","NO",null,1,1,0,0]
["M14","CORNER","NO",null,1,1,0,0]
["M15","CORNER","NO",null,1,1,0,0]
["M16","CORNER","NO",null,1,1,0,0]
["M17","CORNER","NO",null,1,1,0,0]
["M18","CORNER","NO",null,1,1,0,0]
["M19","CORNER","NO",null,1,1,0,0]
["M20","CORNER","NO",null,1,1,0,0]
["M21","CORNER","NO",null,1,1,0,0]
["M22","STRAIGHT","NO",null,1,0,1,0]
["M23","STRAIGHT","NO",null,1,0,1,0]
["M24","STRAIGHT","NO",null,1,0,1,0]
["M25","STRAIGHT","NO",null,1,0,1,0]
["M26","STRAIGHT","NO",null,1,0,1,0]
["M27","STRAIGHT","NO",null,1,0,1,0]
["M28","STRAIGHT","NO",null,1,0,1,0]
["M29","STRAIGHT","NO",null,1,0,1,0]
["M30","STRAIGHT","NO",null,1,0,1,0]
["M31","STRAIGHT","NO",null,1,0,1,0]
["M32","STRAIGHT","NO",null,1,0,1,0]
["M33","STRAIGHT","NO",null,1,0,1,0]
["M34","STRAIGHT","NO",null,1,0,1,0]

{"sheet":"BOARD_GRID","index":1,"n_rows":20,"n_cols":11,"rows_kept":20,"cut":false,"hidden":false,"merged":[[11,0,11,7],[2,0,2,7],[0,0,0,7]]}
["BOARD_GRID – tábla rács (a kékkel jelölt cellák kitöltendők)"]
[]
["TileID (7×7)",null,null,null,null,null,null,null,null,"Tartalék csempe (SpareTile)"]
["Row\\Col",0,1,2,3,4,5,6,null,"SpareTileID","M05"]
[0,"F01","M29","F05","M11","F06","M21","F02",null,"SpareRotation",270]
[1,"M30","M01","M10","M23","M27","M24","M04"]
[2,"F07","M31","F08","M32","F09","M13","F10"]
[3,"M19","M07","M25","M16","M33","M15","M22"]
[4,"F11","M02","F12","M20","F13","M17","F14"]
[5,"M34","M18","M28","M12","M06","M26","M09"]
[6,"F04","M08","F15","M03","F16","M14","F03"]
["Rotation (0/90/180/270) – ugyanaz a koordináta, mint fent"]
["Row\\Col",0,1,2,3,4,5,6]
[0,90,180,180,180,180,270,180]
[1,90,270,180,90,180,180,270]
[2,90,270,90,90,180,0,270]
[3,0,90,0,270,90,270,0]
[4,90,90,0,90,270,270,270]
[5,0,180,180,270,180,180,0]
[6,0,90,0,0,0,0,270]

{"sheet":"BOARD_TABLE","index":2,"n_rows":50,"n_cols":16,"rows_kept":50,"cut":false,"hidden":false,"merged":[]}
["Row","Col","PosID","TileID","Rotation","Fixed","Shape","TreasureID","BaseN","BaseE","BaseS","BaseW","OpenN","OpenE","OpenS","OpenW"]
[{"$f":"INT((ROW()-2)/7)","v":0},{"$f":"MOD(ROW()-2,7)","v":0},{"$f":"\"R\"&A2&\"C\"&B2","v":"R0C0"},{"$f":"INDEX(BOARD_GRID!$B$5:$H$11,A2+1,B2+1)","v":"F01"},{"$f":"INDEX(BOARD_GRID!$B$14:$H$20,A2+1,B2+1)","v":90},{"$f":"IF(D2=\"\",\"\",INDEX(TILES!$C:$C,MATCH(D2,TILES!$A:$A,0)))","v":"YES"},{"$f":"IF(D2=\"\",\"\",INDEX(TILES!$B:$B,MATCH(D2,TILES!$A:$A,0)))","v":"CORNER"},{"$f":"IF(D2=\"\",\"\",INDEX(TILES!$D:$D,MATCH(D2,TILES!$A:$A,0)))","v":0},{"$f":"IF(D2=\"\",\"\",INDEX(TILES!$E:$E,MATCH(D2,TILES!$A:$A,0)))","v":1},{"$f":"IF(D2=\"\",\"\",INDEX(TILES!$F:$F,MATCH(D2,TILES!$A:$A,0)))","v":1},{"$f":"IF(D2=\"\",\"\",INDEX(TILES!$G:$G,MATCH(D2,TILES!$A:$A,0)))","v":0},{"$f":"IF(D2=\"\",\"\",INDEX(TILES!$H:$H,MATCH(D2,TILES!$A:$A,0)))","v":0},{"$f":"IF(D2=\"\",\"\",IFERROR(CHOOSE(MATCH(MOD(E2,360),{0,90,180,270},0),I2,L2,K2,J2),\"\"))","v":0},{"$f":"IF(D2=\"\",\"\",IFERROR(CHOOSE(MATCH(MOD(E2,360),{0,90,180,270},0),J2,I2,L2,K2),\"\"))","v":1},{"$f":"IF(D2=\"\",\"\",IFERROR(CHOOSE(MATCH(MOD(E2,360),{0,90,180,270},0),K2,J2,I2,L2),\"\"))","v":1},{"$f":"IF(D2=\"\",\"\",IFERROR(CHOOSE(MATCH(MOD(E2,360),{0,90,180,270},0),L2,K2,J2,I2),\"\"))","v":0}]
[0,1,"R0C1",{"$f":"INDEX(BOARD_GRID!$B$5:$H$11,A3+1,B3+1)","v":"M29"},{"$f":"INDEX(BOARD_GRID!$B$14:$H$20,A3+1,B3+1)","v":180},{"$f":"IF(D3=\"\",\"\",INDEX(TILES!$C:$C,MATCH(D3,TILES!$A:$A,0)))","v":"NO"},{"$f":"IF(D3=\"\",\"\",INDEX(TILES!$B:$B,MATCH(D3,TILES!$A:$A,0)))","v":"STRAIGHT"},{"$f":"IF(D3=\"\",\"\",INDEX(TILES!$D:$D,MATCH(D3,TILES!$A:$A,0)))","v":0},{"$f":"IF(D3=\"\",\"\",INDEX(TILES!$E:$E,MATCH(D3,TILES!$A:$A,0)))","v":1},{"$f":"IF(D3=\"\",\"\",INDEX(TILES!$F:$F,MATCH(D3,TILES!$A:$A,0)))","v":0},{"$f":"IF(D3=\"\",\"\",INDEX(TILES!$G:$G,MATCH(D3,TILES!$A:$A,0)))","v":1},{"$f":"IF(D3=\"\",\"\",INDEX(TILES!$H:$H,MATCH(D3,TILES!$A:$A,0)))","v":0},{"$f":"IF(D3=\"\",\"\",IFERROR(CHOOSE(MATCH(MOD(E3,360),{0,90,180,270},0),I3,L3,K3,J3),\"\"))","v":1},{"$f":"IF(D3=\"\",\"\",IFERROR(CHOOSE(MATCH(MOD(E3,360),{0,90,180,270},0),J3,I3,L3,K3),\"\"))","v":0},{"$f":"IF(D3=\"\",\"\",IFERROR(CHOOSE(MATCH(MOD(E3,360),{0,90,180,270},0),K3,J3,I3,L3),\"\"))","v":1},{"$f":"IF(D3=\"\",\"\",IFERROR(CHOOSE(MATCH(MOD(E3,360),{0,90,180,270},0),L3,K3,J3,I3),\"\"))","v":0}]
[0,2,"R0C2",{"$f":"INDEX(BOARD_GRID!$B$5:$H$11,A4+1,B4+1)","v":"F05"},{"$f":"INDEX(BOARD_GRID!$B$14:$H$20,A4+1,B4+1)","v":180},{"$f":"IF(D4=\"\",\"\",INDEX(TILES!$C:$C,MATCH(D4,TILES!$A:$A,0)))","v":"YES"},{"$f":"IF(D4=\"\",\"\",INDEX(TILES!$B:$B,MATCH(D4,TILES!$A:$A,0)))","v":"T_JUNCTION"},{"$f":"IF(D4=\"\",\"\",INDEX(TILES!$D:$D,MATCH(D4,TILES!$A:$A,0)))","v":"BOOK"},{"$f":"IF(D4=\"\",\"\",INDEX(TILES!$E:$E,MATCH(D4,TILES!$A:$A,0)))","v":1},{"$f":"IF(D4=\"\",\"\",INDEX(TILES!$F:$F,MATCH(D4,TILES!$A:$A,0)))","v":1},{"$f":"IF(D4=\"\",\"\",INDEX(TILES!$G:$G,MATCH(D4,TILES!$A:$A,0)))","v":0},{"$f":"IF(D4=\"\",\"\",INDEX(TILES!$H:$H,MATCH(D4,TILES!$A:$A,0)))","v":1},{"$f":"IF(D4=\"\",\"\",IFERROR(CHOOSE(MATCH(MOD(E4,360),{0,90,180,270},0),I4,L4,K4,J4),\"\"))","v":0},{"$f":"IF(D4=\"\",\"\",IFERROR(CHOOSE(MATCH(MOD(E4,360),{0,90,180,270},0),J4,I4,L4,K4),\"\"))","v":1},{"$f":"IF(D4=\"\",\"\",IFERROR(CHOOSE(MATCH(MOD(E4,360),{0,90,180,270},0),K4,J4,I4,L4),\"\"))","v":1},{"$f":"IF(D4=\"\",\"\",IFERROR(CHOOSE(MATCH(MOD(E4,360),{0,90,180,270},0),L4,K4,J4,I4),\"\"))","v":1}]
[0,3,"R0C3",{"$f":"INDEX(BOARD_GRID!$B$5:$H$11,A5+1,B5+1)","v":"M11"},{"$f":"INDEX(BOARD_GRID!$B$14:$H$20,A5+1,B5+1)","v":180},{"$f":"IF(D5=\"\",\"\",INDEX(TILES!$C:$C,MATCH(D5,TILES!$A:$A,0)))","v":"NO"},{"$f":"IF(D5=\"\",\"\",INDEX(TILES!$B:$B,MATCH(D5,TILES!$A:$A,0)))","v":"T_JUNCTION"},{"$f":"IF(D5=\"\",\"\",INDEX(TILES!$D:$D,MATCH(D5,TILES!$A:$A,0)))","v":"DRAGON"},{"$f":"IF(D5=\"\",\"\",INDEX(TILES!$E:$E,MATCH(D5,TILES!$A:$A,0)))","v":1},{"$f":"IF(D5=\"\",\"\",INDEX(TILES!$F:$F,MATCH(D5,TILES!$A:$A,0)))","v":1},{"$f":"IF(D5=\"\",\"\",INDEX(TILES!$G:$G,MATCH(D5,TILES!$A:$A,0)))","v":0},{"$f":"IF(D5=\"\",\"\",INDEX(TILES!$H:$H,MATCH(D5,TILES!$A:$A,0)))","v":1},{"$f":"IF(D5=\"\",\"\",IFERROR(CHOOSE(MATCH(MOD(E5,360),{0,90,180,270},0),I5,L5,K5,J5),\"\"))","v":0},{"$f":"IF(D5=\"\",\"\",IFERROR(CHOOSE(MATCH(MOD(E5,360),{0,90,180,270},0),J5,I5,L5,K5),\"\"))","v":1},{"$f":"IF(D5=\"\",\"\",IFERROR(CHOOSE(MATCH(MOD(E5,360),{0,90,180,270},0),K5,J5,I5,L5),\"\"))","v":1},{"$f":"IF(D5=\"\",\"\",IFERROR(CHOOSE(MATCH(MOD(E5,360),{0,90,180,270},0),L5,K5,J5,I5),\"\"))","v":1}]
[0,4,"R0C4",{"$f":"INDEX(BOARD_GRID!$B$5:$H$11,A6+1,B6+1)","v":"F06"},{"$f":"INDEX(BOARD_GRID!$B$14:$H$20,A6+1,B6+1)","v":180},{"$f":"IF(D6=\"\",\"\",INDEX(TILES!$C:$C,MATCH(D6,TILES!$A:$A,0)))","v":"YES"},{"$f":"IF(D6=\"\",\"\",INDEX(TILES!$B:$B,MATCH(D6,TILES!$A:$A,0)))","v":"T_JUNCTION"},{"$f":"IF(D6=\"\",\"\",INDEX(TILES!$D:$D,MATCH(D6,TILES!$A:$A,0)))","v":"MONEYBAG"},{"$f":"IF(D6=\"\",\"\",INDEX(TILES!$E:$E,MATCH(D6,TILES!$A:$A,0)))","v":1},{"$f":"IF(D6=\"\",\"\",INDEX(TILES!$F:$F,MATCH(D6,TILES!$A:$A,0)))","v":1},{"$f":"IF(D6=\"\",\"\",INDEX(TILES!$G:$G,MATCH(D6,TILES!$A:$A,0)))","v":0},{"$f":"IF(D6=\"\",\"\",INDEX(TILES!$H:$H,MATCH(D6,TILES!$A:$A,0)))","v":1},{"$f":"IF(D6=\"\",\"\",IFERROR(CHOOSE(MATCH(MOD(E6,360),{0,90,180,270},0),I6,L6,K6,J6),\"\"))","v":0},{"$f":"IF(D6=\"\",\"\",IFERROR(CHOOSE(MATCH(MOD(E6,360),{0,90,180,270},0),J6,I6,L6,K6),\"\"))","v":1},{"$f":"IF(D6=\"\",\"\",IFERROR(CHOOSE(MATCH(MOD(E6,360),{0,90,180,270},0),K6,J6,I6,L6),\"\"))","v":1},{"$f":"IF(D6=\"\",\"\",IFERROR(CHOOSE(MATCH(MOD(E6,360),{0,90,180,270},0),L6,K6,J6,I6),\"\"))","v":1}]
[0,5,"R0C5",{"$f":"INDEX(BOARD_GRID!$B$5:$H$11,A7+1,B7+1)","v":"M21"},{"$f":"INDEX(BOARD_GRID!$B$14:$H$20,A7+1,B7+1)","v":270},{"$f":"IF(D7=\"\",\"\",INDEX(TILES!$C:$C,MATCH(D7,TILES!$A:$A,0)))","v":"NO"},{"$f":"IF(D7=\"\",\"\",INDEX(TILES!$B:$B,MATCH(D7,TILES!$A:$A,0)))","v":"CORNER"},{"$f":"IF(D7=\"\",\"\",INDEX(TILES!$D:$D,MATCH(D7,TILES!$A:$A,0)))","v":0},{"$f":"IF(D7=\"\",\"\",INDEX(TILES!$E:$E,MATCH(D7,TILES!$A:$A,0)))","v":1},{"$f":"IF(D7=\"\",\"\",INDEX(TILES!$F:$F,MATCH(D7,TILES!$A:$A,0)))","v":1},{"$f":"IF(D7=\"\",\"\",INDEX(TILES!$G:$G,MATCH(D7,TILES!$A:$A,0)))","v":0},{"$f":"IF(D7=\"\",\"\",INDEX(TILES!$H:$H,MATCH(D7,TILES!$A:$A,0)))","v":0},{"$f":"IF(D7=\"\",\"\",IFERROR(CHOOSE(MATCH(MOD(E7,360),{0,90,180,270},0),I7,L7,K7,J7),\"\"))","v":1},{"$f":"IF(D7=\"\",\"\",IFERROR(CHOOSE(MATCH(MOD(E7,360),{0,90,180,270},0),J7,I7,L7,K7),\"\"))","v":0},{"$f":"IF(D7=\"\",\"\",IFERROR(CHOOSE(MATCH(MOD(E7,360),{0,90,180,270},0),K7,J7,I7,L7),\"\"))","v":0},{"$f":"IF(D7=\"\",\"\",IFERROR(CHOOSE(MATCH(MOD(E7,360),{0,90,180,270},0),L7,K7,J7,I7),\"\"))","v":1}]
[0,6,"R0C6",{"$f":"INDEX(BOARD_GRID!$B$5:$H$11,A8+1,B8+1)","v":"F02"},{"$f":"INDEX(BOARD_GRID!$B$14:$H$20,A8+1,B8+1)","v":180},{"$f":"IF(D8=\"\",\"\",INDEX(TILES!$C:$C,MATCH(D8,TILES!$A:$A,0)))","v":"YES"},{"$f":"IF(D8=\"\",\"\",INDEX(TILES!$B:$B,MATCH(D8,TILES!$A:$A,0)))","v":"CORNER"},{"$f":"IF(D8=\"\",\"\",INDEX(TILES!$D:$D,MATCH(D8,TILES!$A:$A,0)))","v":0},{"$f":"IF(D8=\"\",\"\",INDEX(TILES!$E:$E,MATCH(D8,TILES!$A:$A,0)))","v":1},{"$f":"IF(D8=\"\",\"\",INDEX(TILES!$F:$F,MATCH(D8,TILES!$A:$A,0)))","v":1},{"$f":"IF(D8=\"\",\"\",INDEX(TILES!$G:$G,MATCH(D8,TILES!$A:$A,0)))","v":0},{"$f":"IF(D8=\"\",\"\",INDEX(TILES!$H:$H,MATCH(D8,TILES!$A:$A,0)))","v":0},{"$f":"IF(D8=\"\",\"\",IFERROR(CHOOSE(MATCH(MOD(E8,360),{0,90,180,270},0),I8,L8,K8,J8),\"\"))","v":0},{"$f":"IF(D8=\"\",\"\",IFERROR(CHOOSE(MATCH(MOD(E8,360),{0,90,180,270},0),J8,I8,L8,K8),\"\"))","v":0},{"$f":"IF(D8=\"\",\"\",IFERROR(CHOOSE(MATCH(MOD(E8,360),{0,90,180,270},0),K8,J8,I8,L8),\"\"))","v":1},{"$f":"IF(D8=\"\",\"\",IFERROR(CHOOSE(MATCH(MOD(E8,360),{0,90,180,270},0),L8,K8,J8,I8),\"\"))","v":1}]
[1,0,"R1C0",{"$f":"INDEX(BOARD_GRID!$B$5:$H$11,A9+1,B9+1)","v":"M30"},{"$f":"INDEX(BOARD_GRID!$B$14:$H$20,A9+1,B9+1)","v":90},{"$f":"IF(D9=\"\",\"\",INDEX(TILES!$C:$C,MATCH(D9,TILES!$A:$A,0)))","v":"NO"},{"$f":"IF(D9=\"\",\"\",INDEX(TILES!$B:$B,MATCH(D9,TILES!$A:$A,0)))","v":"STRAIGHT"},{"$f":"IF(D9=\"\",\"\",INDEX(TILES!$D:$D,MATCH(D9,TILES!$A:$A,0)))","v":0},{"$f":"IF(D9=\"\",\"\",INDEX(TILES!$E:$E,MATCH(D9,TILES!$A:$A,0)))","v":1},{"$f":"IF(D9=\"\",\"\",INDEX(TILES!$F:$F,MATCH(D9,TILES!$A:$A,0)))","v":0},{"$f":"IF(D9=\"\",\"\",INDEX(TILES!$G:$G,MATCH(D9,TILES!$A:$A,0)))","v":1},{"$f":"IF(D9=\"\",\"\",INDEX(TILES!$H:$H,MATCH(D9,TILES!$A:$A,0)))","v":0},{"$f":"IF(D9=\"\",\"\",IFERROR(CHOOSE(MATCH(MOD(E9,360),{0,90,180,270},0),I9,L9,K9,J9),\"\"))","v":0},{"$f":"IF(D9=\"\",\"\",IFERROR(CHOOSE(MATCH(MOD(E9,360),{0,90,180,270},0),J9,I9,L9,K9),\"\"))","v":1},{"$f":"IF(D9=\"\",\"\",IFERROR(CHOOSE(MATCH(MOD(E9,360),{0,90,180,270},0),K9,J9,I9,L9),\"\"))","v":0},{"$f":"IF(D9=\"\",\"\",IFERROR(CHOOSE(MATCH(MOD(E9,360),{0,90,180,270},0),L9,K9,J9,I9),\"\"))","v":1}]
[1,1,"R1C1",{"$f":"INDEX(BOARD_GRID!$B$5:$H$11,A10+1,B10+1)","v":"M01"},{"$f":"INDEX(BOARD_GRID!$B$14:$H$20,A10+1,B10+1)","v":270},{"$f":"IF(D10=\"\",\"\",INDEX(TILES!$C:$C,MATCH(D10,TILES!$A:$A,0)))","v":"NO"},{"$f":"IF(D10=\"\",\"\",INDEX(TILES!$B:$B,MATCH(D10,TILES!$A:$A,0)))","v":"T_JUNCTION"},{"$f":"IF(D10=\"\",\"\",INDEX(TILES!$D:$D,MATCH(D10,TILES!$A:$A,0)))","v":"UNICORN"},{"$f":"IF(D10=\"\",\"\",INDEX(TILES!$E:$E,MATCH(D10,TILES!$A:$A,0)))","v":1},{"$f":"IF(D10=\"\",\"\",INDEX(TILES!$F:$F,MATCH(D10,TILES!$A:$A,0)))","v":1},{"$f":"IF(D10=\"\",\"\",INDEX(TILES!$G:$G,MATCH(D10,TILES!$A:$A,0)))","v":0},{"$f":"IF(D10=\"\",\"\",INDEX(TILES!$H:$H,MATCH(D10,TILES!$A:$A,0)))","v":1},{"$f":"IF(D10=\"\",\"\",IFERROR(CHOOSE(MATCH(MOD(E10,360),{0,90,180,270},0),I10,L10,K10,J10),\"\"))","v":1},{"$f":"IF(D10=\"\",\"\",IFERROR(CHOOSE(MATCH(MOD(E10,360),{0,90,180,270},0),J10,I10,L10,K10),\"\"))","v":0},{"$f":"IF(D10=\"\",\"\",IFERROR(CHOOSE(MATCH(MOD(E10,360),{0,90,180,270},0),K10,J10,I10,L10),\"\"))","v":1},{"$f":"IF(D10=\"\",\"\",IFERROR(CHOOSE(MATCH(MOD(E10,360),{0,90,180,270},0),L10,K10,J10,I10),\"\"))","v":1}]
[1,2,"R1C2",{"$f":"INDEX(BOARD_GRID!$B$5:$H$11,A11+1,B11+1)","v":"M10"},{"$f":"INDEX(BOARD_GRID!$B$14:$H$20,A11+1,B11+1)","v":180},{"$f":"IF(D11=\"\",\"\",INDEX(TILES!$C:$C,MATCH(D11,TILES!$A:$A,0)))","v":"NO"},{"$f":"IF(D11=\"\",\"\",INDEX(TILES!$B:$B,MATCH(D11,TILES!$A:$A,0)))","v":"CORNER"},{"$f":"IF(D11=\"\",\"\",INDEX(TILES!$D:$D,MATCH(D11,TILES!$A:$A,0)))","v":"SPIDER"},{"$f":"IF(D11=\"\",\"\",INDEX(TILES!$E:$E,MATCH(D11,TILES!$A:$A,0)))","v":1},{"$f":"IF(D11=\"\",\"\",INDEX(TILES!$F:$F,MATCH(D11,TILES!$A:$A,0)))","v":1},{"$f":"IF(D11=\"\",\"\",INDEX(TILES!$G:$G,MATCH(D11,TILES!$A:$A,0)))","v":0},{"$f":"IF(D11=\"\",\"\",INDEX(TILES!$H:$H,MATCH(D11,TILES!$A:$A,0)))","v":0},{"$f":"IF(D11=\"\",\"\",IFERROR(CHOOSE(MATCH(MOD(E11,360),{0,90,180,270},0),I11,L11,K11,J11),\"\"))","v":0},{"$f":"IF(D11=\"\",\"\",IFERROR(CHOOSE(MATCH(MOD(E11,360),{0,90,180,270},0),J11,I11,L11,K11),\"\"))","v":0},{"$f":"IF(D11=\"\",\"\",IFERROR(CHOOSE(MATCH(MOD(E11,360),{0,90,180,270},0),K11,J11,I11,L11),\"\"))","v":1},{"$f":"IF(D11=\"\",\"\",IFERROR(CHOOSE(MATCH(MOD(E11,360),{0,90,180,270},0),L11,K11,J11,I11),\"\"))","v":1}]
[1,3,"R1C3",{"$f":"INDEX(BOARD_GRID!$B$5:$H$11,A12+1,B12+1)","v":"M23"},{"$f":"INDEX(BOARD_GRID!$B$14:$H$20,A12+1,B12+1)","v":90},{"$f":"IF(D12=\"\",\"\",INDEX(TILES!$C:$C,MATCH(D12,TILES!$A:$A,0)))","v":"NO"},{"$f":"IF(D12=\"\",\"\",INDEX(TILES!$B:$B,MATCH(D12,TILES!$A:$A,0)))","v":"STRAIGHT"},{"$f":"IF(D12=\"\",\"\",INDEX(TILES!$D:$D,MATCH(D12,TILES!$A:$A,0)))","v":0},{"$f":"IF(D12=\"\",\"\",INDEX(TILES!$E:$E,MATCH(D12,TILES!$A:$A,0)))","v":1},{"$f":"IF(D12=\"\",\"\",INDEX(TILES!$F:$F,MATCH(D12,TILES!$A:$A,0)))","v":0},{"$f":"IF(D12=\"\",\"\",INDEX(TILES!$G:$G,MATCH(D12,TILES!$A:$A,0)))","v":1},{"$f":"IF(D12=\"\",\"\",INDEX(TILES!$H:$H,MATCH(D12,TILES!$A:$A,0)))","v":0},{"$f":"IF(D12=\"\",\"\",IFERROR(CHOOSE(MATCH(MOD(E12,360),{0,90,180,270},0),I12,L12,K12,J12),\"\"))","v":0},{"$f":"IF(D12=\"\",\"\",IFERROR(CHOOSE(MATCH(MOD(E12,360),{0,90,180,270},0),J12,I12,L12,K12),\"\"))","v":1},{"$f":"IF(D12=\"\",\"\",IFERROR(CHOOSE(MATCH(MOD(E12,360),{0,90,180,270},0),K12,J12,I12,L12),\"\"))","v":0},{"$f":"IF(D12=\"\",\"\",IFERROR(CHOOSE(MATCH(MOD(E12,360),{0,90,180,270},0),L12,K12,J12,I12),\"\"))","v":1}]
[1,4,"R1C4",{"$f":"INDEX(BOARD_GRID!$B$5:$H$11,A13+1,B13+1)","v":"M27"},{"$f":"INDEX(BOARD_GRID!$B$14:$H$20,A13+1,B13+1)","v":180},{"$f":"IF(D13=\"\",\"\",INDEX(TILES!$C:$C,MATCH(D13,TILES!$A:$A,0)))","v":"NO"},{"$f":"IF(D13=\"\",\"\",INDEX(TILES!$B:$B,MATCH(D13,TILES!$A:$A,0)))","v":"STRAIGHT"},{"$f":"IF(D13=\"\",\"\",INDEX(TILES!$D:$D,MATCH(D13,TILES!$A:$A,0)))","v":0},{"$f":"IF(D13=\"\",\"\",INDEX(TILES!$E:$E,MATCH(D13,TILES!$A:$A,0)))","v":1},{"$f":"IF(D13=\"\",\"\",INDEX(TILES!$F:$F,MATCH(D13,TILES!$A:$A,0)))","v":0},{"$f":"IF(D13=\"\",\"\",INDEX(TILES!$G:$G,MATCH(D13,TILES!$A:$A,0)))","v":1},{"$f":"IF(D13=\"\",\"\",INDEX(TILES!$H:$H,MATCH(D13,TILES!$A:$A,0)))","v":0},{"$f":"IF(D13=\"\",\"\",IFERROR(CHOOSE(MATCH(MOD(E13,360),{0,90,180,270},0),I13,L13,K13,J13),\"\"))","v":1},{"$f":"IF(D13=\"\",\"\",IFERROR(CHOOSE(MATCH(MOD(E13,360),{0,90,180,270},0),J13,I13,L13,K13),\"\"))","v":0},{"$f":"IF(D13=\"\",\"\",IFERROR(CHOOSE(MATCH(MOD(E13,360),{0,90,180,270},0),K13,J13,I13,L13),\"\"))","v":1},{"$f":"IF(D13=\"\",\"\",IFERROR(CHOOSE(MATCH(MOD(E13,360),{0,90,180,270},0),L13,K13,J13,I13),\"\"))","v":0}]
[1,5,"R1C5",{"$f":"INDEX(BOARD_GRID!$B$5:$H$11,A14+1,B14+1)","v":"M24"},{"$f":"INDEX(BOARD_GRID!$B$14:$H$20,A14+1,B14+1)","v":180},{"$f":"IF(D14=\"\",\"\",INDEX(TILES!$C:$C,MATCH(D14,TILES!$A:$A,0)))","v":"NO"},{"$f":"IF(D14=\"\",\"\",INDEX(TILES!$B:$B,MATCH(D14,TILES!$A:$A,0)))","v":"STRAIGHT"},{"$f":"IF(D14=\"\",\"\",INDEX(TILES!$D:$D,MATCH(D14,TILES!$A:$A,0)))","v":0},{"$f":"IF(D14=\"\",\"\",INDEX(TILES!$E:$E,MATCH(D14,TILES!$A:$A,0)))","v":1},{"$f":"IF(D14=\"\",\"\",INDEX(TILES!$F:$F,MATCH(D14,TILES!$A:$A,0)))","v":0},{"$f":"IF(D14=\"\",\"\",INDEX(TILES!$G:$G,MATCH(D14,TILES!$A:$A,0)))","v":1},{"$f":"IF(D14=\"\",\"\",INDEX(TILES!$H:$H,MATCH(D14,TILES!$A:$A,0)))","v":0},{"$f":"IF(D14=\"\",\"\",IFERROR(CHOOSE(MATCH(MOD(E14,360),{0,90,180,270},0),I14,L14,K14,J14),\"\"))","v":1},{"$f":"IF(D14=\"\",\"\",IFERROR(CHOOSE(MATCH(MOD(E14,360),{0,90,180,270},0),J14,I14,L14,K14),\"\"))","v":0},{"$f":"IF(D14=\"\",\"\",IFERROR(CHOOSE(MATCH(MOD(E14,360),{0,90,180,270},0),K14,J14,I14,L14),\"\"))","v":1},{"$f":"IF(D14=\"\",\"\",IFERROR(CHOOSE(MATCH(MOD(E14,360),{0,90,180,270},0),L14,K14,J14,I14),\"\"))","v":0}]
[1,6,"R1C6",{"$f":"INDEX(BOARD_GRID!$B$5:$H$11,A15+1,B15+1)","v":"M04"},{"$f":"INDEX(BOARD_GRID!$B$14:$H$20,A15+1,B15+1)","v":270},{"$f":"IF(D15=\"\",\"\",INDEX(TILES!$C:$C,MATCH(D15,TILES!$A:$A,0)))","v":"NO"},{"$f":"IF(D15=\"\",\"\",INDEX(TILES!$B:$B,MATCH(D15,TILES!$A:$A,0)))","v":"T_JUNCTION"},{"$f":"IF(D15=\"\",\"\",INDEX(TILES!$D:$D,MATCH(D15,TILES!$A:$A,0)))","v":"GENIE"},{"$f":"IF(D15=\"\",\"\",INDEX(TILES!$E:$E,MATCH(D15,TILES!$A:$A,0)))","v":1},{"$f":"IF(D15=\"\",\"\",INDEX(TILES!$F:$F,MATCH(D15,TILES!$A:$A,0)))","v":1},{"$f":"IF(D15=\"\",\"\",INDEX(TILES!$G:$G,MATCH(D15,TILES!$A:$A,0)))","v":0},{"$f":"IF(D15=\"\",\"\",INDEX(TILES!$H:$H,MATCH(D15,TILES!$A:$A,0)))","v":1},{"$f":"IF(D15=\"\",\"\",IFERROR(CHOOSE(MATCH(MOD(E15,360),{0,90,180,270},0),I15,L15,K15,J15),\"\"))","v":1},{"$f":"IF(D15=\"\",\"\",IFERROR(CHOOSE(MATCH(MOD(E15,360),{0,90,180,270},0),J15,I15,L15,K15),\"\"))","v":0},{"$f":"IF(D15=\"\",\"\",IFERROR(CHOOSE(MATCH(MOD(E15,360),{0,90,180,270},0),K15,J15,I15,L15),\"\"))","v":1},{"$f":"IF(D15=\"\",\"\",IFERROR(CHOOSE(MATCH(MOD(E15,360),{0,90,180,270},0),L15,K15,J15,I15),\"\"))","v":1}]
[2,0,"R2C0",{"$f":"INDEX(BOARD_GRID!$B$5:$H$11,A16+1,B16+1)","v":"F07"},{"$f":"INDEX(BOARD_GRID!$B$14:$H$20,A16+1,B16+1)","v":90},{"$f":"IF(D16=\"\",\"\",INDEX(TILES!$C:$C,MATCH(D16,TILES!$A:$A,0)))","v":"YES"},{"$f":"IF(D16=\"\",\"\",INDEX(TILES!$B:$B,MATCH(D16,TILES!$A:$A,0)))","v":"T_JUNCTION"},{"$f":"IF(D16=\"\",\"\",INDEX(TILES!$D:$D,MATCH(D16,TILES!$A:$A,0)))","v":"POSION"},{"$f":"IF(D16=\"\",\"\",INDEX(TILES!$E:$E,MATCH(D16,TILES!$A:$A,0)))","v":1},{"$f":"IF(D16=\"\",\"\",INDEX(TILES!$F:$F,MATCH(D16,TILES!$A:$A,0)))","v":1},{"$f":"IF(D16=\"\",\"\",INDEX(TILES!$G:$G,MATCH(D16,TILES!$A:$A,0)))","v":0},{"$f":"IF(D16=\"\",\"\",INDEX(TILES!$H:$H,MATCH(D16,TILES!$A:$A,0)))","v":1},{"$f":"IF(D16=\"\",\"\",IFERROR(CHOOSE(MATCH(MOD(E16,360),{0,90,180,270},0),I16,L16,K16,J16),\"\"))","v":1},{"$f":"IF(D16=\"\",\"\",IFERROR(CHOOSE(MATCH(MOD(E16,360),{0,90,180,270},0),J16,I16,L16,K16),\"\"))","v":1},{"$f":"IF(D16=\"\",\"\",IFERROR(CHOOSE(MATCH(MOD(E16,360),{0,90,180,270},0),K16,J16,I16,L16),\"\"))","v":1},{"$f":"IF(D16=\"\",\"\",IFERROR(CHOOSE(MATCH(MOD(E16,360),{0,90,180,270},0),L16,K16,J16,I16),\"\"))","v":0}]
[2,1,"R2C1",{"$f":"INDEX(BOARD_GRID!$B$5:$H$11,A17+1,B17+1)","v":"M31"},{"$f":"INDEX(BOARD_GRID!$B$14:$H$20,A17+1,B17+1)","v":270},{"$f":"IF(D17=\"\",\"\",INDEX(TILES!$C:$C,MATCH(D17,TILES!$A:$A,0)))","v":"NO"},{"$f":"IF(D17=\"\",\"\",INDEX(TILES!$B:$B,MATCH(D17,TILES!$A:$A,0)))","v":"STRAIGHT"},{"$f":"IF(D17=\"\",\"\",INDEX(TILES!$D:$D,MATCH(D17,TILES!$A:$A,0)))","v":0},{"$f":"IF(D17=\"\",\"\",INDEX(TILES!$E:$E,MATCH(D17,TILES!$A:$A,0)))","v":1},{"$f":"IF(D17=\"\",\"\",INDEX(TILES!$F:$F,MATCH(D17,TILES!$A:$A,0)))","v":0},{"$f":"IF(D17=\"\",\"\",INDEX(TILES!$G:$G,MATCH(D17,TILES!$A:$A,0)))","v":1},{"$f":"IF(D17=\"\",\"\",INDEX(TILES!$H:$H,MATCH(D17,TILES!$A:$A,0)))","v":0},{"$f":"IF(D17=\"\",\"\",IFERROR(CHOOSE(MATCH(MOD(E17,360),{0,90,180,270},0),I17,L17,K17,J17),\"\"))","v":0},{"$f":"IF(D17=\"\",\"\",IFERROR(CHOOSE(MATCH(MOD(E17,360),{0,90,180,270},0),J17,I17,L17,K17),\"\"))","v":1},{"$f":"IF(D17=\"\",\"\",IFERROR(CHOOSE(MATCH(MOD(E17,360),{0,90,180,270},0),K17,J17,I17,L17),\"\"))","v":0},{"$f":"IF(D17=\"\",\"\",IFERROR(CHOOSE(MATCH(MOD(E17,360),{0,90,180,270},0),L17,K17,J17,I17),\"\"))","v":1}]
[2,2,"R2C2",{"$f":"INDEX(BOARD_GRID!$B$5:$H$11,A18+1,B18+1)","v":"F08"},{"$f":"INDEX(BOARD_GRID!$B$14:$H$20,A18+1,B18+1)","v":90},{"$f":"IF(D18=\"\",\"\",INDEX(TILES!$C:$C,MATCH(D18,TILES!$A:$A,0)))","v":"YES"},{"$f":"IF(D18=\"\",\"\",INDEX(TILES!$B:$B,MATCH(D18,TILES!$A:$A,0)))","v":"T_JUNCTION"},{"$f":"IF(D18=\"\",\"\",INDEX(TILES!$D:$D,MATCH(D18,TILES!$A:$A,0)))","v":"CROWN"},{"$f":"IF(D18=\"\",\"\",INDEX(TILES!$E:$E,MATCH(D18,TILES!$A:$A,0)))","v":1},{"$f":"IF(D18=\"\",\"\",INDEX(TILES!$F:$F,MATCH(D18,TILES!$A:$A,0)))","v":1},{"$f":"IF(D18=\"\",\"\",INDEX(TILES!$G:$G,MATCH(D18,TILES!$A:$A,0)))","v":0},{"$f":"IF(D18=\"\",\"\",INDEX(TILES!$H:$H,MATCH(D18,TILES!$A:$A,0)))","v":1},{"$f":"IF(D18=\"\",\"\",IFERROR(CHOOSE(MATCH(MOD(E18,360),{0,90,180,270},0),I18,L18,K18,J18),\"\"))","v":1},{"$f":"IF(D18=\"\",\"\",IFERROR(CHOOSE(MATCH(MOD(E18,360),{0,90,180,270},0),J18,I18,L18,K18),\"\"))","v":1},{"$f":"IF(D18=\"\",\"\",IFERROR(CHOOSE(MATCH(MOD(E18,360),{0,90,180,270},0),K18,J18,I18,L18),\"\"))","v":1},{"$f":"IF(D18=\"\",\"\",IFERROR(CHOOSE(MATCH(MOD(E18,360),{0,90,180,270},0),L18,K18,J18,I18),\"\"))","v":0}]
[2,3,"R2C3",{"$f":"INDEX(BOARD_GRID!$B$5:$H$11,A19+1,B19+1)","v":"M32"},{"$f":"INDEX(BOARD_GRID!$B$14:$H$20,A19+1,B19+1)","v":90},{"$f":"IF(D19=\"\",\"\",INDEX(TILES!$C:$C,MATCH(D19,TILES!$A:$A,0)))","v":"NO"},{"$f":"IF(D19=\"\",\"\",INDEX(TILES!$B:$B,MATCH(D19,TILES!$A:$A,0)))","v":"STRAIGHT"},{"$f":"IF(D19=\"\",\"\",INDEX(TILES!$D:$D,MATCH(D19,TILES!$A:$A,0)))","v":0},{"$f":"IF(D19=\"\",\"\",INDEX(TILES!$E:$E,MATCH(D19,TILES!$A:$A,0)))","v":1},{"$f":"IF(D19=\"\",\"\",INDEX(TILES!$F:$F,MATCH(D19,TILES!$A:$A,0)))","v":0},{"$f":"IF(D19=\"\",\"\",INDEX(TILES!$G:$G,MATCH(D19,TILES!$A:$A,0)))","v":1},{"$f":"IF(D19=\"\",\"\",INDEX(TILES!$H:$H,MATCH(D19,TILES!$A:$A,0)))","v":0},{"$f":"IF(D19=\"\",\"\",IFERROR(CHOOSE(MATCH(MOD(E19,360),{0,90,180,270},0),I19,L19,K19,J19),\"\"))","v":0},{"$f":"IF(D19=\"\",\"\",IFERROR(CHOOSE(MATCH(MOD(E19,360),{0,90,180,270},0),J19,I19,L19,K19),\"\"))","v":1},{"$f":"IF(D19=\"\",\"\",IFERROR(CHOOSE(MATCH(MOD(E19,360),{0,90,180,270},0),K19,J19,I19,L19),\"\"))","v":0},{"$f":"IF(D19=\"\",\"\",IFERROR(CHOOSE(MATCH(MOD(E19,360),{0,90,180,270},0),L19,K19,J19,I19),\"\"))","v":1}]
[2,4,"R2C4",{"$f":"INDEX(BOARD_GRID!$B$5:$H$11,A20+1,B20+1)","v":"F09"},{"$f":"INDEX(BOARD_GRID!$B$14:$H$20,A20+1,B20+1)","v":180},{"$f":"IF(D20=\"\",\"\",INDEX(TILES!$C:$C,MATCH(D20,TILES!$A:$A,0)))","v":"YES"},{"$f":"IF(D20=\"\",\"\",INDEX(TILES!$B:$B,MATCH(D20,TILES!$A:$A,0)))","v":"T_JUNCTION"},{"$f":"IF(D20=\"\",\"\",INDEX(TILES!$D:$D,MATCH(D20,TILES!$A:$A,0)))","v":"KEY"},{"$f":"IF(D20=\"\",\"\",INDEX(TILES!$E:$E,MATCH(D20,TILES!$A:$A,0)))","v":1},{"$f":"IF(D20=\"\",\"\",INDEX(TILES!$F:$F,MATCH(D20,TILES!$A:$A,0)))","v":1},{"$f":"IF(D20=\"\",\"\",INDEX(TILES!$G:$G,MATCH(D20,TILES!$A:$A,0)))","v":0},{"$f":"IF(D20=\"\",\"\",INDEX(TILES!$H:$H,MATCH(D20,TILES!$A:$A,0)))","v":1},{"$f":"IF(D20=\"\",\"\",IFERROR(CHOOSE(MATCH(MOD(E20,360),{0,90,180,270},0),I20,L20,K20,J20),\"\"))","v":0},{"$f":"IF(D20=\"\",\"\",IFERROR(CHOOSE(MATCH(MOD(E20,360),{0,90,180,270},0),J20,I20,L20,K20),\"\"))","v":1},{"$f":"IF(D20=\"\",\"\",IFERROR(CHOOSE(MATCH(MOD(E20,360),{0,90,180,270},0),K20,J20,I20,L20),\"\"))","v":1},{"$f":"IF(D20=\"\",\"\",IFERROR(CHOOSE(MATCH(MOD(E20,360),{0,90,180,270},0),L20,K20,J20,I20),\"\"))","v":1}]
[2,5,"R2C5",{"$f":"INDEX(BOARD_GRID!$B$5:$H$11,A21+1,B21+1)","v":"M13"},{"$f":"INDEX(BOARD_GRID!$B$14:$H$20,A21+1,B21+1)","v":0},{"$f":"IF(D21=\"\",\"\",INDEX(TILES!$C:$C,MATCH(D21,TILES!$A:$A,0)))","v":"NO"},{"$f":"IF(D21=\"\",\"\",INDEX(TILES!$B:$B,MATCH(D21,TILES!$A:$A,0)))","v":"CORNER"},{"$f":"IF(D21=\"\",\"\",INDEX(TILES!$D:$D,MATCH(D21,TILES!$A:$A,0)))","v":0},{"$f":"IF(D21=\"\",\"\",INDEX(TILES!$E:$E,MATCH(D21,TILES!$A:$A,0)))","v":1},{"$f":"IF(D21=\"\",\"\",INDEX(TILES!$F:$F,MATCH(D21,TILES!$A:$A,0)))","v":1},{"$f":"IF(D21=\"\",\"\",INDEX(TILES!$G:$G,MATCH(D21,TILES!$A:$A,0)))","v":0},{"$f":"IF(D21=\"\",\"\",INDEX(TILES!$H:$H,MATCH(D21,TILES!$A:$A,0)))","v":0},{"$f":"IF(D21=\"\",\"\",IFERROR(CHOOSE(MATCH(MOD(E21,360),{0,90,180,270},0),I21,L21,K21,J21),\"\"))","v":1},{"$f":"IF(D21=\"\",\"\",IFERROR(CHOOSE(MATCH(MOD(E21,360),{0,90,180,270},0),J21,I21,L21,K21),\"\"))","v":1},{"$f":"IF(D21=\"\",\"\",IFERROR(CHOOSE(MATCH(MOD(E21,360),{0,90,180,270},0),K21,J21,I21,L21),\"\"))","v":0},{"$f":"IF(D21=\"\",\"\",IFERROR(CHOOSE(MATCH(MOD(E21,360),{0,90,180,270},0),L21,K21,J21,I21),\"\"))","v":0}]
[2,6,"R2C6",{"$f":"INDEX(BOARD_GRID!$B$5:$H$11,A22+1,B22+1)","v":"F10"},{"$f":"INDEX(BOARD_GRID!$B$14:$H$20,A22+1,B22+1)","v":270},{"$f":"IF(D22=\"\",\"\",INDEX(TILES!$C:$C,MATCH(D22,TILES!$A:$A,0)))","v":"YES"},{"$f":"IF(D22=\"\",\"\",INDEX(TILES!$B:$B,MATCH(D22,TILES!$A:$A,0)))","v":"T_JUNCTION"},{"$f":"IF(D22=\"\",\"\",INDEX(TILES!$D:$D,MATCH(D22,TILES!$A:$A,0)))","v":"GOBLET"},{"$f":"IF(D22=\"\",\"\",INDEX(TILES!$E:$E,MATCH(D22,TILES!$A:$A,0)))","v":1},{"$f":"IF(D22=\"\",\"\",INDEX(TILES!$F:$F,MATCH(D22,TILES!$A:$A,0)))","v":1},{"$f":"IF(D22=\"\",\"\",INDEX(TILES!$G:$G,MATCH(D22,TILES!$A:$A,0)))","v":0},{"$f":"IF(D22=\"\",\"\",INDEX(TILES!$H:$H,MATCH(D22,TILES!$A:$A,0)))","v":1},{"$f":"IF(D22=\"\",\"\",IFERROR(CHOOSE(MATCH(MOD(E22,360),{0,90,180,270},0),I22,L22,K22,J22),\"\"))","v":1},{"$f":"IF(D22=\"\",\"\",IFERROR(CHOOSE(MATCH(MOD(E22,360),{0,90,180,270},0),J22,I22,L22,K22),\"\"))","v":0},{"$f":"IF(D22=\"\",\"\",IFERROR(CHOOSE(MATCH(MOD(E22,360),{0,90,180,270},0),K22,J22,I22,L22),\"\"))","v":1},{"$f":"IF(D22=\"\",\"\",IFERROR(CHOOSE(MATCH(MOD(E22,360),{0,90,180,270},0),L22,K22,J22,I22),\"\"))","v":1}]
[3,0,"R3C0",{"$f":"INDEX(BOARD_GRID!$B$5:$H$11,A23+1,B23+1)","v":"M19"},{"$f":"INDEX(BOARD_GRID!$B$14:$H$20,A23+1,B23+1)","v":0},{"$f":"IF(D23=\"\",\"\",INDEX(TILES!$C:$C,MATCH(D23,TILES!$A:$A,0)))","v":"NO"},{"$f":"IF(D23=\"\",\"\",INDEX(TILES!$B:$B,MATCH(D23,TILES!$A:$A,0)))","v":"CORNER"},{"$f":"IF(D23=\"\",\"\",INDEX(TILES!$D:$D,MATCH(D23,TILES!$A:$A,0)))","v":0},{"$f":"IF(D23=\"\",\"\",INDEX(TILES!$E:$E,MATCH(D23,TILES!$A:$A,0)))","v":1},{"$f":"IF(D23=\"\",\"\",INDEX(TILES!$F:$F,MATCH(D23,TILES!$A:$A,0)))","v":1},{"$f":"IF(D23=\"\",\"\",INDEX(TILES!$G:$G,MATCH(D23,TILES!$A:$A,0)))","v":0},{"$f":"IF(D23=\"\",\"\",INDEX(TILES!$H:$H,MATCH(D23,TILES!$A:$A,0)))","v":0},{"$f":"IF(D23=\"\",\"\",IFERROR(CHOOSE(MATCH(MOD(E23,360),{0,90,180,270},0),I23,L23,K23,J23),\"\"))","v":1},{"$f":"IF(D23=\"\",\"\",IFERROR(CHOOSE(MATCH(MOD(E23,360),{0,90,180,270},0),J23,I23,L23,K23),\"\"))","v":1},{"$f":"IF(D23=\"\",\"\",IFERROR(CHOOSE(MATCH(MOD(E23,360),{0,90,180,270},0),K23,J23,I23,L23),\"\"))","v":0},{"$f":"IF(D23=\"\",\"\",IFERROR(CHOOSE(MATCH(MOD(E23,360),{0,90,180,270},0),L23,K23,J23,I23),\"\"))","v":0}]
[3,1,"R3C1",{"$f":"INDEX(BOARD_GRID!$B$5:$H$11,A24+1,B24+1)","v":"M07"},{"$f":"INDEX(BOARD_GRID!$B$14:$H$20,A24+1,B24+1)","v":90},{"$f":"IF(D24=\"\",\"\",INDEX(TILES!$C:$C,MATCH(D24,TILES!$A:$A,0)))","v":"NO"},{"$f":"IF(D24=\"\",\"\",INDEX(TILES!$B:$B,MATCH(D24,TILES!$A:$A,0)))","v":"CORNER"},{"$f":"IF(D24=\"\",\"\",INDEX(TILES!$D:$D,MATCH(D24,TILES!$A:$A,0)))","v":"LIZARD"},{"$f":"IF(D24=\"\",\"\",INDEX(TILES!$E:$E,MATCH(D24,TILES!$A:$A,0)))","v":1},{"$f":"IF(D24=\"\",\"\",INDEX(TILES!$F:$F,MATCH(D24,TILES!$A:$A,0)))","v":1},{"$f":"IF(D24=\"\",\"\",INDEX(TILES!$G:$G,MATCH(D24,TILES!$A:$A,0)))","v":0},{"$f":"IF(D24=\"\",\"\",INDEX(TILES!$H:$H,MATCH(D24,TILES!$A:$A,0)))","v":0},{"$f":"IF(D24=\"\",\"\",IFERROR(CHOOSE(MATCH(MOD(E24,360),{0,90,180,270},0),I24,L24,K24,J24),\"\"))","v":0},{"$f":"IF(D24=\"\",\"\",IFERROR(CHOOSE(MATCH(MOD(E24,360),{0,90,180,270},0),J24,I24,L24,K24),\"\"))","v":1},{"$f":"IF(D24=\"\",\"\",IFERROR(CHOOSE(MATCH(MOD(E24,360),{0,90,180,270},0),K24,J24,I24,L24),\"\"))","v":1},{"$f":"IF(D24=\"\",\"\",IFERROR(CHOOSE(MATCH(MOD(E24,360),{0,90,180,270},0),L24,K24,J24,I24),\"\"))","v":0}]
[3,2,"R3C2",{"$f":"INDEX(BOARD_GRID!$B$5:$H$11,A25+1,B25+1)","v":"M25"},{"$f":"INDEX(BOARD_GRID!$B$14:$H$20,A25+1,B25+1)","v":0},{"$f":"IF(D25=\"\",\"\",INDEX(TILES!$C:$C,MATCH(D25,TILES!$A:$A,0)))","v":"NO"},{"$f":"IF(D25=\"\",\"\",INDEX(TILES!$B:$B,MATCH(D25,TILES!$A:$A,0)))","v":"STRAIGHT"},{"$f":"IF(D25=\"\",\"\",INDEX(TILES!$D:$D,MATCH(D25,TILES!$A:$A,0)))","v":0},{"$f":"IF(D25=\"\",\"\",INDEX(TILES!$E:$E,MATCH(D25,TILES!$A:$A,0)))","v":1},{"$f":"IF(D25=\"\",\"\",INDEX(TILES!$F:$F,MATCH(D25,TILES!$A:$A,0)))","v":0},{"$f":"IF(D25=\"\",\"\",INDEX(TILES!$G:$G,MATCH(D25,TILES!$A:$A,0)))","v":1},{"$f":"IF(D25=\"\",\"\",INDEX(TILES!$H:$H,MATCH(D25,TILES!$A:$A,0)))","v":0},{"$f":"IF(D25=\"\",\"\",IFERROR(CHOOSE(MATCH(MOD(E25,360),{0,90,180,270},0),I25,L25,K25,J25),\"\"))","v":1},{"$f":"IF(D25=\"\",\"\",IFERROR(CHOOSE(MATCH(MOD(E25,360),{0,90,180,270},0),J25,I25,L25,K25),\"\"))","v":0},{"$f":"IF(D25=\"\",\"\",IFERROR(CHOOSE(MATCH(MOD(E25,360),{0,90,180,270},0),K25,J25,I25,L25),\"\"))","v":1},{"$f":"IF(D25=\"\",\"\",IFERROR(CHOOSE(MATCH(MOD(E25,360),{0,90,180,270},0),L25,K25,J25,I25),\"\"))","v":0}]
[3,3,"R3C3",{"$f":"INDEX(BOARD_GRID!$B$5:$H$11,A26+1,B26+1)","v":"M16"},{"$f":"INDEX(BOARD_GRID!$B$14:$H$20,A26+1,B26+1)","v":270},{"$f":"IF(D26=\"\",\"\",INDEX(TILES!$C:$C,MATCH(D26,TILES!$A:$A,0)))","v":"NO"},{"$f":"IF(D26=\"\",\"\",INDEX(TILES!$B:$B,MATCH(D26,TILES!$A:$A,0)))","v":"CORNER"},{"$f":"IF(D26=\"\",\"\",INDEX(TILES!$D:$D,MATCH(D26,TILES!$A:$A,0)))","v":0},{"$f":"IF(D26=\"\",\"\",INDEX(TILES!$E:$E,MATCH(D26,TILES!$A:$A,0)))","v":1},{"$f":"IF(D26=\"\",\"\",INDEX(TILES!$F:$F,MATCH(D26,TILES!$A:$A,0)))","v":1},{"$f":"IF(D26=\"\",\"\",INDEX(TILES!$G:$G,MATCH(D26,TILES!$A:$A,0)))","v":0},{"$f":"IF(D26=\"\",\"\",INDEX(TILES!$H:$H,MATCH(D26,TILES!$A:$A,0)))","v":0},{"$f":"IF(D26=\"\",\"\",IFERROR(CHOOSE(MATCH(MOD(E26,360),{0,90,180,270},0),I26,L26,K26,J26),\"\"))","v":1},{"$f":"IF(D26=\"\",\"\",IFERROR(CHOOSE(MATCH(MOD(E26,360),{0,90,180,270},0),J26,I26,L26,K26),\"\"))","v":0},{"$f":"IF(D26=\"\",\"\",IFERROR(CHOOSE(MATCH(MOD(E26,360),{0,90,180,270},0),K26,J26,I26,L26),\"\"))","v":0},{"$f":"IF(D26=\"\",\"\",IFERROR(CHOOSE(MATCH(MOD(E26,360),{0,90,180,270},0),L26,K26,J26,I26),\"\"))","v":1}]
[3,4,"R3C4",{"$f":"INDEX(BOARD_GRID!$B$5:$H$11,A27+1,B27+1)","v":"M33"},{"$f":"INDEX(BOARD_GRID!$B$14:$H$20,A27+1,B27+1)","v":90},{"$f":"IF(D27=\"\",\"\",INDEX(TILES!$C:$C,MATCH(D27,TILES!$A:$A,0)))","v":"NO"},{"$f":"IF(D27=\"\",\"\",INDEX(TILES!$B:$B,MATCH(D27,TILES!$A:$A,0)))","v":"STRAIGHT"},{"$f":"IF(D27=\"\",\"\",INDEX(TILES!$D:$D,MATCH(D27,TILES!$A:$A,0)))","v":0},{"$f":"IF(D27=\"\",\"\",INDEX(TILES!$E:$E,MATCH(D27,TILES!$A:$A,0)))","v":1},{"$f":"IF(D27=\"\",\"\",INDEX(TILES!$F:$F,MATCH(D27,TILES!$A:$A,0)))","v":0},{"$f":"IF(D27=\"\",\"\",INDEX(TILES!$G:$G,MATCH(D27,TILES!$A:$A,0)))","v":1},{"$f":"IF(D27=\"\",\"\",INDEX(TILES!$H:$H,MATCH(D27,TILES!$A:$A,0)))","v":0},{"$f":"IF(D27=\"\",\"\",IFERROR(CHOOSE(MATCH(MOD(E27,360),{0,90,180,270},0),I27,L27,K27,J27),\"\"))","v":0},{"$f":"IF(D27=\"\",\"\",IFERROR(CHOOSE(MATCH(MOD(E27,360),{0,90,180,270},0),J27,I27,L27,K27),\"\"))","v":1},{"$f":"IF(D27=\"\",\"\",IFERROR(CHOOSE(MATCH(MOD(E27,360),{0,90,180,270},0),K27,J27,I27,L27),\"\"))","v":0},{"$f":"IF(D27=\"\",\"\",IFERROR(CHOOSE(MATCH(MOD(E27,360),{0,90,180,270},0),L27,K27,J27,I27),\"\"))","v":1}]
[3,5,"R3C5",{"$f":"INDEX(BOARD_GRID!$B$5:$H$11,A28+1,B28+1)","v":"M15"},{"$f":"INDEX(BOARD_GRID!$B$14:$H$20,A28+1,B28+1)","v":270},{"$f":"IF(D28=\"\",\"\",INDEX(TILES!$C:$C,MATCH(D28,TILES!$A:$A,0)))","v":"NO"},{"$f":"IF(D28=\"\",\"\",INDEX(TILES!$B:$B,MATCH(D28,TILES!$A:$A,0)))","v":"CORNER"},{"$f":"IF(D28=\"\",\"\",INDEX(TILES!$D:$D,MATCH(D28,TILES!$A:$A,0)))","v":0},{"$f":"IF(D28=\"\",\"\",INDEX(TILES!$E:$E,MATCH(D28,TILES!$A:$A,0)))","v":1},{"$f":"IF(D28=\"\",\"\",INDEX(TILES!$F:$F,MATCH(D28,TILES!$A:$A,0)))","v":1},{"$f":"IF(D28=\"\",\"\",INDEX(TILES!$G:$G,MATCH(D28,TILES!$A:$A,0)))","v":0},{"$f":"IF(D28=\"\",\"\",INDEX(TILES!$H:$H,MATCH(D28,TILES!$A:$A,0)))","v":0},{"$f":"IF(D28=\"\",\"\",IFERROR(CHOOSE(MATCH(MOD(E28,360),{0,90,180,270},0),I28,L28,K28,J28),\"\"))","v":1},{"$f":"IF(D28=\"\",\"\",IFERROR(CHOOSE(MATCH(MOD(E28,360),{0,90,180,270},0),J28,I28,L28,K28),\"\"))","v":0},{"$f":"IF(D28=\"\",\"\",IFERROR(CHOOSE(MATCH(MOD(E28,360),{0,90,180,270},0),K28,J28,I28,L28),\"\"))","v":0},{"$f":"IF(D28=\"\",\"\",IFERROR(CHOOSE(MATCH(MOD(E28,360),{0,90,180,270},0),L28,K28,J28,I28),\"\"))","v":1}]
[3,6,"R3C6",{"$f":"INDEX(BOARD_GRID!$B$5:$H$11,A29+1,B29+1)","v":"M22"},{"$f":"INDEX(BOARD_GRID!$B$14:$H$20,A29+1,B29+1)","v":0},{"$f":"IF(D29=\"\",\"\",INDEX(TILES!$C:$C,MATCH(D29,TILES!$A:$A,0)))","v":"NO"},{"$f":"IF(D29=\"\",\"\",INDEX(TILES!$B:$B,MATCH(D29,TILES!$A:$A,0)))","v":"STRAIGHT"},{"$f":"IF(D29=\"\",\"\",INDEX(TILES!$D:$D,MATCH(D29,TILES!$A:$A,0)))","v":0},{"$f":"IF(D29=\"\",\"\",INDEX(TILES!$E:$E,MATCH(D29,TILES!$A:$A,0)))","v":1},{"$f":"IF(D29=\"\",\"\",INDEX(TILES!$F:$F,MATCH(D29,TILES!$A:$A,0)))","v":0},{"$f":"IF(D29=\"\",\"\",INDEX(TILES!$G:$G,MATCH(D29,TILES!$A:$A,0)))","v":1},{"$f":"IF(D29=\"\",\"\",INDEX(TILES!$H:$H,MATCH(D29,TILES!$A:$A,0)))","v":0},{"$f":"IF(D29=\"\",\"\",IFERROR(CHOOSE(MATCH(MOD(E29,360),{0,90,180,270},0),I29,L29,K29,J29),\"\"))","v":1},{"$f":"IF(D29=\"\",\"\",IFERROR(CHOOSE(MATCH(MOD(E29,360),{0,90,180,270},0),J29,I29,L29,K29),\"\"))","v":0},{"$f":"IF(D29=\"\",\"\",IFERROR(CHOOSE(MATCH(MOD(E29,360),{0,90,180,270},0),K29,J29,I29,L29),\"\"))","v":1},{"$f":"IF(D29=\"\",\"\",IFERROR(CHOOSE(MATCH(MOD(E29,360),{0,90,180,270},0),L29,K29,J29,I29),\"\"))","v":0}]
[4,0,"R4C0",{"$f":"INDEX(BOARD_GRID!$B$5:$H$11,A30+1,B30+1)","v":"F11"},{"$f":"INDEX(BOARD_GRID!$B$14:$H$20,A30+1,B30+1)","v":90},{"$f":"IF(D30=\"\",\"\",INDEX(TILES!$C:$C,MATCH(D30,TILES!$A:$A,0)))","v":"YES"},{"$f":"IF(D30=\"\",\"\",INDEX(TILES!$B:$B,MATCH(D30,TILES!$A:$A,0)))","v":"T_JUNCTION"},{"$f":"IF(D30=\"\",\"\",INDEX(TILES!$D:$D,MATCH(D30,TILES!$A:$A,0)))","v":"RING"},{"$f":"IF(D30=\"\",\"\",INDEX(TILES!$E:$E,MATCH(D30,TILES!$A:$A,0)))","v":1},{"$f":"IF(D30=\"\",\"\",INDEX(TILES!$F:$F,MATCH(D30,TILES!$A:$A,0)))","v":1},{"$f":"IF(D30=\"\",\"\",INDEX(TILES!$G:$G,MATCH(D30,TILES!$A:$A,0)))","v":0},{"$f":"IF(D30=\"\",\"\",INDEX(TILES!$H:$H,MATCH(D30,TILES!$A:$A,0)))","v":1},{"$f":"IF(D30=\"\",\"\",IFERROR(CHOOSE(MATCH(MOD(E30,360),{0,90,180,270},0),I30,L30,K30,J30),\"\"))","v":1},{"$f":"IF(D30=\"\",\"\",IFERROR(CHOOSE(MATCH(MOD(E30,360),{0,90,180,270},0),J30,I30,L30,K30),\"\"))","v":1},{"$f":"IF(D30=\"\",\"\",IFERROR(CHOOSE(MATCH(MOD(E30,360),{0,90,180,270},0),K30,J30,I30,L30),\"\"))","v":1},{"$f":"IF(D30=\"\",\"\",IFERROR(CHOOSE(MATCH(MOD(E30,360),{0,90,180,270},0),L30,K30,J30,I30),\"\"))","v":0}]
[4,1,"R4C1",{"$f":"INDEX(BOARD_GRID!$B$5:$H$11,A31+1,B31+1)","v":"M02"},{"$f":"INDEX(BOARD_GRID!$B$14:$H$20,A31+1,B31+1)","v":90},{"$f":"IF(D31=\"\",\"\",INDEX(TILES!$C:$C,MATCH(D31,TILES!$A:$A,0)))","v":"NO"},{"$f":"IF(D31=\"\",\"\",INDEX(TILES!$B:$B,MATCH(D31,TILES!$A:$A,0)))","v":"CORNER"},{"$f":"IF(D31=\"\",\"\",INDEX(TILES!$D:$D,MATCH(D31,TILES!$A:$A,0)))","v":"OWL"},{"$f":"IF(D31=\"\",\"\",INDEX(TILES!$E:$E,MATCH(D31,TILES!$A:$A,0)))","v":1},{"$f":"IF(D31=\"\",\"\",INDEX(TILES!$F:$F,MATCH(D31,TILES!$A:$A,0)))","v":1},{"$f":"IF(D31=\"\",\"\",INDEX(TILES!$G:$G,MATCH(D31,TILES!$A:$A,0)))","v":0},{"$f":"IF(D31=\"\",\"\",INDEX(TILES!$H:$H,MATCH(D31,TILES!$A:$A,0)))","v":0},{"$f":"IF(D31=\"\",\"\",IFERROR(CHOOSE(MATCH(MOD(E31,360),{0,90,180,270},0),I31,L31,K31,J31),\"\"))","v":0},{"$f":"IF(D31=\"\",\"\",IFERROR(CHOOSE(MATCH(MOD(E31,360),{0,90,180,270},0),J31,I31,L31,K31),\"\"))","v":1},{"$f":"IF(D31=\"\",\"\",IFERROR(CHOOSE(MATCH(MOD(E31,360),{0,90,180,270},0),K31,J31,I31,L31),\"\"))","v":1},{"$f":"IF(D31=\"\",\"\",IFERROR(CHOOSE(MATCH(MOD(E31,360),{0,90,180,270},0),L31,K31,J31,I31),\"\"))","v":0}]
[4,2,"R4C2",{"$f":"INDEX(BOARD_GRID!$B$5:$H$11,A32+1,B32+1)","v":"F12"},{"$f":"INDEX(BOARD_GRID!$B$14:$H$20,A32+1,B32+1)","v":0},{"$f":"IF(D32=\"\",\"\",INDEX(TILES!$C:$C,MATCH(D32,TILES!$A:$A,0)))","v":"YES"},{"$f":"IF(D32=\"\",\"\",INDEX(TILES!$B:$B,MATCH(D32,TILES!$A:$A,0)))","v":"T_JUNCTION"},{"$f":"IF(D32=\"\",\"\",INDEX(TILES!$D:$D,MATCH(D32,TILES!$A:$A,0)))","v":"TREASURE_CHEST"},{"$f":"IF(D32=\"\",\"\",INDEX(TILES!$E:$E,MATCH(D32,TILES!$A:$A,0)))","v":1},{"$f":"IF(D32=\"\",\"\",INDEX(TILES!$F:$F,MATCH(D32,TILES!$A:$A,0)))","v":1},{"$f":"IF(D32=\"\",\"\",INDEX(TILES!$G:$G,MATCH(D32,TILES!$A:$A,0)))","v":0},{"$f":"IF(D32=\"\",\"\",INDEX(TILES!$H:$H,MATCH(D32,TILES!$A:$A,0)))","v":1},{"$f":"IF(D32=\"\",\"\",IFERROR(CHOOSE(MATCH(MOD(E32,360),{0,90,180,270},0),I32,L32,K32,J32),\"\"))","v":1},{"$f":"IF(D32=\"\",\"\",IFERROR(CHOOSE(MATCH(MOD(E32,360),{0,90,180,270},0),J32,I32,L32,K32),\"\"))","v":1},{"$f":"IF(D32=\"\",\"\",IFERROR(CHOOSE(MATCH(MOD(E32,360),{0,90,180,270},0),K32,J32,I32,L32),\"\"))","v":0},{"$f":"IF(D32=\"\",\"\",IFERROR(CHOOSE(MATCH(MOD(E32,360),{0,90,180,270},0),L32,K32,J32,I32),\"\"))","v":1}]
[4,3,"R4C3",{"$f":"INDEX(BOARD_GRID!$B$5:$H$11,A33+1,B33+1)","v":"M20"},{"$f":"INDEX(BOARD_GRID!$B$14:$H$20,A33+1,B33+1)","v":90},{"$f":"IF(D33=\"\",\"\",INDEX(TILES!$C:$C,MATCH(D33,TILES!$A:$A,0)))","v":"NO"},{"$f":"IF(D33=\"\",\"\",INDEX(TILES!$B:$B,MATCH(D33,TILES!$A:$A,0)))","v":"CORNER"},{"$f":"IF(D33=\"\",\"\",INDEX(TILES!$D:$D,MATCH(D33,TILES!$A:$A,0)))","v":0},{"$f":"IF(D33=\"\",\"\",INDEX(TILES!$E:$E,MATCH(D33,TILES!$A:$A,0)))","v":1},{"$f":"IF(D33=\"\",\"\",INDEX(TILES!$F:$F,MATCH(D33,TILES!$A:$A,0)))","v":1},{"$f":"IF(D33=\"\",\"\",INDEX(TILES!$G:$G,MATCH(D33,TILES!$A:$A,0)))","v":0},{"$f":"IF(D33=\"\",\"\",INDEX(TILES!$H:$H,MATCH(D33,TILES!$A:$A,0)))","v":0},{"$f":"IF(D33=\"\",\"\",IFERROR(CHOOSE(MATCH(MOD(E33,360),{0,90,180,270},0),I33,L33,K33,J33),\"\"))","v":0},{"$f":"IF(D33=\"\",\"\",IFERROR(CHOOSE(MATCH(MOD(E33,360),{0,90,180,270},0),J33,I33,L33,K33),\"\"))","v":1},{"$f":"IF(D33=\"\",\"\",IFERROR(CHOOSE(MATCH(MOD(E33,360),{0,90,180,270},0),K33,J33,I33,L33),\"\"))","v":1},{"$f":"IF(D33=\"\",\"\",IFERROR(CHOOSE(MATCH(MOD(E33,360),{0,90,180,270},0),L33,K33,J33,I33),\"\"))","v":0}]
[{"$f":"INT((ROW()-2)/7)","v":4},{"$f":"MOD(ROW()-2,7)","v":4},{"$f":"\"R\"&A34&\"C\"&B34","v":"R4C4"},{"$f":"INDEX(BOARD_GRID!$B$5:$H$11,A34+1,B34+1)","v":"F13"},{"$f":"INDEX(BOARD_GRID!$B$14:$H$20,A34+1,B34+1)","v":270},{"$f":"IF(D34=\"\",\"\",INDEX(TILES!$C:$C,MATCH(D34,TILES!$A:$A,0)))","v":"YES"},{"$f":"IF(D34=\"\",\"\",INDEX(TILES!$B:$B,MATCH(D34,TILES!$A:$A,0)))","v":"T_JUNCTION"},{"$f":"IF(D34=\"\",\"\",INDEX(TILES!$D:$D,MATCH(D34,TILES!$A:$A,0)))","v":"EMERALD"},{"$f":"IF(D34=\"\",\"\",INDEX(TILES!$E:$E,MATCH(D34,TILES!$A:$A,0)))","v":1},{"$f":"IF(D34=\"\",\"\",INDEX(TILES!$F:$F,MATCH(D34,TILES!$A:$A,0)))","v":1},{"$f":"IF(D34=\"\",\"\",INDEX(TILES!$G:$G,MATCH(D34,TILES!$A:$A,0)))","v":0},{"$f":"IF(D34=\"\",\"\",INDEX(TILES!$H:$H,MATCH(D34,TILES!$A:$A,0)))","v":1},{"$f":"IF(D34=\"\",\"\",IFERROR(CHOOSE(MATCH(MOD(E34,360),{0,90,180,270},0),I34,L34,K34,J34),\"\"))","v":1},{"$f":"IF(D34=\"\",\"\",IFERROR(CHOOSE(MATCH(MOD(E34,360),{0,90,180,270},0),J34,I34,L34,K34),\"\"))","v":0},{"$f":"IF(D34=\"\",\"\",IFERROR(CHOOSE(MATCH(MOD(E34,360),{0,90,180,270},0),K34,J34,I34,L34),\"\"))","v":1},{"$f":"IF(D34=\"\",\"\",IFERROR(CHOOSE(MATCH(MOD(E34,360),{0,90,180,270},0),L34,K34,J34,I34),\"\"))","v":1}]
[4,5,"R4C5",{"$f":"INDEX(BOARD_GRID!$B$5:$H$11,A35+1,B35+1)","v":"M17"},{"$f":"INDEX(BOARD_GRID!$B$14:$H$20,A35+1,B35+1)","v":270},{"$f":"IF(D35=\"\",\"\",INDEX(TILES!$C:$C,MATCH(D35,TILES!$A:$A,0)))","v":"NO"},{"$f":"IF(D35=\"\",\"\",INDEX(TILES!$B:$B,MATCH(D35,TILES!$A:$A,0)))","v":"CORNER"},{"$f":"IF(D35=\"\",\"\",INDEX(TILES!$D:$D,MATCH(D35,TILES!$A:$A,0)))","v":0},{"$f":"IF(D35=\"\",\"\",INDEX(TILES!$E:$E,MATCH(D35,TILES!$A:$A,0)))","v":1},{"$f":"IF(D35=\"\",\"\",INDEX(TILES!$F:$F,MATCH(D35,TILES!$A:$A,0)))","v":1},{"$f":"IF(D35=\"\",\"\",INDEX(TILES!$G:$G,MATCH(D35,TILES!$A:$A,0)))","v":0},{"$f":"IF(D35=\"\",\"\",INDEX(TILES!$H:$H,MATCH(D35,TILES!$A:$A,0)))","v":0},{"$f":"IF(D35=\"\",\"\",IFERROR(CHOOSE(MATCH(MOD(E35,360),{0,90,180,270},0),I35,L35,K35,J35),\"\"))","v":1},{"$f":"IF(D35=\"\",\"\",IFERROR(CHOOSE(MATCH(MOD(E35,360),{0,90,180,270},0),J35,I35,L35,K35),\"\"))","v":0},{"$f":"IF(D35=\"\",\"\",IFERROR(CHOOSE(MATCH(MOD(E35,360),{0,90,180,270},0),K35,J35,I35,L35),\"\"))","v":0},{"$f":"IF(D35=\"\",\"\",IFERROR(CHOOSE(MATCH(MOD(E35,360),{0,90,180,270},0),L35,K35,J35,I35),\"\"))","v":1}]
[4,6,"R4C6",{"$f":"INDEX(BOARD_GRID!$B$5:$H$11,A36+1,B36+1)","v":"F14"},{"$f":"INDEX(BOARD_GRID!$B$14:$H$20,A36+1,B36+1)","v":270},{"$f":"IF(D36=\"\",\"\",INDEX(TILES!$C:$C,MATCH(D36,TILES!$A:$A,0)))","v":"YES"},{"$f":"IF(D36=\"\",\"\",INDEX(TILES!$B:$B,MATCH(D36,TILES!$A:$A,0)))","v":"T_JUNCTION"},{"$f":"IF(D36=\"\",\"\",INDEX(TILES!$D:$D,MATCH(D36,TILES!$A:$A,0)))","v":"SWORD"},{"$f":"IF(D36=\"\",\"\",INDEX(TILES!$E:$E,MATCH(D36,TILES!$A:$A,0)))","v":1},{"$f":"IF(D36=\"\",\"\",INDEX(TILES!$F:$F,MATCH(D36,TILES!$A:$A,0)))","v":1},{"$f":"IF(D36=\"\",\"\",INDEX(TILES!$G:$G,MATCH(D36,TILES!$A:$A,0)))","v":0},{"$f":"IF(D36=\"\",\"\",INDEX(TILES!$H:$H,MATCH(D36,TILES!$A:$A,0)))","v":1},{"$f":"IF(D36=\"\",\"\",IFERROR(CHOOSE(MATCH(MOD(E36,360),{0,90,180,270},0),I36,L36,K36,J36),\"\"))","v":1},{"$f":"IF(D36=\"\",\"\",IFERROR(CHOOSE(MATCH(MOD(E36,360),{0,90,180,270},0),J36,I36,L36,K36),\"\"))","v":0},{"$f":"IF(D36=\"\",\"\",IFERROR(CHOOSE(MATCH(MOD(E36,360),{0,90,180,270},0),K36,J36,I36,L36),\"\"))","v":1},{"$f":"IF(D36=\"\",\"\",IFERROR(CHOOSE(MATCH(MOD(E36,360),{0,90,180,270},0),L36,K36,J36,I36),\"\"))","v":1}]
[5,0,"R5C0",{"$f":"INDEX(BOARD_GRID!$B$5:$H$11,A37+1,B37+1)","v":"M34"},{"$f":"INDEX(BOARD_GRID!$B$14:$H$20,A37+1,B37+1)","v":0},{"$f":"IF(D37=\"\",\"\",INDEX(TILES!$C:$C,MATCH(D37,TILES!$A:$A,0)))","v":"NO"},{"$f":"IF(D37=\"\",\"\",INDEX(TILES!$B:$B,MATCH(D37,TILES!$A:$A,0)))","v":"STRAIGHT"},{"$f":"IF(D37=\"\",\"\",INDEX(TILES!$D:$D,MATCH(D37,TILES!$A:$A,0)))","v":0},{"$f":"IF(D37=\"\",\"\",INDEX(TILES!$E:$E,MATCH(D37,TILES!$A:$A,0)))","v":1},{"$f":"IF(D37=\"\",\"\",INDEX(TILES!$F:$F,MATCH(D37,TILES!$A:$A,0)))","v":0},{"$f":"IF(D37=\"\",\"\",INDEX(TILES!$G:$G,MATCH(D37,TILES!$A:$A,0)))","v":1},{"$f":"IF(D37=\"\",\"\",INDEX(TILES!$H:$H,MATCH(D37,TILES!$A:$A,0)))","v":0},{"$f":"IF(D37=\"\",\"\",IFERROR(CHOOSE(MATCH(MOD(E37,360),{0,90,180,270},0),I37,L37,K37,J37),\"\"))","v":1},{"$f":"IF(D37=\"\",\"\",IFERROR(CHOOSE(MATCH(MOD(E37,360),{0,90,180,270},0),J37,I37,L37,K37),\"\"))","v":0},{"$f":"IF(D37=\"\",\"\",IFERROR(CHOOSE(MATCH(MOD(E37,360),{0,90,180,270},0),K37,J37,I37,L37),\"\"))","v":1},{"$f":"IF(D37=\"\",\"\",IFERROR(CHOOSE(MATCH(MOD(E37,360),{0,90,180,270},0),L37,K37,J37,I37),\"\"))","v":0}]
[5,1,"R5C1",{"$f":"INDEX(BOARD_GRID!$B$5:$H$11,A38+1,B38+1)","v":"M18"},{"$f":"INDEX(BOARD_GRID!$B$14:$H$20,A38+1,B38+1)","v":180},{"$f":"IF(D38=\"\",\"\",INDEX(TILES!$C:$C,MATCH(D38,TILES!$A:$A,0)))","v":"NO"},{"$f":"IF(D38=\"\",\"\",INDEX(TILES!$B:$B,MATCH(D38,TILES!$A:$A,0)))","v":"CORNER"},{"$f":"IF(D38=\"\",\"\",INDEX(TILES!$D:$D,MATCH(D38,TILES!$A:$A,0)))","v":0},{"$f":"IF(D38=\"\",\"\",INDEX(TILES!$E:$E,MATCH(D38,TILES!$A:$A,0)))","v":1},{"$f":"IF(D38=\"\",\"\",INDEX(TILES!$F:$F,MATCH(D38,TILES!$A:$A,0)))","v":1},{"$f":"IF(D38=\"\",\"\",INDEX(TILES!$G:$G,MATCH(D38,TILES!$A:$A,0)))","v":0},{"$f":"IF(D38=\"\",\"\",INDEX(TILES!$H:$H,MATCH(D38,TILES!$A:$A,0)))","v":0},{"$f":"IF(D38=\"\",\"\",IFERROR(CHOOSE(MATCH(MOD(E38,360),{0,90,180,270},0),I38,L38,K38,J38),\"\"))","v":0},{"$f":"IF(D38=\"\",\"\",IFERROR(CHOOSE(MATCH(MOD(E38,360),{0,90,180,270},0),J38,I38,L38,K38),\"\"))","v":0},{"$f":"IF(D38=\"\",\"\",IFERROR(CHOOSE(MATCH(MOD(E38,360),{0,90,180,270},0),K38,J38,I38,L38),\"\"))","v":1},{"$f":"IF(D38=\"\",\"\",IFERROR(CHOOSE(MATCH(MOD(E38,360),{0,90,180,270},0),L38,K38,J38,I38),\"\"))","v":1}]
[5,2,"R5C2",{"$f":"INDEX(BOARD_GRID!$B$5:$H$11,A39+1,B39+1)","v":"M28"},{"$f":"INDEX(BOARD_GRID!$B$14:$H$20,A39+1,B39+1)","v":180},{"$f":"IF(D39=\"\",\"\",INDEX(TILES!$C:$C,MATCH(D39,TILES!$A:$A,0)))","v":"NO"},{"$f":"IF(D39=\"\",\"\",INDEX(TILES!$B:$B,MATCH(D39,TILES!$A:$A,0)))","v":"STRAIGHT"},{"$f":"IF(D39=\"\",\"\",INDEX(TILES!$D:$D,MATCH(D39,TILES!$A:$A,0)))","v":0},{"$f":"IF(D39=\"\",\"\",INDEX(TILES!$E:$E,MATCH(D39,TILES!$A:$A,0)))","v":1},{"$f":"IF(D39=\"\",\"\",INDEX(TILES!$F:$F,MATCH(D39,TILES!$A:$A,0)))","v":0},{"$f":"IF(D39=\"\",\"\",INDEX(TILES!$G:$G,MATCH(D39,TILES!$A:$A,0)))","v":1},{"$f":"IF(D39=\"\",\"\",INDEX(TILES!$H:$H,MATCH(D39,TILES!$A:$A,0)))","v":0},{"$f":"IF(D39=\"\",\"\",IFERROR(CHOOSE(MATCH(MOD(E39,360),{0,90,180,270},0),I39,L39,K39,J39),\"\"))","v":1},{"$f":"IF(D39=\"\",\"\",IFERROR(CHOOSE(MATCH(MOD(E39,360),{0,90,180,270},0),J39,I39,L39,K39),\"\"))","v":0},{"$f":"IF(D39=\"\",\"\",IFERROR(CHOOSE(MATCH(MOD(E39,360),{0,90,180,270},0),K39,J39,I39,L39),\"\"))","v":1},{"$f":"IF(D39=\"\",\"\",IFERROR(CHOOSE(MATCH(MOD(E39,360),{0,90,180,270},0),L39,K39,J39,I39),\"\"))","v":0}]
[5,3,"R5C3",{"$f":"INDEX(BOARD_GRID!$B$5:$H$11,A40+1,B40+1)","v":"M12"},{"$f":"INDEX(BOARD_GRID!$B$14:$H$20,A40+1,B40+1)","v":270},{"$f":"IF(D40=\"\",\"\",INDEX(TILES!$C:$C,MATCH(D40,TILES!$A:$A,0)))","v":"NO"},{"$f":"IF(D40=\"\",\"\",INDEX(TILES!$B:$B,MATCH(D40,TILES!$A:$A,0)))","v":"T_JUNCTION"},{"$f":"IF(D40=\"\",\"\",INDEX(TILES!$D:$D,MATCH(D40,TILES!$A:$A,0)))","v":"GOBLIN"},{"$f":"IF(D40=\"\",\"\",INDEX(TILES!$E:$E,MATCH(D40,TILES!$A:$A,0)))","v":1},{"$f":"IF(D40=\"\",\"\",INDEX(TILES!$F:$F,MATCH(D40,TILES!$A:$A,0)))","v":1},{"$f":"IF(D40=\"\",\"\",INDEX(TILES!$G:$G,MATCH(D40,TILES!$A:$A,0)))","v":0},{"$f":"IF(D40=\"\",\"\",INDEX(TILES!$H:$H,MATCH(D40,TILES!$A:$A,0)))","v":1},{"$f":"IF(D40=\"\",\"\",IFERROR(CHOOSE(MATCH(MOD(E40,360),{0,90,180,270},0),I40,L40,K40,J40),\"\"))","v":1},{"$f":"IF(D40=\"\",\"\",IFERROR(CHOOSE(MATCH(MOD(E40,360),{0,90,180,270},0),J40,I40,L40,K40),\"\"))","v":0},{"$f":"IF(D40=\"\",\"\",IFERROR(CHOOSE(MATCH(MOD(E40,360),{0,90,180,270},0),K40,J40,I40,L40),\"\"))","v":1},{"$f":"IF(D40=\"\",\"\",IFERROR(CHOOSE(MATCH(MOD(E40,360),{0,90,180,270},0),L40,K40,J40,I40),\"\"))","v":1}]
[5,4,"R5C4",{"$f":"INDEX(BOARD_GRID!$B$5:$H$11,A41+1,B41+1)","v":"M06"},{"$f":"INDEX(BOARD_GRID!$B$14:$H$20,A41+1,B41+1)","v":180},{"$f":"IF(D41=\"\",\"\",INDEX(TILES!$C:$C,MATCH(D41,TILES!$A:$A,0)))","v":"NO"},{"$f":"IF(D41=\"\",\"\",INDEX(TILES!$B:$B,MATCH(D41,TILES!$A:$A,0)))","v":"T_JUNCTION"},{"$f":"IF(D41=\"\",\"\",INDEX(TILES!$D:$D,MATCH(D41,TILES!$A:$A,0)))","v":"GHOST"},{"$f":"IF(D41=\"\",\"\",INDEX(TILES!$E:$E,MATCH(D41,TILES!$A:$A,0)))","v":1},{"$f":"IF(D41=\"\",\"\",INDEX(TILES!$F:$F,MATCH(D41,TILES!$A:$A,0)))","v":1},{"$f":"IF(D41=\"\",\"\",INDEX(TILES!$G:$G,MATCH(D41,TILES!$A:$A,0)))","v":0},{"$f":"IF(D41=\"\",\"\",INDEX(TILES!$H:$H,MATCH(D41,TILES!$A:$A,0)))","v":1},{"$f":"IF(D41=\"\",\"\",IFERROR(CHOOSE(MATCH(MOD(E41,360),{0,90,180,270},0),I41,L41,K41,J41),\"\"))","v":0},{"$f":"IF(D41=\"\",\"\",IFERROR(CHOOSE(MATCH(MOD(E41,360),{0,90,180,270},0),J41,I41,L41,K41),\"\"))","v":1},{"$f":"IF(D41=\"\",\"\",IFERROR(CHOOSE(MATCH(MOD(E41,360),{0,90,180,270},0),K41,J41,I41,L41),\"\"))","v":1},{"$f":"IF(D41=\"\",\"\",IFERROR(CHOOSE(MATCH(MOD(E41,360),{0,90,180,270},0),L41,K41,J41,I41),\"\"))","v":1}]
[5,5,"R5C5",{"$f":"INDEX(BOARD_GRID!$B$5:$H$11,A42+1,B42+1)","v":"M26"},{"$f":"INDEX(BOARD_GRID!$B$14:$H$20,A42+1,B42+1)","v":180},{"$f":"IF(D42=\"\",\"\",INDEX(TILES!$C:$C,MATCH(D42,TILES!$A:$A,0)))","v":"NO"},{"$f":"IF(D42=\"\",\"\",INDEX(TILES!$B:$B,MATCH(D42,TILES!$A:$A,0)))","v":"STRAIGHT"},{"$f":"IF(D42=\"\",\"\",INDEX(TILES!$D:$D,MATCH(D42,TILES!$A:$A,0)))","v":0},{"$f":"IF(D42=\"\",\"\",INDEX(TILES!$E:$E,MATCH(D42,TILES!$A:$A,0)))","v":1},{"$f":"IF(D42=\"\",\"\",INDEX(TILES!$F:$F,MATCH(D42,TILES!$A:$A,0)))","v":0},{"$f":"IF(D42=\"\",\"\",INDEX(TILES!$G:$G,MATCH(D42,TILES!$A:$A,0)))","v":1},{"$f":"IF(D42=\"\",\"\",INDEX(TILES!$H:$H,MATCH(D42,TILES!$A:$A,0)))","v":0},{"$f":"IF(D42=\"\",\"\",IFERROR(CHOOSE(MATCH(MOD(E42,360),{0,90,180,270},0),I42,L42,K42,J42),\"\"))","v":1},{"$f":"IF(D42=\"\",\"\",IFERROR(CHOOSE(MATCH(MOD(E42,360),{0,90,180,270},0),J42,I42,L42,K42),\"\"))","v":0},{"$f":"IF(D42=\"\",\"\",IFERROR(CHOOSE(MATCH(MOD(E42,360),{0,90,180,270},0),K42,J42,I42,L42),\"\"))","v":1},{"$f":"IF(D42=\"\",\"\",IFERROR(CHOOSE(MATCH(MOD(E42,360),{0,90,180,270},0),L42,K42,J42,I42),\"\"))","v":0}]
[5,6,"R5C6",{"$f":"INDEX(BOARD_GRID!$B$5:$H$11,A43+1,B43+1)","v":"M09"},{"$f":"INDEX(BOARD_GRID!$B$14:$H$20,A43+1,B43+1)","v":0},{"$f":"IF(D43=\"\",\"\",INDEX(TILES!$C:$C,MATCH(D43,TILES!$A:$A,0)))","v":"NO"},{"$f":"IF(D43=\"\",\"\",INDEX(TILES!$B:$B,MATCH(D43,TILES!$A:$A,0)))","v":"CORNER"},{"$f":"IF(D43=\"\",\"\",INDEX(TILES!$D:$D,MATCH(D43,TILES!$A:$A,0)))","v":"BEETLE"},{"$f":"IF(D43=\"\",\"\",INDEX(TILES!$E:$E,MATCH(D43,TILES!$A:$A,0)))","v":1},{"$f":"IF(D43=\"\",\"\",INDEX(TILES!$F:$F,MATCH(D43,TILES!$A:$A,0)))","v":1},{"$f":"IF(D43=\"\",\"\",INDEX(TILES!$G:$G,MATCH(D43,TILES!$A:$A,0)))","v":0},{"$f":"IF(D43=\"\",\"\",INDEX(TILES!$H:$H,MATCH(D43,TILES!$A:$A,0)))","v":0},{"$f":"IF(D43=\"\",\"\",IFERROR(CHOOSE(MATCH(MOD(E43,360),{0,90,180,270},0),I43,L43,K43,J43),\"\"))","v":1},{"$f":"IF(D43=\"\",\"\",IFERROR(CHOOSE(MATCH(MOD(E43,360),{0,90,180,270},0),J43,I43,L43,K43),\"\"))","v":1},{"$f":"IF(D43=\"\",\"\",IFERROR(CHOOSE(MATCH(MOD(E43,360),{0,90,180,270},0),K43,J43,I43,L43),\"\"))","v":0},{"$f":"IF(D43=\"\",\"\",IFERROR(CHOOSE(MATCH(MOD(E43,360),{0,90,180,270},0),L43,K43,J43,I43),\"\"))","v":0}]
[6,0,"R6C0",{"$f":"INDEX(BOARD_GRID!$B$5:$H$11,A44+1,B44+1)","v":"F04"},{"$f":"INDEX(BOARD_GRID!$B$14:$H$20,A44+1,B44+1)","v":0},{"$f":"IF(D44=\"\",\"\",INDEX(TILES!$C:$C,MATCH(D44,TILES!$A:$A,0)))","v":"YES"},{"$f":"IF(D44=\"\",\"\",INDEX(TILES!$B:$B,MATCH(D44,TILES!$A:$A,0)))","v":"CORNER"},{"$f":"IF(D44=\"\",\"\",INDEX(TILES!$D:$D,MATCH(D44,TILES!$A:$A,0)))","v":0},{"$f":"IF(D44=\"\",\"\",INDEX(TILES!$E:$E,MATCH(D44,TILES!$A:$A,0)))","v":1},{"$f":"IF(D44=\"\",\"\",INDEX(TILES!$F:$F,MATCH(D44,TILES!$A:$A,0)))","v":1},{"$f":"IF(D44=\"\",\"\",INDEX(TILES!$G:$G,MATCH(D44,TILES!$A:$A,0)))","v":0},{"$f":"IF(D44=\"\",\"\",INDEX(TILES!$H:$H,MATCH(D44,TILES!$A:$A,0)))","v":0},{"$f":"IF(D44=\"\",\"\",IFERROR(CHOOSE(MATCH(MOD(E44,360),{0,90,180,270},0),I44,L44,K44,J44),\"\"))","v":1},{"$f":"IF(D44=\"\",\"\",IFERROR(CHOOSE(MATCH(MOD(E44,360),{0,90,180,270},0),J44,I44,L44,K44),\"\"))","v":1},{"$f":"IF(D44=\"\",\"\",IFERROR(CHOOSE(MATCH(MOD(E44,360),{0,90,180,270},0),K44,J44,I44,L44),\"\"))","v":0},{"$f":"IF(D44=\"\",\"\",IFERROR(CHOOSE(MATCH(MOD(E44,360),{0,90,180,270},0),L44,K44,J44,I44),\"\"))","v":0}]
[6,1,"R6C1",{"$f":"INDEX(BOARD_GRID!$B$5:$H$11,A45+1,B45+1)","v":"M08"},{"$f":"INDEX(BOARD_GRID!$B$14:$H$20,A45+1,B45+1)","v":90},{"$f":"IF(D45=\"\",\"\",INDEX(TILES!$C:$C,MATCH(D45,TILES!$A:$A,0)))","v":"NO"},{"$f":"IF(D45=\"\",\"\",INDEX(TILES!$B:$B,MATCH(D45,TILES!$A:$A,0)))","v":"CORNER"},{"$f":"IF(D45=\"\",\"\",INDEX(TILES!$D:$D,MATCH(D45,TILES!$A:$A,0)))","v":"MOUSE"},{"$f":"IF(D45=\"\",\"\",INDEX(TILES!$E:$E,MATCH(D45,TILES!$A:$A,0)))","v":1},{"$f":"IF(D45=\"\",\"\",INDEX(TILES!$F:$F,MATCH(D45,TILES!$A:$A,0)))","v":1},{"$f":"IF(D45=\"\",\"\",INDEX(TILES!$G:$G,MATCH(D45,TILES!$A:$A,0)))","v":0},{"$f":"IF(D45=\"\",\"\",INDEX(TILES!$H:$H,MATCH(D45,TILES!$A:$A,0)))","v":0},{"$f":"IF(D45=\"\",\"\",IFERROR(CHOOSE(MATCH(MOD(E45,360),{0,90,180,270},0),I45,L45,K45,J45),\"\"))","v":0},{"$f":"IF(D45=\"\",\"\",IFERROR(CHOOSE(MATCH(MOD(E45,360),{0,90,180,270},0),J45,I45,L45,K45),\"\"))","v":1},{"$f":"IF(D45=\"\",\"\",IFERROR(CHOOSE(MATCH(MOD(E45,360),{0,90,180,270},0),K45,J45,I45,L45),\"\"))","v":1},{"$f":"IF(D45=\"\",\"\",IFERROR(CHOOSE(MATCH(MOD(E45,360),{0,90,180,270},0),L45,K45,J45,I45),\"\"))","v":0}]
[6,2,"R6C2",{"$f":"INDEX(BOARD_GRID!$B$5:$H$11,A46+1,B46+1)","v":"F15"},{"$f":"INDEX(BOARD_GRID!$B$14:$H$20,A46+1,B46+1)","v":0},{"$f":"IF(D46=\"\",\"\",INDEX(TILES!$C:$C,MATCH(D46,TILES!$A:$A,0)))","v":"YES"},{"$f":"IF(D46=\"\",\"\",INDEX(TILES!$B:$B,MATCH(D46,TILES!$A:$A,0)))","v":"T_JUNCTION"},{"$f":"IF(D46=\"\",\"\",INDEX(TILES!$D:$D,MATCH(D46,TILES!$A:$A,0)))","v":"CANDLESTICK"},{"$f":"IF(D46=\"\",\"\",INDEX(TILES!$E:$E,MATCH(D46,TILES!$A:$A,0)))","v":1},{"$f":"IF(D46=\"\",\"\",INDEX(TILES!$F:$F,MATCH(D46,TILES!$A:$A,0)))","v":1},{"$f":"IF(D46=\"\",\"\",INDEX(TILES!$G:$G,MATCH(D46,TILES!$A:$A,0)))","v":0},{"$f":"IF(D46=\"\",\"\",INDEX(TILES!$H:$H,MATCH(D46,TILES!$A:$A,0)))","v":1},{"$f":"IF(D46=\"\",\"\",IFERROR(CHOOSE(MATCH(MOD(E46,360),{0,90,180,270},0),I46,L46,K46,J46),\"\"))","v":1},{"$f":"IF(D46=\"\",\"\",IFERROR(CHOOSE(MATCH(MOD(E46,360),{0,90,180,270},0),J46,I46,L46,K46),\"\"))","v":1},{"$f":"IF(D46=\"\",\"\",IFERROR(CHOOSE(MATCH(MOD(E46,360),{0,90,180,270},0),K46,J46,I46,L46),\"\"))","v":0},{"$f":"IF(D46=\"\",\"\",IFERROR(CHOOSE(MATCH(MOD(E46,360),{0,90,180,270},0),L46,K46,J46,I46),\"\"))","v":1}]
[6,3,"R6C3",{"$f":"INDEX(BOARD_GRID!$B$5:$H$11,A47+1,B47+1)","v":"M03"},{"$f":"INDEX(BOARD_GRID!$B$14:$H$20,A47+1,B47+1)","v":0},{"$f":"IF(D47=\"\",\"\",INDEX(TILES!$C:$C,MATCH(D47,TILES!$A:$A,0)))","v":"NO"},{"$f":"IF(D47=\"\",\"\",INDEX(TILES!$B:$B,MATCH(D47,TILES!$A:$A,0)))","v":"CORNER"},{"$f":"IF(D47=\"\",\"\",INDEX(TILES!$D:$D,MATCH(D47,TILES!$A:$A,0)))","v":"CAT"},{"$f":"IF(D47=\"\",\"\",INDEX(TILES!$E:$E,MATCH(D47,TILES!$A:$A,0)))","v":1},{"$f":"IF(D47=\"\",\"\",INDEX(TILES!$F:$F,MATCH(D47,TILES!$A:$A,0)))","v":1},{"$f":"IF(D47=\"\",\"\",INDEX(TILES!$G:$G,MATCH(D47,TILES!$A:$A,0)))","v":0},{"$f":"IF(D47=\"\",\"\",INDEX(TILES!$H:$H,MATCH(D47,TILES!$A:$A,0)))","v":0},{"$f":"IF(D47=\"\",\"\",IFERROR(CHOOSE(MATCH(MOD(E47,360),{0,90,180,270},0),I47,L47,K47,J47),\"\"))","v":1},{"$f":"IF(D47=\"\",\"\",IFERROR(CHOOSE(MATCH(MOD(E47,360),{0,90,180,270},0),J47,I47,L47,K47),\"\"))","v":1},{"$f":"IF(D47=\"\",\"\",IFERROR(CHOOSE(MATCH(MOD(E47,360),{0,90,180,270},0),K47,J47,I47,L47),\"\"))","v":0},{"$f":"IF(D47=\"\",\"\",IFERROR(CHOOSE(MATCH(MOD(E47,360),{0,90,180,270},0),L47,K47,J47,I47),\"\"))","v":0}]
[6,4,"R6C4",{"$f":"INDEX(BOARD_GRID!$B$5:$H$11,A48+1,B48+1)","v":"F16"},{"$f":"INDEX(BOARD_GRID!$B$14:$H$20,A48+1,B48+1)","v":0},{"$f":"IF(D48=\"\",\"\",INDEX(TILES!$C:$C,MATCH(D48,TILES!$A:$A,0)))","v":"YES"},{"$f":"IF(D48=\"\",\"\",INDEX(TILES!$B:$B,MATCH(D48,TILES!$A:$A,0)))","v":"T_JUNCTION"},{"$f":"IF(D48=\"\",\"\",INDEX(TILES!$D:$D,MATCH(D48,TILES!$A:$A,0)))","v":"ARMOR"},{"$f":"IF(D48=\"\",\"\",INDEX(TILES!$E:$E,MATCH(D48,TILES!$A:$A,0)))","v":1},{"$f":"IF(D48=\"\",\"\",INDEX(TILES!$F:$F,MATCH(D48,TILES!$A:$A,0)))","v":1},{"$f":"IF(D48=\"\",\"\",INDEX(TILES!$G:$G,MATCH(D48,TILES!$A:$A,0)))","v":0},{"$f":"IF(D48=\"\",\"\",INDEX(TILES!$H:$H,MATCH(D48,TILES!$A:$A,0)))","v":1},{"$f":"IF(D48=\"\",\"\",IFERROR(CHOOSE(MATCH(MOD(E48,360),{0,90,180,270},0),I48,L48,K48,J48),\"\"))","v":1},{"$f":"IF(D48=\"\",\"\",IFERROR(CHOOSE(MATCH(MOD(E48,360),{0,90,180,270},0),J48,I48,L48,K48),\"\"))","v":1},{"$f":"IF(D48=\"\",\"\",IFERROR(CHOOSE(MATCH(MOD(E48,360),{0,90,180,270},0),K48,J48,I48,L48),\"\"))","v":0},{"$f":"IF(D48=\"\",\"\",IFERROR(CHOOSE(MATCH(MOD(E48,360),{0,90,180,270},0),L48,K48,J48,I48),\"\"))","v":1}]
[6,5,"R6C5",{"$f":"INDEX(BOARD_GRID!$B$5:$H$11,A49+1,B49+1)","v":"M14"},{"$f":"INDEX(BOARD_GRID!$B$14:$H$20,A49+1,B49+1)","v":0},{"$f":"IF(D49=\"\",\"\",INDEX(TILES!$C:$C,MATCH(D49,TILES!$A:$A,0)))","v":"NO"},{"$f":"IF(D49=\"\",\"\",INDEX(TILES!$B:$B,MATCH(D49,TILES!$A:$A,0)))","v":"CORNER"},{"$f":"IF(D49=\"\",\"\",INDEX(TILES!$D:$D,MATCH(D49,TILES!$A:$A,0)))","v":0},{"$f":"IF(D49=\"\",\"\",INDEX(TILES!$E:$E,MATCH(D49,TILES!$A:$A,0)))","v":1},{"$f":"IF(D49=\"\",\"\",INDEX(TILES!$F:$F,MATCH(D49,TILES!$A:$A,0)))","v":1},{"$f":"IF(D49=\"\",\"\",INDEX(TILES!$G:$G,MATCH(D49,TILES!$A:$A,0)))","v":0},{"$f":"IF(D49=\"\",\"\",INDEX(TILES!$H:$H,MATCH(D49,TILES!$A:$A,0)))","v":0},{"$f":"IF(D49=\"\",\"\",IFERROR(CHOOSE(MATCH(MOD(E49,360),{0,90,180,270},0),I49,L49,K49,J49),\"\"))","v":1},{"$f":"IF(D49=\"\",\"\",IFERROR(CHOOSE(MATCH(MOD(E49,360),{0,90,180,270},0),J49,I49,L49,K49),\"\"))","v":1},{"$f":"IF(D49=\"\",\"\",IFERROR(CHOOSE(MATCH(MOD(E49,360),{0,90,180,270},0),K49,J49,I49,L49),\"\"))","v":0},{"$f":"IF(D49=\"\",\"\",IFERROR(CHOOSE(MATCH(MOD(E49,360),{0,90,180,270},0),L49,K49,J49,I49),\"\"))","v":0}]
[6,6,"R6C6",{"$f":"INDEX(BOARD_GRID!$B$5:$H$11,A50+1,B50+1)","v":"F03"},{"$f":"INDEX(BOARD_GRID!$B$14:$H$20,A50+1,B50+1)","v":270},{"$f":"IF(D50=\"\",\"\",INDEX(TILES!$C:$C,MATCH(D50,TILES!$A:$A,0)))","v":"YES"},{"$f":"IF(D50=\"\",\"\",INDEX(TILES!$B:$B,MATCH(D50,TILES!$A:$A,0)))","v":"CORNER"},{"$f":"IF(D50=\"\",\"\",INDEX(TILES!$D:$D,MATCH(D50,TILES!$A:$A,0)))","v":0},{"$f":"IF(D50=\"\",\"\",INDEX(TILES!$E:$E,MATCH(D50,TILES!$A:$A,0)))","v":1},{"$f":"IF(D50=\"\",\"\",INDEX(TILES!$F:$F,MATCH(D50,TILES!$A:$A,0)))","v":1},{"$f":"IF(D50=\"\",\"\",INDEX(TILES!$G:$G,MATCH(D50,TILES!$A:$A,0)))","v":0},{"$f":"IF(D50=\"\",\"\",INDEX(TILES!$H:$H,MATCH(D50,TILES!$A:$A,0)))","v":0},{"$f":"IF(D50=\"\",\"\",IFERROR(CHOOSE(MATCH(MOD(E50,360),{0,90,180,270},0),I50,L50,K50,J50),\"\"))","v":1},{"$f":"IF(D50=\"\",\"\",IFERROR(CHOOSE(MATCH(MOD(E50,360),{0,90,180,270},0),J50,I50,L50,K50),\"\"))","v":0},{"$f":"IF(D50=\"\",\"\",IFERROR(CHOOSE(MATCH(MOD(E50,360),{0,90,180,270},0),K50,J50,I50,L50),\"\"))","v":0},{"$f":"IF(D50=\"\",\"\",IFERROR(CHOOSE(MATCH(MOD(E50,360),{0,90,180,270},0),L50,K50,J50,I50),\"\"))","v":1}]

{"sheet":"BOARD_EDGE_VIEW","index":3,"n_rows":28,"n_cols":31,"rows_kept":28,"cut":false,"hidden":false,"merged":[]}
[null,"BOARD_EDGE_VIEW (from BOARD_TABLE OpenN/E/S/W)"]
[null,null,{"$f":"IF(INDEX(BOARD_GRID!$B$5:$H$11,1,1)=\"\",\"\",IFERROR(INDEX(BOARD_TABLE!$M$2:$M$50,MATCH(\"R\"&0&\"C\"&0,BOARD_TABLE!$C$2:$C$50,0)),\"\"))","v":0},null,null,null,{"$f":"IF(INDEX(BOARD_GRID!$B$5:$H$11,1,2)=\"\",\"\",IFERROR(INDEX(BOARD_TABLE!$M$2:$M$50,MATCH(\"R\"&0&\"C\"&1,BOARD_TABLE!$C$2:$C$50,0)),\"\"))","v":1},null,null,null,{"$f":"IF(INDEX(BOARD_GRID!$B$5:$H$11,1,3)=\"\",\"\",IFERROR(INDEX(BOARD_TABLE!$M$2:$M$50,MATCH(\"R\"&0&\"C\"&2,BOARD_TABLE!$C$2:$C$50,0)),\"\"))","v":0},null,null,null,{"$f":"IF(INDEX(BOARD_GRID!$B$5:$H$11,1,4)=\"\",\"\",IFERROR(INDEX(BOARD_TABLE!$M$2:$M$50,MATCH(\"R\"&0&\"C\"&3,BOARD_TABLE!$C$2:$C$50,0)),\"\"))","v":0},null,null,null,{"$f":"IF(INDEX(BOARD_GRID!$B$5:$H$11,1,5)=\"\",\"\",IFERROR(INDEX(BOARD_TABLE!$M$2:$M$50,MATCH(\"R\"&0&\"C\"&4,BOARD_TABLE!$C$2:$C$50,0)),\"\"))","v":0},null,null,null,{"$f":"IF(INDEX(BOARD_GRID!$B$5:$H$11,1,6)=\"\",\"\",IFERROR(INDEX(BOARD_TABLE!$M$2:$M$50,MATCH(\"R\"&0&\"C\"&5,BOARD_TABLE!$C$2:$C$50,0)),\"\"))","v":1},null,null,null,{"$f":"IF(INDEX(BOARD_GRID!$B$5:$H$11,1,7)=\"\",\"\",IFERROR(INDEX(BOARD_TABLE!$M$2:$M$50,MATCH(\"R\"&0&\"C\"&6,BOARD_TABLE!$C$2:$C$50,0)),\"\"))","v":0},null,null,null,"Legend"]
[null,{"$f":"IF(INDEX(BOARD_GRID!$B$5:$H$11,1,1)=\"\",\"\",IFERROR(INDEX(BOARD_TABLE!$P$2:$P$50,MATCH(\"R\"&0&\"C\"&0,BOARD_TABLE!$C$2:$C$50,0)),\"\"))","v":0},{"$f":"IF(INDEX(BOARD_GRID!$B$5:$H$11,1,1)=\"\",\"\",INDEX(BOARD_GRID!$B$5:$H$11,1,1)&\" / \"&INDEX(BOARD_GRID!$B$14:$H$20,1,1))","v":"F01 / 90"},{"$f":"IF(INDEX(BOARD_GRID!$B$5:$H$11,1,1)=\"\",\"\",IFERROR(INDEX(BOARD_TABLE!$N$2:$N$50,MATCH(\"R\"&0&\"C\"&0,BOARD_TABLE!$C$2:$C$50,0)),\"\"))","v":1},null,{"$f":"IF(INDEX(BOARD_GRID!$B$5:$H$11,1,2)=\"\",\"\",IFERROR(INDEX(BOARD_TABLE!$P$2:$P$50,MATCH(\"R\"&0&\"C\"&1,BOARD_TABLE!$C$2:$C$50,0)),\"\"))","v":0},{"$f":"IF(INDEX(BOARD_GRID!$B$5:$H$11,1,2)=\"\",\"\",INDEX(BOARD_GRID!$B$5:$H$11,1,2)&\" / \"&INDEX(BOARD_GRID!$B$14:$H$20,1,2))","v":"M29 / 180"},{"$f":"IF(INDEX(BOARD_GRID!$B$5:$H$11,1,2)=\"\",\"\",IFERROR(INDEX(BOARD_TABLE!$N$2:$N$50,MATCH(\"R\"&0&\"C\"&1,BOARD_TABLE!$C$2:$C$50,0)),\"\"))","v":0},null,{"$f":"IF(INDEX(BOARD_GRID!$B$5:$H$11,1,3)=\"\",\"\",IFERROR(INDEX(BOARD_TABLE!$P$2:$P$50,MATCH(\"R\"&0&\"C\"&2,BOARD_TABLE!$C$2:$C$50,0)),\"\"))","v":1},{"$f":"IF(INDEX(BOARD_GRID!$B$5:$H$11,1,3)=\"\",\"\",INDEX(BOARD_GRID!$B$5:$H$11,1,3)&\" / \"&INDEX(BOARD_GRID!$B$14:$H$20,1,3))","v":"F05 / 180"},{"$f":"IF(INDEX(BOARD_GRID!$B$5:$H$11,1,3)=\"\",\"\",IFERROR(INDEX(BOARD_TABLE!$N$2:$N$50,MATCH(\"R\"&0&\"C\"&2,BOARD_TABLE!$C$2:$C$50,0)),\"\"))","v":1},null,{"$f":"IF(INDEX(BOARD_GRID!$B$5:$H$11,1,4)=\"\",\"\",IFERROR(INDEX(BOARD_TABLE!$P$2:$P$50,MATCH(\"R\"&0&\"C\"&3,BOARD_TABLE!$C$2:$C$50,0)),\"\"))","v":1},{"$f":"IF(INDEX(BOARD_GRID!$B$5:$H$11,1,4)=\"\",\"\",INDEX(BOARD_GRID!$B$5:$H$11,1,4)&\" / \"&INDEX(BOARD_GRID!$B$14:$H$20,1,4))","v":"M11 / 180"},{"$f":"IF(INDEX(BOARD_GRID!$B$5:$H$11,1,4)=\"\",\"\",IFERROR(INDEX(BOARD_TABLE!$N$2:$N$50,MATCH(\"R\"&0&\"C\"&3,BOARD_TABLE!$C$2:$C$50,0)),\"\"))","v":1},null,{"$f":"IF(INDEX(BOARD_GRID!$B$5:$H$11,1,5)=\"\",\"\",IFERROR(INDEX(BOARD_TABLE!$P$2:$P$50,MATCH(\"R\"&0&\"C\"&4,BOARD_TABLE!$C$2:$C$50,0)),\"\"))","v":1},{"$f":"IF(INDEX(BOARD_GRID!$B$5:$H$11,1,5)=\"\",\"\",INDEX(BOARD_GRID!$B$5:$H$11,1,5)&\" / \"&INDEX(BOARD_GRID!$B$14:$H$20,1,5))","v":"F06 / 180"},{"$f":"IF(INDEX(BOARD_GRID!$B$5:$H$11,1,5)=\"\",\"\",IFERROR(INDEX(BOARD_TABLE!$N$2:$N$50,MATCH(\"R\"&0&\"C\"&4,BOARD_TABLE!$C$2:$C$50,0)),\"\"))","v":1},null,{"$f":"IF(INDEX(BOARD_GRID!$B$5:$H$11,1,6)=\"\",\"\",IFERROR(INDEX(BOARD_TABLE!$P$2:$P$50,MATCH(\"R\"&0&\"C\"&5,BOARD_TABLE!$C$2:$C$50,0)),\"\"))","v":1},{"$f":"IF(INDEX(BOARD_GRID!$B$5:$H$11,1,6)=\"\",\"\",INDEX(BOARD_GRID!$B$5:$H$11,1,6)&\" / \"&INDEX(BOARD_GRID!$B$14:$H$20,1,6))","v":"M21 / 270"},{"$f":"IF(INDEX(BOARD_GRID!$B$5:$H$11,1,6)=\"\",\"\",IFERROR(INDEX(BOARD_TABLE!$N$2:$N$50,MATCH(\"R\"&0&\"C\"&5,BOARD_TABLE!$C$2:$C$50,0)),\"\"))","v":0},null,{"$f":"IF(INDEX(BOARD_GRID!$B$5:$H$11,1,7)=\"\",\"\",IFERROR(INDEX(BOARD_TABLE!$P$2:$P$50,MATCH(\"R\"&0&\"C\"&6,BOARD_TABLE!$C$2:$C$50,0)),\"\"))","v":1},{"$f":"IF(INDEX(BOARD_GRID!$B$5:$H$11,1,7)=\"\",\"\",INDEX(BOARD_GRID!$B$5:$H$11,1,7)&\" / \"&INDEX(BOARD_GRID!$B$14:$H$20,1,7))","v":"F02 / 180"},{"$f":"IF(INDEX(BOARD_GRID!$B$5:$H$11,1,7)=\"\",\"\",IFERROR(INDEX(BOARD_TABLE!$N$2:$N$50,MATCH(\"R\"&0&\"C\"&6,BOARD_TABLE!$C$2:$C$50,0)),\"\"))","v":0},null,null,"Center: TileID / Rotation"]
[null,null,{"$f":"IF(INDEX(BOARD_GRID!$B$5:$H$11,1,1)=\"\",\"\",IFERROR(INDEX(BOARD_TABLE!$O$2:$O$50,MATCH(\"R\"&0&\"C\"&0,BOARD_TABLE!$C$2:$C$50,0)),\"\"))","v":1},null,null,null,{"$f":"IF(INDEX(BOARD_GRID!$B$5:$H$11,1,2)=\"\",\"\",IFERROR(INDEX(BOARD_TABLE!$O$2:$O$50,MATCH(\"R\"&0&\"C\"&1,BOARD_TABLE!$C$2:$C$50,0)),\"\"))","v":1},null,null,null,{"$f":"IF(INDEX(BOARD_GRID!$B$5:$H$11,1,3)=\"\",\"\",IFERROR(INDEX(BOARD_TABLE!$O$2:$O$50,MATCH(\"R\"&0&\"C\"&2,BOARD_TABLE!$C$2:$C$50,0)),\"\"))","v":1},null,null,null,{"$f":"IF(INDEX(BOARD_GRID!$B$5:$H$11,1,4)=\"\",\"\",IFERROR(INDEX(BOARD_TABLE!$O$2:$O$50,MATCH(\"R\"&0&\"C\"&3,BOARD_TABLE!$C$2:$C$50,0)),\"\"))","v":1},null,null,null,{"$f":"IF(INDEX(BOARD_GRID!$B$5:$H$11,1,5)=\"\",\"\",IFERROR(INDEX(BOARD_TABLE!$O$2:$O$50,MATCH(\"R\"&0&\"C\"&4,BOARD_TABLE!$C$2:$C$50,0)),\"\"))","v":1},null,null,null,{"$f":"IF(INDEX(BOARD_GRID!$B$5:$H$11,1,6)=\"\",\"\",IFERROR(INDEX(BOARD_TABLE!$O$2:$O$50,MATCH(\"R\"&0&\"C\"&5,BOARD_TABLE!$C$2:$C$50,0)),\"\"))","v":0},null,null,null,{"$f":"IF(INDEX(BOARD_GRID!$B$5:$H$11,1,7)=\"\",\"\",IFERROR(INDEX(BOARD_TABLE!$O$2:$O$50,MATCH(\"R\"&0&\"C\"&6,BOARD_TABLE!$C$2:$C$50,0)),\"\"))","v":1},null,null,null,"Edges: OpenN/E/S/W (0/1)"]
[]
[null,null,{"$f":"IF(INDEX(BOARD_GRID!$B$5:$H$11,2,1)=\"\",\"\",IFERROR(INDEX(BOARD_TABLE!$M$2:$M$50,MATCH(\"R\"&1&\"C\"&0,BOARD_TABLE!$C$2:$C$50,0)),\"\"))","v":0},null,null,null,{"$f":"IF(INDEX(BOARD_GRID!$B$5:$H$11,2,2)=\"\",\"\",IFERROR(INDEX(BOARD_TABLE!$M$2:$M$50,MATCH(\"R\"&1&\"C\"&1,BOARD_TABLE!$C$2:$C$50,0)),\"\"))","v":1},null,null,null,{"$f":"IF(INDEX(BOARD_GRID!$B$5:$H$11,2,3)=\"\",\"\",IFERROR(INDEX(BOARD_TABLE!$M$2:$M$50,MATCH(\"R\"&1&\"C\"&2,BOARD_TABLE!$C$2:$C$50,0)),\"\"))","v":0},null,null,null,{"$f":"IF(INDEX(BOARD_GRID!$B$5:$H$11,2,4)=\"\",\"\",IFERROR(INDEX(BOARD_TABLE!$M$2:$M$50,MATCH(\"R\"&1&\"C\"&3,BOARD_TABLE!$C$2:$C$50,0)),\"\"))","v":0},null,null,null,{"$f":"IF(INDEX(BOARD_GRID!$B$5:$H$11,2,5)=\"\",\"\",IFERROR(INDEX(BOARD_TABLE!$M$2:$M$50,MATCH(\"R\"&1&\"C\"&4,BOARD_TABLE!$C$2:$C$50,0)),\"\"))","v":1},null,null,null,{"$f":"IF(INDEX(BOARD_GRID!$B$5:$H$11,2,6)=\"\",\"\",IFERROR(INDEX(BOARD_TABLE!$M$2:$M$50,MATCH(\"R\"&1&\"C\"&5,BOARD_TABLE!$C$2:$C$50,0)),\"\"))","v":1},null,null,null,{"$f":"IF(INDEX(BOARD_GRID!$B$5:$H$11,2,7)=\"\",\"\",IFERROR(INDEX(BOARD_TABLE!$M$2:$M$50,MATCH(\"R\"&1&\"C\"&6,BOARD_TABLE!$C$2:$C$50,0)),\"\"))","v":1}]
[null,{"$f":"IF(INDEX(BOARD_GRID!$B$5:$H$11,2,1)=\"\",\"\",IFERROR(INDEX(BOARD_TABLE!$P$2:$P$50,MATCH(\"R\"&1&\"C\"&0,BOARD_TABLE!$C$2:$C$50,0)),\"\"))","v":1},{"$f":"IF(INDEX(BOARD_GRID!$B$5:$H$11,2,1)=\"\",\"\",INDEX(BOARD_GRID!$B$5:$H$11,2,1)&\" / \"&INDEX(BOARD_GRID!$B$14:$H$20,2,1))","v":"M30 / 90"},{"$f":"IF(INDEX(BOARD_GRID!$B$5:$H$11,2,1)=\"\",\"\",IFERROR(INDEX(BOARD_TABLE!$N$2:$N$50,MATCH(\"R\"&1&\"C\"&0,BOARD_TABLE!$C$2:$C$50,0)),\"\"))","v":1},null,{"$f":"IF(INDEX(BOARD_GRID!$B$5:$H$11,2,2)=\"\",\"\",IFERROR(INDEX(BOARD_TABLE!$P$2:$P$50,MATCH(\"R\"&1&\"C\"&1,BOARD_TABLE!$C$2:$C$50,0)),\"\"))","v":1},{"$f":"IF(INDEX(BOARD_GRID!$B$5:$H$11,2,2)=\"\",\"\",INDEX(BOARD_GRID!$B$5:$H$11,2,2)&\" / \"&INDEX(BOARD_GRID!$B$14:$H$20,2,2))","v":"M01 / 270"},{"$f":"IF(INDEX(BOARD_GRID!$B$5:$H$11,2,2)=\"\",\"\",IFERROR(INDEX(BOARD_TABLE!$N$2:$N$50,MATCH(\"R\"&1&\"C\"&1,BOARD_TABLE!$C$2:$C$50,0)),\"\"))","v":0},null,{"$f":"IF(INDEX(BOARD_GRID!$B$5:$H$11,2,3)=\"\",\"\",IFERROR(INDEX(BOARD_TABLE!$P$2:$P$50,MATCH(\"R\"&1&\"C\"&2,BOARD_TABLE!$C$2:$C$50,0)),\"\"))","v":1},{"$f":"IF(INDEX(BOARD_GRID!$B$5:$H$11,2,3)=\"\",\"\",INDEX(BOARD_GRID!$B$5:$H$11,2,3)&\" / \"&INDEX(BOARD_GRID!$B$14:$H$20,2,3))","v":"M10 / 180"},{"$f":"IF(INDEX(BOARD_GRID!$B$5:$H$11,2,3)=\"\",\"\",IFERROR(INDEX(BOARD_TABLE!$N$2:$N$50,MATCH(\"R\"&1&\"C\"&2,BOARD_TABLE!$C$2:$C$50,0)),\"\"))","v":0},null,{"$f":"IF(INDEX(BOARD_GRID!$B$5:$H$11,2,4)=\"\",\"\",IFERROR(INDEX(BOARD_TABLE!$P$2:$P$50,MATCH(\"R\"&1&\"C\"&3,BOARD_TABLE!$C$2:$C$50,0)),\"\"))","v":1},{"$f":"IF(INDEX(BOARD_GRID!$B$5:$H$11,2,4)=\"\",\"\",INDEX(BOARD_GRID!$B$5:$H$11,2,4)&\" / \"&INDEX(BOARD_GRID!$B$14:$H$20,2,4))","v":"M23 / 90"},{"$f":"IF(INDEX(BOARD_GRID!$B$5:$H$11,2,4)=\"\",\"\",IFERROR(INDEX(BOARD_TABLE!$N$2:$N$50,MATCH(\"R\"&1&\"C\"&3,BOARD_TABLE!$C$2:$C$50,0)),\"\"))","v":1},null,{"$f":"IF(INDEX(BOARD_GRID!$B$5:$H$11,2,5)=\"\",\"\",IFERROR(INDEX(BOARD_TABLE!$P$2:$P$50,MATCH(\"R\"&1&\"C\"&4,BOARD_TABLE!$C$2:$C$50,0)),\"\"))","v":0},{"$f":"IF(INDEX(BOARD_GRID!$B$5:$H$11,2,5)=\"\",\"\",INDEX(BOARD_GRID!$B$5:$H$11,2,5)&\" / \"&INDEX(BOARD_GRID!$B$14:$H$20,2,5))","v":"M27 / 180"},{"$f":"IF(INDEX(BOARD_GRID!$B$5:$H$11,2,5)=\"\",\"\",IFERROR(INDEX(BOARD_TABLE!$N$2:$N$50,MATCH(\"R\"&1&\"C\"&4,BOARD_TABLE!$C$2:$C$50,0)),\"\"))","v":0},null,{"$f":"IF(INDEX(BOARD_GRID!$B$5:$H$11,2,6)=\"\",\"\",IFERROR(INDEX(BOARD_TABLE!$P$2:$P$50,MATCH(\"R\"&1&\"C\"&5,BOARD_TABLE!$C$2:$C$50,0)),\"\"))","v":0},{"$f":"IF(INDEX(BOARD_GRID!$B$5:$H$11,2,6)=\"\",\"\",INDEX(BOARD_GRID!$B$5:$H$11,2,6)&\" / \"&INDEX(BOARD_GRID!$B$14:$H$20,2,6))","v":"M24 / 180"},{"$f":"IF(INDEX(BOARD_GRID!$B$5:$H$11,2,6)=\"\",\"\",IFERROR(INDEX(BOARD_TABLE!$N$2:$N$50,MATCH(\"R\"&1&\"C\"&5,BOARD_TABLE!$C$2:$C$50,0)),\"\"))","v":0},null,{"$f":"IF(INDEX(BOARD_GRID!$B$5:$H$11,2,7)=\"\",\"\",IFERROR(INDEX(BOARD_TABLE!$P$2:$P$50,MATCH(\"R\"&1&\"C\"&6,BOARD_TABLE!$C$2:$C$50,0)),\"\"))","v":1},{"$f":"IF(INDEX(BOARD_GRID!$B$5:$H$11,2,7)=\"\",\"\",INDEX(BOARD_GRID!$B$5:$H$11,2,7)&\" / \"&INDEX(BOARD_GRID!$B$14:$H$20,2,7))","v":"M04 / 270"},{"$f":"IF(INDEX(BOARD_GRID!$B$5:$H$11,2,7)=\"\",\"\",IFERROR(INDEX(BOARD_TABLE!$N$2:$N$50,MATCH(\"R\"&1&\"C\"&6,BOARD_TABLE!$C$2:$C$50,0)),\"\"))","v":0}]
[null,null,{"$f":"IF(INDEX(BOARD_GRID!$B$5:$H$11,2,1)=\"\",\"\",IFERROR(INDEX(BOARD_TABLE!$O$2:$O$50,MATCH(\"R\"&1&\"C\"&0,BOARD_TABLE!$C$2:$C$50,0)),\"\"))","v":0},null,null,null,{"$f":"IF(INDEX(BOARD_GRID!$B$5:$H$11,2,2)=\"\",\"\",IFERROR(INDEX(BOARD_TABLE!$O$2:$O$50,MATCH(\"R\"&1&\"C\"&1,BOARD_TABLE!$C$2:$C$50,0)),\"\"))","v":1},null,null,null,{"$f":"IF(INDEX(BOARD_GRID!$B$5:$H$11,2,3)=\"\",\"\",IFERROR(INDEX(BOARD_TABLE!$O$2:$O$50,MATCH(\"R\"&1&\"C\"&2,BOARD_TABLE!$C$2:$C$50,0)),\"\"))","v":1},null,null,null,{"$f":"IF(INDEX(BOARD_GRID!$B$5:$H$11,2,4)=\"\",\"\",IFERROR(INDEX(BOARD_TABLE!$O$2:$O$50,MATCH(\"R\"&1&\"C\"&3,BOARD_TABLE!$C$2:$C$50,0)),\"\"))","v":0},null,null,null,{"$f":"IF(INDEX(BOARD_GRID!$B$5:$H$11,2,5)=\"\",\"\",IFERROR(INDEX(BOARD_TABLE!$O$2:$O$50,MATCH(\"R\"&1&\"C\"&4,BOARD_TABLE!$C$2:$C$50,0)),\"\"))","v":1},null,null,null,{"$f":"IF(INDEX(BOARD_GRID!$B$5:$H$11,2,6)=\"\",\"\",IFERROR(INDEX(BOARD_TABLE!$O$2:$O$50,MATCH(\"R\"&1&\"C\"&5,BOARD_TABLE!$C$2:$C$50,0)),\"\"))","v":1},null,null,null,{"$f":"IF(INDEX(BOARD_GRID!$B$5:$H$11,2,7)=\"\",\"\",IFERROR(INDEX(BOARD_TABLE!$O$2:$O$50,MATCH(\"R\"&1&\"C\"&6,BOARD_TABLE!$C$2:$C$50,0)),\"\"))","v":1}]
[]
[null,null,{"$f":"IF(INDEX(BOARD_GRID!$B$5:$H$11,3,1)=\"\",\"\",IFERROR(INDEX(BOARD_TABLE!$M$2:$M$50,MATCH(\"R\"&2&\"C\"&0,BOARD_TABLE!$C$2:$C$50,0)),\"\"))","v":1},null,null,null,{"$f":"IF(INDEX(BOARD_GRID!$B$5:$H$11,3,2)=\"\",\"\",IFERROR(INDEX(BOARD_TABLE!$M$2:$M$50,MATCH(\"R\"&2&\"C\"&1,BOARD_TABLE!$C$2:$C$50,0)),\"\"))","v":0},null,null,null,{"$f":"IF(INDEX(BOARD_GRID!$B$5:$H$11,3,3)=\"\",\"\",IFERROR(INDEX(BOARD_TABLE!$M$2:$M$50,MATCH(\"R\"&2&\"C\"&2,BOARD_TABLE!$C$2:$C$50,0)),\"\"))","v":1},null,null,null,{"$f":"IF(INDEX(BOARD_GRID!$B$5:$H$11,3,4)=\"\",\"\",IFERROR(INDEX(BOARD_TABLE!$M$2:$M$50,MATCH(\"R\"&2&\"C\"&3,BOARD_TABLE!$C$2:$C$50,0)),\"\"))","v":0},null,null,null,{"$f":"IF(INDEX(BOARD_GRID!$B$5:$H$11,3,5)=\"\",\"\",IFERROR(INDEX(BOARD_TABLE!$M$2:$M$50,MATCH(\"R\"&2&\"C\"&4,BOARD_TABLE!$C$2:$C$50,0)),\"\"))","v":0},null,null,null,{"$f":"IF(INDEX(BOARD_GRID!$B$5:$H$11,3,6)=\"\",\"\",IFERROR(INDEX(BOARD_TABLE!$M$2:$M$50,MATCH(\"R\"&2&\"C\"&5,BOARD_TABLE!$C$2:$C$50,0)),\"\"))","v":1},null,null,null,{"$f":"IF(INDEX(BOARD_GRID!$B$5:$H$11,3,7)=\"\",\"\",IFERROR(INDEX(BOARD_TABLE!$M$2:$M$50,MATCH(\"R\"&2&\"C\"&6,BOARD_TABLE!$C$2:$C$50,0)),\"\"))","v":1}]
[null,{"$f":"IF(INDEX(BOARD_GRID!$B$5:$H$11,3,1)=\"\",\"\",IFERROR(INDEX(BOARD_TABLE!$P$2:$P$50,MATCH(\"R\"&2&\"C\"&0,BOARD_TABLE!$C$2:$C$50,0)),\"\"))","v":0},{"$f":"IF(INDEX(BOARD_GRID!$B$5:$H$11,3,1)=\"\",\"\",INDEX(BOARD_GRID!$B$5:$H$11,3,1)&\" / \"&INDEX(BOARD_GRID!$B$14:$H$20,3,1))","v":"F07 / 90"},{"$f":"IF(INDEX(BOARD_GRID!$B$5:$H$11,3,1)=\"\",\"\",IFERROR(INDEX(BOARD_TABLE!$N$2:$N$50,MATCH(\"R\"&2&\"C\"&0,BOARD_TABLE!$C$2:$C$50,0)),\"\"))","v":1},null,{"$f":"IF(INDEX(BOARD_GRID!$B$5:$H$11,3,2)=\"\",\"\",IFERROR(INDEX(BOARD_TABLE!$P$2:$P$50,MATCH(\"R\"&2&\"C\"&1,BOARD_TABLE!$C$2:$C$50,0)),\"\"))","v":1},{"$f":"IF(INDEX(BOARD_GRID!$B$5:$H$11,3,2)=\"\",\"\",INDEX(BOARD_GRID!$B$5:$H$11,3,2)&\" / \"&INDEX(BOARD_GRID!$B$14:$H$20,3,2))","v":"M31 / 270"},{"$f":"IF(INDEX(BOARD_GRID!$B$5:$H$11,3,2)=\"\",\"\",IFERROR(INDEX(BOARD_TABLE!$N$2:$N$50,MATCH(\"R\"&2&\"C\"&1,BOARD_TABLE!$C$2:$C$50,0)),\"\"))","v":1},null,{"$f":"IF(INDEX(BOARD_GRID!$B$5:$H$11,3,3)=\"\",\"\",IFERROR(INDEX(BOARD_TABLE!$P$2:$P$50,MATCH(\"R\"&2&\"C\"&2,BOARD_TABLE!$C$2:$C$50,0)),\"\"))","v":0},{"$f":"IF(INDEX(BOARD_GRID!$B$5:$H$11,3,3)=\"\",\"\",INDEX(BOARD_GRID!$B$5:$H$11,3,3)&\" / \"&INDEX(BOARD_GRID!$B$14:$H$20,3,3))","v":"F08 / 90"},{"$f":"IF(INDEX(BOARD_GRID!$B$5:$H$11,3,3)=\"\",\"\",IFERROR(INDEX(BOARD_TABLE!$N$2:$N$50,MATCH(\"R\"&2&\"C\"&2,BOARD_TABLE!$C$2:$C$50,0)),\"\"))","v":1},null,{"$f":"IF(INDEX(BOARD_GRID!$B$5:$H$11,3,4)=\"\",\"\",IFERROR(INDEX(BOARD_TABLE!$P$2:$P$50,MATCH(\"R\"&2&\"C\"&3,BOARD_TABLE!$C$2:$C$50,0)),\"\"))","v":1},{"$f":"IF(INDEX(BOARD_GRID!$B$5:$H$11,3,4)=\"\",\"\",INDEX(BOARD_GRID!$B$5:$H$11,3,4)&\" / \"&INDEX(BOARD_GRID!$B$14:$H$20,3,4))","v":"M32 / 90"},{"$f":"IF(INDEX(BOARD_GRID!$B$5:$H$11,3,4)=\"\",\"\",IFERROR(INDEX(BOARD_TABLE!$N$2:$N$50,MATCH(\"R\"&2&\"C\"&3,BOARD_TABLE!$C$2:$C$50,0)),\"\"))","v":1},null,{"$f":"IF(INDEX(BOARD_GRID!$B$5:$H$11,3,5)=\"\",\"\",IFERROR(INDEX(BOARD_TABLE!$P$2:$P$50,MATCH(\"R\"&2&\"C\"&4,BOARD_TABLE!$C$2:$C$50,0)),\"\"))","v":1},{"$f":"IF(INDEX(BOARD_GRID!$B$5:$H$11,3,5)=\"\",\"\",INDEX(BOARD_GRID!$B$5:$H$11,3,5)&\" / \"&INDEX(BOARD_GRID!$B$14:$H$20,3,5))","v":"F09 / 180"},{"$f":"IF(INDEX(BOARD_GRID!$B$5:$H$11,3,5)=\"\",\"\",IFERROR(INDEX(BOARD_TABLE!$N$2:$N$50,MATCH(\"R\"&2&\"C\"&4,BOARD_TABLE!$C$2:$C$50,0)),\"\"))","v":1},null,{"$f":"IF(INDEX(BOARD_GRID!$B$5:$H$11,3,6)=\"\",\"\",IFERROR(INDEX(BOARD_TABLE!$P$2:$P$50,MATCH(\"R\"&2&\"C\"&5,BOARD_TABLE!$C$2:$C$50,0)),\"\"))","v":0},{"$f":"IF(INDEX(BOARD_GRID!$B$5:$H$11,3,6)=\"\",\"\",INDEX(BOARD_GRID!$B$5:$H$11,3,6)&\" / \"&INDEX(BOARD_GRID!$B$14:$H$20,3,6))","v":"M13 / 0"},{"$f":"IF(INDEX(BOARD_GRID!$B$5:$H$11,3,6)=\"\",\"\",IFERROR(INDEX(BOARD_TABLE!$N$2:$N$50,MATCH(\"R\"&2&\"C\"&5,BOARD_TABLE!$C$2:$C$50,0)),\"\"))","v":1},null,{"$f":"IF(INDEX(BOARD_GRID!$B$5:$H$11,3,7)=\"\",\"\",IFERROR(INDEX(BOARD_TABLE!$P$2:$P$50,MATCH(\"R\"&2&\"C\"&6,BOARD_TABLE!$C$2:$C$50,0)),\"\"))","v":1},{"$f":"IF(INDEX(BOARD_GRID!$B$5:$H$11,3,7)=\"\",\"\",INDEX(BOARD_GRID!$B$5:$H$11,3,7)&\" / \"&INDEX(BOARD_GRID!$B$14:$H$20,3,7))","v":"F10 / 270"},{"$f":"IF(INDEX(BOARD_GRID!$B$5:$H$11,3,7)=\"\",\"\",IFERROR(INDEX(BOARD_TABLE!$N$2:$N$50,MATCH(\"R\"&2&\"C\"&6,BOARD_TABLE!$C$2:$C$50,0)),\"\"))","v":0}]
[null,null,{"$f":"IF(INDEX(BOARD_GRID!$B$5:$H$11,3,1)=\"\",\"\",IFERROR(INDEX(BOARD_TABLE!$O$2:$O$50,MATCH(\"R\"&2&\"C\"&0,BOARD_TABLE!$C$2:$C$50,0)),\"\"))","v":1},null,null,null,{"$f":"IF(INDEX(BOARD_GRID!$B$5:$H$11,3,2)=\"\",\"\",IFERROR(INDEX(BOARD_TABLE!$O$2:$O$50,MATCH(\"R\"&2&\"C\"&1,BOARD_TABLE!$C$2:$C$50,0)),\"\"))","v":0},null,null,null,{"$f":"IF(INDEX(BOARD_GRID!$B$5:$H$11,3,3)=\"\",\"\",IFERROR(INDEX(BOARD_TABLE!$O$2:$O$50,MATCH(\"R\"&2&\"C\"&2,BOARD_TABLE!$C$2:$C$50,0)),\"\"))","v":1},null,null,null,{"$f":"IF(INDEX(BOARD_GRID!$B$5:$H$11,3,4)=\"\",\"\",IFERROR(INDEX(BOARD_TABLE!$O$2:$O$50,MATCH(\"R\"&2&\"C\"&3,BOARD_TABLE!$C$2:$C$50,0)),\"\"))","v":0},null,null,null,{"$f":"IF(INDEX(BOARD_GRID!$B$5:$H$11,3,5)=\"\",\"\",IFERROR(INDEX(BOARD_TABLE!$O$2:$O$50,MATCH(\"R\"&2&\"C\"&4,BOARD_TABLE!$C$2:$C$50,0)),\"\"))","v":1},null,null,null,{"$f":"IF(INDEX(BOARD_GRID!$B$5:$H$11,3,6)=\"\",\"\",IFERROR(INDEX(BOARD_TABLE!$O$2:$O$50,MATCH(\"R\"&2&\"C\"&5,BOARD_TABLE!$C$2:$C$50,0)),\"\"))","v":0},null,null,null,{"$f":"IF(INDEX(BOARD_GRID!$B$5:$H$11,3,7)=\"\",\"\",IFERROR(INDEX(BOARD_TABLE!$O$2:$O$50,MATCH(\"R\"&2&\"C\"&6,BOARD_TABLE!$C$2:$C$50,0)),\"\"))","v":1}]
[]
[null,null,{"$f":"IF(INDEX(BOARD_GRID!$B$5:$H$11,4,1)=\"\",\"\",IFERROR(INDEX(BOARD_TABLE!$M$2:$M$50,MATCH(\"R\"&3&\"C\"&0,BOARD_TABLE!$C$2:$C$50,0)),\"\"))","v":1},null,null,null,{"$f":"IF(INDEX(BOARD_GRID!$B$5:$H$11,4,2)=\"\",\"\",IFERROR(INDEX(BOARD_TABLE!$M$2:$M$50,MATCH(\"R\"&3&\"C\"&1,BOARD_TABLE!$C$2:$C$50,0)),\"\"))","v":0},null,null,null,{"$f":"IF(INDEX(BOARD_GRID!$B$5:$H$11,4,3)=\"\",\"\",IFERROR(INDEX(BOARD_TABLE!$M$2:$M$50,MATCH(\"R\"&3&\"C\"&2,BOARD_TABLE!$C$2:$C$50,0)),\"\"))","v":1},null,null,null,{"$f":"IF(INDEX(BOARD_GRID!$B$5:$H$11,4,4)=\"\",\"\",IFERROR(INDEX(BOARD_TABLE!$M$2:$M$50,MATCH(\"R\"&3&\"C\"&3,BOARD_TABLE!$C$2:$C$50,0)),\"\"))","v":1},null,null,null,{"$f":"IF(INDEX(BOARD_GRID!$B$5:$H$11,4,5)=\"\",\"\",IFERROR(INDEX(BOARD_TABLE!$M$2:$M$50,MATCH(\"R\"&3&\"C\"&4,BOARD_TABLE!$C$2:$C$50,0)),\"\"))","v":0},null,null,null,{"$f":"IF(INDEX(BOARD_GRID!$B$5:$H$11,4,6)=\"\",\"\",IFERROR(INDEX(BOARD_TABLE!$M$2:$M$50,MATCH(\"R\"&3&\"C\"&5,BOARD_TABLE!$C$2:$C$50,0)),\"\"))","v":1},null,null,null,{"$f":"IF(INDEX(BOARD_GRID!$B$5:$H$11,4,7)=\"\",\"\",IFERROR(INDEX(BOARD_TABLE!$M$2:$M$50,MATCH(\"R\"&3&\"C\"&6,BOARD_TABLE!$C$2:$C$50,0)),\"\"))","v":1}]
[null,{"$f":"IF(INDEX(BOARD_GRID!$B$5:$H$11,4,1)=\"\",\"\",IFERROR(INDEX(BOARD_TABLE!$P$2:$P$50,MATCH(\"R\"&3&\"C\"&0,BOARD_TABLE!$C$2:$C$50,0)),\"\"))","v":0},{"$f":"IF(INDEX(BOARD_GRID!$B$5:$H$11,4,1)=\"\",\"\",INDEX(BOARD_GRID!$B$5:$H$11,4,1)&\" / \"&INDEX(BOARD_GRID!$B$14:$H$20,4,1))","v":"M19 / 0"},{"$f":"IF(INDEX(BOARD_GRID!$B$5:$H$11,4,1)=\"\",\"\",IFERROR(INDEX(BOARD_TABLE!$N$2:$N$50,MATCH(\"R\"&3&\"C\"&0,BOARD_TABLE!$C$2:$C$50,0)),\"\"))","v":1},null,{"$f":"IF(INDEX(BOARD_GRID!$B$5:$H$11,4,2)=\"\",\"\",IFERROR(INDEX(BOARD_TABLE!$P$2:$P$50,MATCH(\"R\"&3&\"C\"&1,BOARD_TABLE!$C$2:$C$50,0)),\"\"))","v":0},{"$f":"IF(INDEX(BOARD_GRID!$B$5:$H$11,4,2)=\"\",\"\",INDEX(BOARD_GRID!$B$5:$H$11,4,2)&\" / \"&INDEX(BOARD_GRID!$B$14:$H$20,4,2))","v":"M07 / 90"},{"$f":"IF(INDEX(BOARD_GRID!$B$5:$H$11,4,2)=\"\",\"\",IFERROR(INDEX(BOARD_TABLE!$N$2:$N$50,MATCH(\"R\"&3&\"C\"&1,BOARD_TABLE!$C$2:$C$50,0)),\"\"))","v":1},null,{"$f":"IF(INDEX(BOARD_GRID!$B$5:$H$11,4,3)=\"\",\"\",IFERROR(INDEX(BOARD_TABLE!$P$2:$P$50,MATCH(\"R\"&3&\"C\"&2,BOARD_TABLE!$C$2:$C$50,0)),\"\"))","v":0},{"$f":"IF(INDEX(BOARD_GRID!$B$5:$H$11,4,3)=\"\",\"\",INDEX(BOARD_GRID!$B$5:$H$11,4,3)&\" / \"&INDEX(BOARD_GRID!$B$14:$H$20,4,3))","v":"M25 / 0"},{"$f":"IF(INDEX(BOARD_GRID!$B$5:$H$11,4,3)=\"\",\"\",IFERROR(INDEX(BOARD_TABLE!$N$2:$N$50,MATCH(\"R\"&3&\"C\"&2,BOARD_TABLE!$C$2:$C$50,0)),\"\"))","v":0},null,{"$f":"IF(INDEX(BOARD_GRID!$B$5:$H$11,4,4)=\"\",\"\",IFERROR(INDEX(BOARD_TABLE!$P$2:$P$50,MATCH(\"R\"&3&\"C\"&3,BOARD_TABLE!$C$2:$C$50,0)),\"\"))","v":1},{"$f":"IF(INDEX(BOARD_GRID!$B$5:$H$11,4,4)=\"\",\"\",INDEX(BOARD_GRID!$B$5:$H$11,4,4)&\" / \"&INDEX(BOARD_GRID!$B$14:$H$20,4,4))","v":"M16 / 270"},{"$f":"IF(INDEX(BOARD_GRID!$B$5:$H$11,4,4)=\"\",\"\",IFERROR(INDEX(BOARD_TABLE!$N$2:$N$50,MATCH(\"R\"&3&\"C\"&3,BOARD_TABLE!$C$2:$C$50,0)),\"\"))","v":0},null,{"$f":"IF(INDEX(BOARD_GRID!$B$5:$H$11,4,5)=\"\",\"\",IFERROR(INDEX(BOARD_TABLE!$P$2:$P$50,MATCH(\"R\"&3&\"C\"&4,BOARD_TABLE!$C$2:$C$50,0)),\"\"))","v":1},{"$f":"IF(INDEX(BOARD_GRID!$B$5:$H$11,4,5)=\"\",\"\",INDEX(BOARD_GRID!$B$5:$H$11,4,5)&\" / \"&INDEX(BOARD_GRID!$B$14:$H$20,4,5))","v":"M33 / 90"},{"$f":"IF(INDEX(BOARD_GRID!$B$5:$H$11,4,5)=\"\",\"\",IFERROR(INDEX(BOARD_TABLE!$N$2:$N$50,MATCH(\"R\"&3&\"C\"&4,BOARD_TABLE!$C$2:$C$50,0)),\"\"))","v":1},null,{"$f":"IF(INDEX(BOARD_GRID!$B$5:$H$11,4,6)=\"\",\"\",IFERROR(INDEX(BOARD_TABLE!$P$2:$P$50,MATCH(\"R\"&3&\"C\"&5,BOARD_TABLE!$C$2:$C$50,0)),\"\"))","v":1},{"$f":"IF(INDEX(BOARD_GRID!$B$5:$H$11,4,6)=\"\",\"\",INDEX(BOARD_GRID!$B$5:$H$11,4,6)&\" / \"&INDEX(BOARD_GRID!$B$14:$H$20,4,6))","v":"M15 / 270"},{"$f":"IF(INDEX(BOARD_GRID!$B$5:$H$11,4,6)=\"\",\"\",IFERROR(INDEX(BOARD_TABLE!$N$2:$N$50,MATCH(\"R\"&3&\"C\"&5,BOARD_TABLE!$C$2:$C$50,0)),\"\"))","v":0},null,{"$f":"IF(INDEX(BOARD_GRID!$B$5:$H$11,4,7)=\"\",\"\",IFERROR(INDEX(BOARD_TABLE!$P$2:$P$50,MATCH(\"R\"&3&\"C\"&6,BOARD_TABLE!$C$2:$C$50,0)),\"\"))","v":0},{"$f":"IF(INDEX(BOARD_GRID!$B$5:$H$11,4,7)=\"\",\"\",INDEX(BOARD_GRID!$B$5:$H$11,4,7)&\" / \"&INDEX(BOARD_GRID!$B$14:$H$20,4,7))","v":"M22 / 0"},{"$f":"IF(INDEX(BOARD_GRID!$B$5:$H$11,4,7)=\"\",\"\",IFERROR(INDEX(BOARD_TABLE!$N$2:$N$50,MATCH(\"R\"&3&\"C\"&6,BOARD_TABLE!$C$2:$C$50,0)),\"\"))","v":0}]
[null,null,{"$f":"IF(INDEX(BOARD_GRID!$B$5:$H$11,4,1)=\"\",\"\",IFERROR(INDEX(BOARD_TABLE!$O$2:$O$50,MATCH(\"R\"&3&\"C\"&0,BOARD_TABLE!$C$2:$C$50,0)),\"\"))","v":0},null,null,null,{"$f":"IF(INDEX(BOARD_GRID!$B$5:$H$11,4,2)=\"\",\"\",IFERROR(INDEX(BOARD_TABLE!$O$2:$O$50,MATCH(\"R\"&3&\"C\"&1,BOARD_TABLE!$C$2:$C$50,0)),\"\"))","v":1},null,null,null,{"$f":"IF(INDEX(BOARD_GRID!$B$5:$H$11,4,3)=\"\",\"\",IFERROR(INDEX(BOARD_TABLE!$O$2:$O$50,MATCH(\"R\"&3&\"C\"&2,BOARD_TABLE!$C$2:$C$50,0)),\"\"))","v":1},null,null,null,{"$f":"IF(INDEX(BOARD_GRID!$B$5:$H$11,4,4)=\"\",\"\",IFERROR(INDEX(BOARD_TABLE!$O$2:$O$50,MATCH(\"R\"&3&\"C\"&3,BOARD_TABLE!$C$2:$C$50,0)),\"\"))","v":0},null,null,null,{"$f":"IF(INDEX(BOARD_GRID!$B$5:$H$11,4,5)=\"\",\"\",IFERROR(INDEX(BOARD_TABLE!$O$2:$O$50,MATCH(\"R\"&3&\"C\"&4,BOARD_TABLE!$C$2:$C$50,0)),\"\"))","v":0},null,null,null,{"$f":"IF(INDEX(BOARD_GRID!$B$5:$H$11,4,6)=\"\",\"\",IFERROR(INDEX(BOARD_TABLE!$O$2:$O$50,MATCH(\"R\"&3&\"C\"&5,BOARD_TABLE!$C$2:$C$50,0)),\"\"))","v":0},null,null,null,{"$f":"IF(INDEX(BOARD_GRID!$B$5:$H$11,4,7)=\"\",\"\",IFERROR(INDEX(BOARD_TABLE!$O$2:$O$50,MATCH(\"R\"&3&\"C\"&6,BOARD_TABLE!$C$2:$C$50,0)),\"\"))","v":1}]
[]
[null,null,{"$f":"IF(INDEX(BOARD_GRID!$B$5:$H$11,5,1)=\"\",\"\",IFERROR(INDEX(BOARD_TABLE!$M$2:$M$50,MATCH(\"R\"&4&\"C\"&0,BOARD_TABLE!$C$2:$C$50,0)),\"\"))","v":1},null,null,null,{"$f":"IF(INDEX(BOARD_GRID!$B$5:$H$11,5,2)=\"\",\"\",IFERROR(INDEX(BOARD_TABLE!$M$2:$M$50,MATCH(\"R\"&4&\"C\"&1,BOARD_TABLE!$C$2:$C$50,0)),\"\"))","v":0},null,null,null,{"$f":"IF(INDEX(BOARD_GRID!$B$5:$H$11,5,3)=\"\",\"\",IFERROR(INDEX(BOARD_TABLE!$M$2:$M$50,MATCH(\"R\"&4&\"C\"&2,BOARD_TABLE!$C$2:$C$50,0)),\"\"))","v":1},null,null,null,{"$f":"IF(INDEX(BOARD_GRID!$B$5:$H$11,5,4)=\"\",\"\",IFERROR(INDEX(BOARD_TABLE!$M$2:$M$50,MATCH(\"R\"&4&\"C\"&3,BOARD_TABLE!$C$2:$C$50,0)),\"\"))","v":0},null,null,null,{"$f":"IF(INDEX(BOARD_GRID!$B$5:$H$11,5,5)=\"\",\"\",IFERROR(INDEX(BOARD_TABLE!$M$2:$M$50,MATCH(\"R\"&4&\"C\"&4,BOARD_TABLE!$C$2:$C$50,0)),\"\"))","v":1},null,null,null,{"$f":"IF(INDEX(BOARD_GRID!$B$5:$H$11,5,6)=\"\",\"\",IFERROR(INDEX(BOARD_TABLE!$M$2:$M$50,MATCH(\"R\"&4&\"C\"&5,BOARD_TABLE!$C$2:$C$50,0)),\"\"))","v":1},null,null,null,{"$f":"IF(INDEX(BOARD_GRID!$B$5:$H$11,5,7)=\"\",\"\",IFERROR(INDEX(BOARD_TABLE!$M$2:$M$50,MATCH(\"R\"&4&\"C\"&6,BOARD_TABLE!$C$2:$C$50,0)),\"\"))","v":1}]
[null,{"$f":"IF(INDEX(BOARD_GRID!$B$5:$H$11,5,1)=\"\",\"\",IFERROR(INDEX(BOARD_TABLE!$P$2:$P$50,MATCH(\"R\"&4&\"C\"&0,BOARD_TABLE!$C$2:$C$50,0)),\"\"))","v":0},{"$f":"IF(INDEX(BOARD_GRID!$B$5:$H$11,5,1)=\"\",\"\",INDEX(BOARD_GRID!$B$5:$H$11,5,1)&\" / \"&INDEX(BOARD_GRID!$B$14:$H$20,5,1))","v":"F11 / 90"},{"$f":"IF(INDEX(BOARD_GRID!$B$5:$H$11,5,1)=\"\",\"\",IFERROR(INDEX(BOARD_TABLE!$N$2:$N$50,MATCH(\"R\"&4&\"C\"&0,BOARD_TABLE!$C$2:$C$50,0)),\"\"))","v":1},null,{"$f":"IF(INDEX(BOARD_GRID!$B$5:$H$11,5,2)=\"\",\"\",IFERROR(INDEX(BOARD_TABLE!$P$2:$P$50,MATCH(\"R\"&4&\"C\"&1,BOARD_TABLE!$C$2:$C$50,0)),\"\"))","v":0},{"$f":"IF(INDEX(BOARD_GRID!$B$5:$H$11,5,2)=\"\",\"\",INDEX(BOARD_GRID!$B$5:$H$11,5,2)&\" / \"&INDEX(BOARD_GRID!$B$14:$H$20,5,2))","v":"M02 / 90"},{"$f":"IF(INDEX(BOARD_GRID!$B$5:$H$11,5,2)=\"\",\"\",IFERROR(INDEX(BOARD_TABLE!$N$2:$N$50,MATCH(\"R\"&4&\"C\"&1,BOARD_TABLE!$C$2:$C$50,0)),\"\"))","v":1},null,{"$f":"IF(INDEX(BOARD_GRID!$B$5:$H$11,5,3)=\"\",\"\",IFERROR(INDEX(BOARD_TABLE!$P$2:$P$50,MATCH(\"R\"&4&\"C\"&2,BOARD_TABLE!$C$2:$C$50,0)),\"\"))","v":1},{"$f":"IF(INDEX(BOARD_GRID!$B$5:$H$11,5,3)=\"\",\"\",INDEX(BOARD_GRID!$B$5:$H$11,5,3)&\" / \"&INDEX(BOARD_GRID!$B$14:$H$20,5,3))","v":"F12 / 0"},{"$f":"IF(INDEX(BOARD_GRID!$B$5:$H$11,5,3)=\"\",\"\",IFERROR(INDEX(BOARD_TABLE!$N$2:$N$50,MATCH(\"R\"&4&\"C\"&2,BOARD_TABLE!$C$2:$C$50,0)),\"\"))","v":1},null,{"$f":"IF(INDEX(BOARD_GRID!$B$5:$H$11,5,4)=\"\",\"\",IFERROR(INDEX(BOARD_TABLE!$P$2:$P$50,MATCH(\"R\"&4&\"C\"&3,BOARD_TABLE!$C$2:$C$50,0)),\"\"))","v":0},{"$f":"IF(INDEX(BOARD_GRID!$B$5:$H$11,5,4)=\"\",\"\",INDEX(BOARD_GRID!$B$5:$H$11,5,4)&\" / \"&INDEX(BOARD_GRID!$B$14:$H$20,5,4))","v":"M20 / 90"},{"$f":"IF(INDEX(BOARD_GRID!$B$5:$H$11,5,4)=\"\",\"\",IFERROR(INDEX(BOARD_TABLE!$N$2:$N$50,MATCH(\"R\"&4&\"C\"&3,BOARD_TABLE!$C$2:$C$50,0)),\"\"))","v":1},null,{"$f":"IF(INDEX(BOARD_GRID!$B$5:$H$11,5,5)=\"\",\"\",IFERROR(INDEX(BOARD_TABLE!$P$2:$P$50,MATCH(\"R\"&4&\"C\"&4,BOARD_TABLE!$C$2:$C$50,0)),\"\"))","v":1},{"$f":"IF(INDEX(BOARD_GRID!$B$5:$H$11,5,5)=\"\",\"\",INDEX(BOARD_GRID!$B$5:$H$11,5,5)&\" / \"&INDEX(BOARD_GRID!$B$14:$H$20,5,5))","v":"F13 / 270"},{"$f":"IF(INDEX(BOARD_GRID!$B$5:$H$11,5,5)=\"\",\"\",IFERROR(INDEX(BOARD_TABLE!$N$2:$N$50,MATCH(\"R\"&4&\"C\"&4,BOARD_TABLE!$C$2:$C$50,0)),\"\"))","v":0},null,{"$f":"IF(INDEX(BOARD_GRID!$B$5:$H$11,5,6)=\"\",\"\",IFERROR(INDEX(BOARD_TABLE!$P$2:$P$50,MATCH(\"R\"&4&\"C\"&5,BOARD_TABLE!$C$2:$C$50,0)),\"\"))","v":1},{"$f":"IF(INDEX(BOARD_GRID!$B$5:$H$11,5,6)=\"\",\"\",INDEX(BOARD_GRID!$B$5:$H$11,5,6)&\" / \"&INDEX(BOARD_GRID!$B$14:$H$20,5,6))","v":"M17 / 270"},{"$f":"IF(INDEX(BOARD_GRID!$B$5:$H$11,5,6)=\"\",\"\",IFERROR(INDEX(BOARD_TABLE!$N$2:$N$50,MATCH(\"R\"&4&\"C\"&5,BOARD_TABLE!$C$2:$C$50,0)),\"\"))","v":0},null,{"$f":"IF(INDEX(BOARD_GRID!$B$5:$H$11,5,7)=\"\",\"\",IFERROR(INDEX(BOARD_TABLE!$P$2:$P$50,MATCH(\"R\"&4&\"C\"&6,BOARD_TABLE!$C$2:$C$50,0)),\"\"))","v":1},{"$f":"IF(INDEX(BOARD_GRID!$B$5:$H$11,5,7)=\"\",\"\",INDEX(BOARD_GRID!$B$5:$H$11,5,7)&\" / \"&INDEX(BOARD_GRID!$B$14:$H$20,5,7))","v":"F14 / 270"},{"$f":"IF(INDEX(BOARD_GRID!$B$5:$H$11,5,7)=\"\",\"\",IFERROR(INDEX(BOARD_TABLE!$N$2:$N$50,MATCH(\"R\"&4&\"C\"&6,BOARD_TABLE!$C$2:$C$50,0)),\"\"))","v":0}]
[null,null,{"$f":"IF(INDEX(BOARD_GRID!$B$5:$H$11,5,1)=\"\",\"\",IFERROR(INDEX(BOARD_TABLE!$O$2:$O$50,MATCH(\"R\"&4&\"C\"&0,BOARD_TABLE!$C$2:$C$50,0)),\"\"))","v":1},null,null,null,{"$f":"IF(INDEX(BOARD_GRID!$B$5:$H$11,5,2)=\"\",\"\",IFERROR(INDEX(BOARD_TABLE!$O$2:$O$50,MATCH(\"R\"&4&\"C\"&1,BOARD_TABLE!$C$2:$C$50,0)),\"\"))","v":1},null,null,null,{"$f":"IF(INDEX(BOARD_GRID!$B$5:$H$11,5,3)=\"\",\"\",IFERROR(INDEX(BOARD_TABLE!$O$2:$O$50,MATCH(\"R\"&4&\"C\"&2,BOARD_TABLE!$C$2:$C$50,0)),\"\"))","v":0},null,null,null,{"$f":"IF(INDEX(BOARD_GRID!$B$5:$H$11,5,4)=\"\",\"\",IFERROR(INDEX(BOARD_TABLE!$O$2:$O$50,MATCH(\"R\"&4&\"C\"&3,BOARD_TABLE!$C$2:$C$50,0)),\"\"))","v":1},null,null,null,{"$f":"IF(INDEX(BOARD_GRID!$B$5:$H$11,5,5)=\"\",\"\",IFERROR(INDEX(BOARD_TABLE!$O$2:$O$50,MATCH(\"R\"&4&\"C\"&4,BOARD_TABLE!$C$2:$C$50,0)),\"\"))","v":1},null,null,null,{"$f":"IF(INDEX(BOARD_GRID!$B$5:$H$11,5,6)=\"\",\"\",IFERROR(INDEX(BOARD_TABLE!$O$2:$O$50,MATCH(\"R\"&4&\"C\"&5,BOARD_TABLE!$C$2:$C$50,0)),\"\"))","v":0},null,null,null,{"$f":"IF(INDEX(BOARD_GRID!$B$5:$H$11,5,7)=\"\",\"\",IFERROR(INDEX(BOARD_TABLE!$O$2:$O$50,MATCH(\"R\"&4&\"C\"&6,BOARD_TABLE!$C$2:$C$50,0)),\"\"))","v":1}]
[]
[null,null,{"$f":"IF(INDEX(BOARD_GRID!$B$5:$H$11,6,1)=\"\",\"\",IFERROR(INDEX(BOARD_TABLE!$M$2:$M$50,MATCH(\"R\"&5&\"C\"&0,BOARD_TABLE!$C$2:$C$50,0)),\"\"))","v":1},null,null,null,{"$f":"IF(INDEX(BOARD_GRID!$B$5:$H$11,6,2)=\"\",\"\",IFERROR(INDEX(BOARD_TABLE!$M$2:$M$50,MATCH(\"R\"&5&\"C\"&1,BOARD_TABLE!$C$2:$C$50,0)),\"\"))","v":0},null,null,null,{"$f":"IF(INDEX(BOARD_GRID!$B$5:$H$11,6,3)=\"\",\"\",IFERROR(INDEX(BOARD_TABLE!$M$2:$M$50,MATCH(\"R\"&5&\"C\"&2,BOARD_TABLE!$C$2:$C$50,0)),\"\"))","v":1},null,null,null,{"$f":"IF(INDEX(BOARD_GRID!$B$5:$H$11,6,4)=\"\",\"\",IFERROR(INDEX(BOARD_TABLE!$M$2:$M$50,MATCH(\"R\"&5&\"C\"&3,BOARD_TABLE!$C$2:$C$50,0)),\"\"))","v":1},null,null,null,{"$f":"IF(INDEX(BOARD_GRID!$B$5:$H$11,6,5)=\"\",\"\",IFERROR(INDEX(BOARD_TABLE!$M$2:$M$50,MATCH(\"R\"&5&\"C\"&4,BOARD_TABLE!$C$2:$C$50,0)),\"\"))","v":0},null,null,null,{"$f":"IF(INDEX(BOARD_GRID!$B$5:$H$11,6,6)=\"\",\"\",IFERROR(INDEX(BOARD_TABLE!$M$2:$M$50,MATCH(\"R\"&5&\"C\"&5,BOARD_TABLE!$C$2:$C$50,0)),\"\"))","v":1},null,null,null,{"$f":"IF(INDEX(BOARD_GRID!$B$5:$H$11,6,7)=\"\",\"\",IFERROR(INDEX(BOARD_TABLE!$M$2:$M$50,MATCH(\"R\"&5&\"C\"&6,BOARD_TABLE!$C$2:$C$50,0)),\"\"))","v":1}]
[null,{"$f":"IF(INDEX(BOARD_GRID!$B$5:$H$11,6,1)=\"\",\"\",IFERROR(INDEX(BOARD_TABLE!$P$2:$P$50,MATCH(\"R\"&5&\"C\"&0,BOARD_TABLE!$C$2:$C$50,0)),\"\"))","v":0},{"$f":"IF(INDEX(BOARD_GRID!$B$5:$H$11,6,1)=\"\",\"\",INDEX(BOARD_GRID!$B$5:$H$11,6,1)&\" / \"&INDEX(BOARD_GRID!$B$14:$H$20,6,1))","v":"M34 / 0"},{"$f":"IF(INDEX(BOARD_GRID!$B$5:$H$11,6,1)=\"\",\"\",IFERROR(INDEX(BOARD_TABLE!$N$2:$N$50,MATCH(\"R\"&5&\"C\"&0,BOARD_TABLE!$C$2:$C$50,0)),\"\"))","v":0},null,{"$f":"IF(INDEX(BOARD_GRID!$B$5:$H$11,6,2)=\"\",\"\",IFERROR(INDEX(BOARD_TABLE!$P$2:$P$50,MATCH(\"R\"&5&\"C\"&1,BOARD_TABLE!$C$2:$C$50,0)),\"\"))","v":1},{"$f":"IF(INDEX(BOARD_GRID!$B$5:$H$11,6,2)=\"\",\"\",INDEX(BOARD_GRID!$B$5:$H$11,6,2)&\" / \"&INDEX(BOARD_GRID!$B$14:$H$20,6,2))","v":"M18 / 180"},{"$f":"IF(INDEX(BOARD_GRID!$B$5:$H$11,6,2)=\"\",\"\",IFERROR(INDEX(BOARD_TABLE!$N$2:$N$50,MATCH(\"R\"&5&\"C\"&1,BOARD_TABLE!$C$2:$C$50,0)),\"\"))","v":0},null,{"$f":"IF(INDEX(BOARD_GRID!$B$5:$H$11,6,3)=\"\",\"\",IFERROR(INDEX(BOARD_TABLE!$P$2:$P$50,MATCH(\"R\"&5&\"C\"&2,BOARD_TABLE!$C$2:$C$50,0)),\"\"))","v":0},{"$f":"IF(INDEX(BOARD_GRID!$B$5:$H$11,6,3)=\"\",\"\",INDEX(BOARD_GRID!$B$5:$H$11,6,3)&\" / \"&INDEX(BOARD_GRID!$B$14:$H$20,6,3))","v":"M28 / 180"},{"$f":"IF(INDEX(BOARD_GRID!$B$5:$H$11,6,3)=\"\",\"\",IFERROR(INDEX(BOARD_TABLE!$N$2:$N$50,MATCH(\"R\"&5&\"C\"&2,BOARD_TABLE!$C$2:$C$50,0)),\"\"))","v":0},null,{"$f":"IF(INDEX(BOARD_GRID!$B$5:$H$11,6,4)=\"\",\"\",IFERROR(INDEX(BOARD_TABLE!$P$2:$P$50,MATCH(\"R\"&5&\"C\"&3,BOARD_TABLE!$C$2:$C$50,0)),\"\"))","v":1},{"$f":"IF(INDEX(BOARD_GRID!$B$5:$H$11,6,4)=\"\",\"\",INDEX(BOARD_GRID!$B$5:$H$11,6,4)&\" / \"&INDEX(BOARD_GRID!$B$14:$H$20,6,4))","v":"M12 / 270"},{"$f":"IF(INDEX(BOARD_GRID!$B$5:$H$11,6,4)=\"\",\"\",IFERROR(INDEX(BOARD_TABLE!$N$2:$N$50,MATCH(\"R\"&5&\"C\"&3,BOARD_TABLE!$C$2:$C$50,0)),\"\"))","v":0},null,{"$f":"IF(INDEX(BOARD_GRID!$B$5:$H$11,6,5)=\"\",\"\",IFERROR(INDEX(BOARD_TABLE!$P$2:$P$50,MATCH(\"R\"&5&\"C\"&4,BOARD_TABLE!$C$2:$C$50,0)),\"\"))","v":1},{"$f":"IF(INDEX(BOARD_GRID!$B$5:$H$11,6,5)=\"\",\"\",INDEX(BOARD_GRID!$B$5:$H$11,6,5)&\" / \"&INDEX(BOARD_GRID!$B$14:$H$20,6,5))","v":"M06 / 180"},{"$f":"IF(INDEX(BOARD_GRID!$B$5:$H$11,6,5)=\"\",\"\",IFERROR(INDEX(BOARD_TABLE!$N$2:$N$50,MATCH(\"R\"&5&\"C\"&4,BOARD_TABLE!$C$2:$C$50,0)),\"\"))","v":1},null,{"$f":"IF(INDEX(BOARD_GRID!$B$5:$H$11,6,6)=\"\",\"\",IFERROR(INDEX(BOARD_TABLE!$P$2:$P$50,MATCH(\"R\"&5&\"C\"&5,BOARD_TABLE!$C$2:$C$50,0)),\"\"))","v":0},{"$f":"IF(INDEX(BOARD_GRID!$B$5:$H$11,6,6)=\"\",\"\",INDEX(BOARD_GRID!$B$5:$H$11,6,6)&\" / \"&INDEX(BOARD_GRID!$B$14:$H$20,6,6))","v":"M26 / 180"},{"$f":"IF(INDEX(BOARD_GRID!$B$5:$H$11,6,6)=\"\",\"\",IFERROR(INDEX(BOARD_TABLE!$N$2:$N$50,MATCH(\"R\"&5&\"C\"&5,BOARD_TABLE!$C$2:$C$50,0)),\"\"))","v":0},null,{"$f":"IF(INDEX(BOARD_GRID!$B$5:$H$11,6,7)=\"\",\"\",IFERROR(INDEX(BOARD_TABLE!$P$2:$P$50,MATCH(\"R\"&5&\"C\"&6,BOARD_TABLE!$C$2:$C$50,0)),\"\"))","v":0},{"$f":"IF(INDEX(BOARD_GRID!$B$5:$H$11,6,7)=\"\",\"\",INDEX(BOARD_GRID!$B$5:$H$11,6,7)&\" / \"&INDEX(BOARD_GRID!$B$14:$H$20,6,7))","v":"M09 / 0"},{"$f":"IF(INDEX(BOARD_GRID!$B$5:$H$11,6,7)=\"\",\"\",IFERROR(INDEX(BOARD_TABLE!$N$2:$N$50,MATCH(\"R\"&5&\"C\"&6,BOARD_TABLE!$C$2:$C$50,0)),\"\"))","v":1}]
[null,null,{"$f":"IF(INDEX(BOARD_GRID!$B$5:$H$11,6,1)=\"\",\"\",IFERROR(INDEX(BOARD_TABLE!$O$2:$O$50,MATCH(\"R\"&5&\"C\"&0,BOARD_TABLE!$C$2:$C$50,0)),\"\"))","v":1},null,null,null,{"$f":"IF(INDEX(BOARD_GRID!$B$5:$H$11,6,2)=\"\",\"\",IFERROR(INDEX(BOARD_TABLE!$O$2:$O$50,MATCH(\"R\"&5&\"C\"&1,BOARD_TABLE!$C$2:$C$50,0)),\"\"))","v":1},null,null,null,{"$f":"IF(INDEX(BOARD_GRID!$B$5:$H$11,6,3)=\"\",\"\",IFERROR(INDEX(BOARD_TABLE!$O$2:$O$50,MATCH(\"R\"&5&\"C\"&2,BOARD_TABLE!$C$2:$C$50,0)),\"\"))","v":1},null,null,null,{"$f":"IF(INDEX(BOARD_GRID!$B$5:$H$11,6,4)=\"\",\"\",IFERROR(INDEX(BOARD_TABLE!$O$2:$O$50,MATCH(\"R\"&5&\"C\"&3,BOARD_TABLE!$C$2:$C$50,0)),\"\"))","v":1},null,null,null,{"$f":"IF(INDEX(BOARD_GRID!$B$5:$H$11,6,5)=\"\",\"\",IFERROR(INDEX(BOARD_TABLE!$O$2:$O$50,MATCH(\"R\"&5&\"C\"&4,BOARD_TABLE!$C$2:$C$50,0)),\"\"))","v":1},null,null,null,{"$f":"IF(INDEX(BOARD_GRID!$B$5:$H$11,6,6)=\"\",\"\",IFERROR(INDEX(BOARD_TABLE!$O$2:$O$50,MATCH(\"R\"&5&\"C\"&5,BOARD_TABLE!$C$2:$C$50,0)),\"\"))","v":1},null,null,null,{"$f":"IF(INDEX(BOARD_GRID!$B$5:$H$11,6,7)=\"\",\"\",IFERROR(INDEX(BOARD_TABLE!$O$2:$O$50,MATCH(\"R\"&5&\"C\"&6,BOARD_TABLE!$C$2:$C$50,0)),\"\"))","v":0}]
[]
[null,null,{"$f":"IF(INDEX(BOARD_GRID!$B$5:$H$11,7,1)=\"\",\"\",IFERROR(INDEX(BOARD_TABLE!$M$2:$M$50,MATCH(\"R\"&6&\"C\"&0,BOARD_TABLE!$C$2:$C$50,0)),\"\"))","v":1},null,null,null,{"$f":"IF(INDEX(BOARD_GRID!$B$5:$H$11,7,2)=\"\",\"\",IFERROR(INDEX(BOARD_TABLE!$M$2:$M$50,MATCH(\"R\"&6&\"C\"&1,BOARD_TABLE!$C$2:$C$50,0)),\"\"))","v":0},null,null,null,{"$f":"IF(INDEX(BOARD_GRID!$B$5:$H$11,7,3)=\"\",\"\",IFERROR(INDEX(BOARD_TABLE!$M$2:$M$50,MATCH(\"R\"&6&\"C\"&2,BOARD_TABLE!$C$2:$C$50,0)),\"\"))","v":1},null,null,null,{"$f":"IF(INDEX(BOARD_GRID!$B$5:$H$11,7,4)=\"\",\"\",IFERROR(INDEX(BOARD_TABLE!$M$2:$M$50,MATCH(\"R\"&6&\"C\"&3,BOARD_TABLE!$C$2:$C$50,0)),\"\"))","v":1},null,null,null,{"$f":"IF(INDEX(BOARD_GRID!$B$5:$H$11,7,5)=\"\",\"\",IFERROR(INDEX(BOARD_TABLE!$M$2:$M$50,MATCH(\"R\"&6&\"C\"&4,BOARD_TABLE!$C$2:$C$50,0)),\"\"))","v":1},null,null,null,{"$f":"IF(INDEX(BOARD_GRID!$B$5:$H$11,7,6)=\"\",\"\",IFERROR(INDEX(BOARD_TABLE!$M$2:$M$50,MATCH(\"R\"&6&\"C\"&5,BOARD_TABLE!$C$2:$C$50,0)),\"\"))","v":1},null,null,null,{"$f":"IF(INDEX(BOARD_GRID!$B$5:$H$11,7,7)=\"\",\"\",IFERROR(INDEX(BOARD_TABLE!$M$2:$M$50,MATCH(\"R\"&6&\"C\"&6,BOARD_TABLE!$C$2:$C$50,0)),\"\"))","v":1}]
[null,{"$f":"IF(INDEX(BOARD_GRID!$B$5:$H$11,7,1)=\"\",\"\",IFERROR(INDEX(BOARD_TABLE!$P$2:$P$50,MATCH(\"R\"&6&\"C\"&0,BOARD_TABLE!$C$2:$C$50,0)),\"\"))","v":0},{"$f":"IF(INDEX(BOARD_GRID!$B$5:$H$11,7,1)=\"\",\"\",INDEX(BOARD_GRID!$B$5:$H$11,7,1)&\" / \"&INDEX(BOARD_GRID!$B$14:$H$20,7,1))","v":"F04 / 0"},{"$f":"IF(INDEX(BOARD_GRID!$B$5:$H$11,7,1)=\"\",\"\",IFERROR(INDEX(BOARD_TABLE!$N$2:$N$50,MATCH(\"R\"&6&\"C\"&0,BOARD_TABLE!$C$2:$C$50,0)),\"\"))","v":1},null,{"$f":"IF(INDEX(BOARD_GRID!$B$5:$H$11,7,2)=\"\",\"\",IFERROR(INDEX(BOARD_TABLE!$P$2:$P$50,MATCH(\"R\"&6&\"C\"&1,BOARD_TABLE!$C$2:$C$50,0)),\"\"))","v":0},{"$f":"IF(INDEX(BOARD_GRID!$B$5:$H$11,7,2)=\"\",\"\",INDEX(BOARD_GRID!$B$5:$H$11,7,2)&\" / \"&INDEX(BOARD_GRID!$B$14:$H$20,7,2))","v":"M08 / 90"},{"$f":"IF(INDEX(BOARD_GRID!$B$5:$H$11,7,2)=\"\",\"\",IFERROR(INDEX(BOARD_TABLE!$N$2:$N$50,MATCH(\"R\"&6&\"C\"&1,BOARD_TABLE!$C$2:$C$50,0)),\"\"))","v":1},null,{"$f":"IF(INDEX(BOARD_GRID!$B$5:$H$11,7,3)=\"\",\"\",IFERROR(INDEX(BOARD_TABLE!$P$2:$P$50,MATCH(\"R\"&6&\"C\"&2,BOARD_TABLE!$C$2:$C$50,0)),\"\"))","v":1},{"$f":"IF(INDEX(BOARD_GRID!$B$5:$H$11,7,3)=\"\",\"\",INDEX(BOARD_GRID!$B$5:$H$11,7,3)&\" / \"&INDEX(BOARD_GRID!$B$14:$H$20,7,3))","v":"F15 / 0"},{"$f":"IF(INDEX(BOARD_GRID!$B$5:$H$11,7,3)=\"\",\"\",IFERROR(INDEX(BOARD_TABLE!$N$2:$N$50,MATCH(\"R\"&6&\"C\"&2,BOARD_TABLE!$C$2:$C$50,0)),\"\"))","v":1},null,{"$f":"IF(INDEX(BOARD_GRID!$B$5:$H$11,7,4)=\"\",\"\",IFERROR(INDEX(BOARD_TABLE!$P$2:$P$50,MATCH(\"R\"&6&\"C\"&3,BOARD_TABLE!$C$2:$C$50,0)),\"\"))","v":0},{"$f":"IF(INDEX(BOARD_GRID!$B$5:$H$11,7,4)=\"\",\"\",INDEX(BOARD_GRID!$B$5:$H$11,7,4)&\" / \"&INDEX(BOARD_GRID!$B$14:$H$20,7,4))","v":"M03 / 0"},{"$f":"IF(INDEX(BOARD_GRID!$B$5:$H$11,7,4)=\"\",\"\",IFERROR(INDEX(BOARD_TABLE!$N$2:$N$50,MATCH(\"R\"&6&\"C\"&3,BOARD_TABLE!$C$2:$C$50,0)),\"\"))","v":1},null,{"$f":"IF(INDEX(BOARD_GRID!$B$5:$H$11,7,5)=\"\",\"\",IFERROR(INDEX(BOARD_TABLE!$P$2:$P$50,MATCH(\"R\"&6&\"C\"&4,BOARD_TABLE!$C$2:$C$50,0)),\"\"))","v":1},{"$f":"IF(INDEX(BOARD_GRID!$B$5:$H$11,7,5)=\"\",\"\",INDEX(BOARD_GRID!$B$5:$H$11,7,5)&\" / \"&INDEX(BOARD_GRID!$B$14:$H$20,7,5))","v":"F16 / 0"},{"$f":"IF(INDEX(BOARD_GRID!$B$5:$H$11,7,5)=\"\",\"\",IFERROR(INDEX(BOARD_TABLE!$N$2:$N$50,MATCH(\"R\"&6&\"C\"&4,BOARD_TABLE!$C$2:$C$50,0)),\"\"))","v":1},null,{"$f":"IF(INDEX(BOARD_GRID!$B$5:$H$11,7,6)=\"\",\"\",IFERROR(INDEX(BOARD_TABLE!$P$2:$P$50,MATCH(\"R\"&6&\"C\"&5,BOARD_TABLE!$C$2:$C$50,0)),\"\"))","v":0},{"$f":"IF(INDEX(BOARD_GRID!$B$5:$H$11,7,6)=\"\",\"\",INDEX(BOARD_GRID!$B$5:$H$11,7,6)&\" / \"&INDEX(BOARD_GRID!$B$14:$H$20,7,6))","v":"M14 / 0"},{"$f":"IF(INDEX(BOARD_GRID!$B$5:$H$11,7,6)=\"\",\"\",IFERROR(INDEX(BOARD_TABLE!$N$2:$N$50,MATCH(\"R\"&6&\"C\"&5,BOARD_TABLE!$C$2:$C$50,0)),\"\"))","v":1},null,{"$f":"IF(INDEX(BOARD_GRID!$B$5:$H$11,7,7)=\"\",\"\",IFERROR(INDEX(BOARD_TABLE!$P$2:$P$50,MATCH(\"R\"&6&\"C\"&6,BOARD_TABLE!$C$2:$C$50,0)),\"\"))","v":1},{"$f":"IF(INDEX(BOARD_GRID!$B$5:$H$11,7,7)=\"\",\"\",INDEX(BOARD_GRID!$B$5:$H$11,7,7)&\" / \"&INDEX(BOARD_GRID!$B$14:$H$20,7,7))","v":"F03 / 270"},{"$f":"IF(INDEX(BOARD_GRID!$B$5:$H$11,7,7)=\"\",\"\",IFERROR(INDEX(BOARD_TABLE!$N$2:$N$50,MATCH(\"R\"&6&\"C\"&6,BOARD_TABLE!$C$2:$C$50,0)),\"\"))","v":0}]
[null,null,{"$f":"IF(INDEX(BOARD_GRID!$B$5:$H$11,7,1)=\"\",\"\",IFERROR(INDEX(BOARD_TABLE!$O$2:$O$50,MATCH(\"R\"&6&\"C\"&0,BOARD_TABLE!$C$2:$C$50,0)),\"\"))","v":0},null,null,null,{"$f":"IF(INDEX(BOARD_GRID!$B$5:$H$11,7,2)=\"\",\"\",IFERROR(INDEX(BOARD_TABLE!$O$2:$O$50,MATCH(\"R\"&6&\"C\"&1,BOARD_TABLE!$C$2:$C$50,0)),\"\"))","v":1},null,null,null,{"$f":"IF(INDEX(BOARD_GRID!$B$5:$H$11,7,3)=\"\",\"\",IFERROR(INDEX(BOARD_TABLE!$O$2:$O$50,MATCH(\"R\"&6&\"C\"&2,BOARD_TABLE!$C$2:$C$50,0)),\"\"))","v":0},null,null,null,{"$f":"IF(INDEX(BOARD_GRID!$B$5:$H$11,7,4)=\"\",\"\",IFERROR(INDEX(BOARD_TABLE!$O$2:$O$50,MATCH(\"R\"&6&\"C\"&3,BOARD_TABLE!$C$2:$C$50,0)),\"\"))","v":0},null,null,null,{"$f":"IF(INDEX(BOARD_GRID!$B$5:$H$11,7,5)=\"\",\"\",IFERROR(INDEX(BOARD_TABLE!$O$2:$O$50,MATCH(\"R\"&6&\"C\"&4,BOARD_TABLE!$C$2:$C$50,0)),\"\"))","v":0},null,null,null,{"$f":"IF(INDEX(BOARD_GRID!$B$5:$H$11,7,6)=\"\",\"\",IFERROR(INDEX(BOARD_TABLE!$O$2:$O$50,MATCH(\"R\"&6&\"C\"&5,BOARD_TABLE!$C$2:$C$50,0)),\"\"))","v":0},null,null,null,{"$f":"IF(INDEX(BOARD_GRID!$B$5:$H$11,7,7)=\"\",\"\",IFERROR(INDEX(BOARD_TABLE!$O$2:$O$50,MATCH(\"R\"&6&\"C\"&6,BOARD_TABLE!$C$2:$C$50,0)),\"\"))","v":0}]

{"sheet":"MOVE_SIM","index":4,"n_rows":32,"n_cols":8,"rows_kept":32,"cut":false,"hidden":false,"merged":[]}
["MOVE_SIM — Push preview (nem módosítja a BOARD_GRID-et)"]
["Inputs:"]
["MoveType (ROW/COL):","ROW"]
["Line (2/4/6):",2]
["Direction (ROW: L/R, COL: U/D):","L"]
[]
["SpareTileID (from BOARD_GRID):",{"$f":"BOARD_GRID!$K$4","v":"M05"}]
["SpareRotation (from BOARD_GRID):",{"$f":"BOARD_GRID!$K$5","v":270}]
[]
["Resulting board (TileID) after push:"]
[]
[null,"F01","M21","F05","M13","F06","M19","F02"]
[null,"M08","M09","M05","M20","M11","M04","M07"]
[null,"F07","M34","F08","M01","F09","M28","F10"]
[null,"M12","M27","M03","M31","M32","M06","M15"]
[null,"F11","M29","F12","M16","F13","M30","F14"]
[null,"M22","M14","M24","M02","M10","M25","M26"]
[null,"F04","M17","F15","M33","F16","M23","F03"]
[]
["Resulting board (Rotation) after push:"]
[]
[null,90,180,180,180,180,90,180]
[null,180,0,270,180,180,180,90]
[null,90,180,90,270,180,270,270]
[null,270,0,270,270,180,180,90]
[null,90,90,0,180,270,0,270]
[null,180,180,90,270,270,0,0]
[null,0,270,0,90,0,0,270]
[]
["New spare after push (tile pushed out):"]
[null,"NewSpareTileID:","M18"]
[null,"NewSpareRotation:",180]

{"sheet":"PLAYERS","index":5,"n_rows":5,"n_cols":11,"rows_kept":5,"cut":false,"hidden":false,"merged":[]}
["PlayerID","InGame","PlayerName","StartRow","StartCol","StartPosID","CurrentRow","CurrentCol","CurrentPosID","CurrentTargetTreasureID","Notes"]
["P1",{"$f":"GAME_VIEW!C19","v":"YES"},"Player 1",1,7,{"$f":"\"R\"&D2-1&\"C\"&E2-1","v":"R0C6"},1,1,{"$f":"\"R\"&G2-1&\"C\"&H2-1","v":"R0C0"}]
["P2",{"$f":"GAME_VIEW!C20","v":"YES"},"Player 2",7,7,{"$f":"\"R\"&D3-1&\"C\"&E3-1","v":"R6C6"},1,7,{"$f":"\"R\"&G3-1&\"C\"&H3-1","v":"R0C6"}]
["P3",{"$f":"GAME_VIEW!C21","v":"NO"},"Player 3",7,1,{"$f":"\"R\"&D4-1&\"C\"&E4-1","v":"R6C0"},7,1,{"$f":"\"R\"&G4-1&\"C\"&H4-1","v":"R6C0"},"SPIDER"]
["P4",{"$f":"GAME_VIEW!C22","v":"NO"},"Player 4",1,1,{"$f":"\"R\"&D5-1&\"C\"&E5-1","v":"R0C0"},1,1,{"$f":"\"R\"&G5-1&\"C\"&H5-1","v":"R0C0"},"OWL"]

{"sheet":"TREASURE_CARDS","index":6,"n_rows":25,"n_cols":7,"rows_kept":25,"cut":false,"hidden":false,"merged":[]}
["TreasureID","TileID","TileFixed","BaseOpen_N","BaseOpen_E","BaseOpen_S","BaseOpen_W"]
["ARMOR","F16","YES",1,1,0,1]
["BAT","M05","NO",1,1,0,1]
["BEETLE","M09","NO",1,1,0,0]
["BOOK","F05","YES",1,1,0,1]
["CANDLESTICK","F15","YES",1,1,0,1]
["CAT","M03","NO",1,1,0,0]
["CROWN","F08","YES",1,1,0,1]
["DRAGON","M11","NO",1,1,0,1]
["EMERALD","F13","YES",1,1,0,1]
["GENIE","M04","NO",1,1,0,1]
["GHOST","M06","NO",1,1,0,1]
["GOBLET","F10","YES",1,1,0,1]
["GOBLIN","M12","NO",1,1,0,1]
["KEY","F09","YES",1,1,0,1]
["LIZARD","M07","NO",1,1,0,0]
["MONEYBAG","F06","YES",1,1,0,1]
["MOUSE","M08","NO",1,1,0,0]
["OWL","M02","NO",1,1,0,0]
["POSION","F07","YES",1,1,0,1]
["RING","F11","YES",1,1,0,1]
["SPIDER","M10","NO",1,1,0,0]
["SWORD","F14","YES",1,1,0,1]
["TREASURE_CHEST","F12","YES",1,1,0,1]
["UNICORN","M01","NO",1,1,0,0]

{"sheet":"PLAYER_TREASURE","index":7,"n_rows":25,"n_cols":6,"rows_kept":25,"cut":false,"hidden":false,"merged":[]}
["PlayerID","Seq","TreasureID","Status","Revealed","FoundTurn"]
["P1",1,"BOOK","PENDING","NO"]
["P1",2,"POSION","PENDING","NO"]
["P1",3,"DRAGON","PENDING","NO"]
["P1",4,"SWORD","PENDING","NO"]
["P1",5,"GOBLET","PENDING","NO"]
["P1",6,"BEETLE","PENDING","NO"]
["P1",7,"SPIDER","PENDING","NO"]
["P1",8,"LIZARD","PENDING","NO"]
["P1",9,"MONEYBAG","PENDING","NO"]
["P1",10,"UNICORN","PENDING","NO"]
["P1",11,"GOBLIN","PENDING","NO"]
["P1",12,"EMERALD","PENDING","NO"]
["P2",1,"MOUSE","PENDING","NO"]
["P2",2,"GENIE","PENDING","NO"]
["P2",3,"TREASURE_CHEST","PENDING","NO"]
["P2",4,"CANDLESTICK","PENDING","NO"]
["P2",5,"GHOST","PENDING","NO"]
["P2",6,"ARMOR","PENDING","NO"]
["P2",7,"OWL","PENDING","NO"]
["P2",8,"BAT","PENDING","NO"]
["P2",9,"RING","PENDING","NO"]
["P2",10,"CROWN","PENDING","NO"]
["P2",11,"CAT","PENDING","NO"]
["P2",12,"KEY","PENDING","NO"]

{"sheet":"TURN_LOG","index":8,"n_rows":1,"n_cols":13,"rows_kept":1,"cut":false,"hidden":false,"merged":[]}
["Turn","ActivePlayerID","MoveType","Line","Direction","StartRow","StartCol","EndRow","EndCol","TargetTreasureID","TargetReached","Notes","Timestamp"]

{"sheet":"MOVE_EVAL","index":9,"n_rows":5,"n_cols":2,"rows_kept":5,"cut":false,"hidden":false,"merged":[]}
["MOVE_EVAL — SuggestBestMove2 inputs/results"]
["PlayerRow (1..7)",1]
["PlayerCol (1..7)",1]
["TargetTreasureID (e.g. BOOK)"]
["OR TargetTileID (optional)"]

{"sheet":"PLAYER_POS_LOG","index":10,"n_rows":1,"n_cols":11,"rows_kept":1,"cut":false,"hidden":false,"merged":[]}
["Turn","P1_Row","P1_Col","P2_Row","P2_Col","P3_Row","P3_Col","P4_Row","P4_Col","Notes","Timestamp"]

{"sheet":"GAME_VIEW","index":11,"n_rows":270,"n_cols":18,"rows_kept":270,"cut":false,"hidden":false,"merged":[[10,10,10,11],[1,13,7,16],[6,17,7,23]]}
["Row","GAME_VIEW",null,null,null,null,null,null,"SPARE"]
[1,null,null,null,null,null,null,null,null,null,null,null,null,"A PLAYERS (C19) állítsd be az aktív játékosokat(In Game)!\nA játék fázisokban működik (Phase lock)\n1) PUSH (betolás)\nA panelen állítsd be:\nSide: L / R / U / D\nLane: 2 / 4 / 6\nSpareRot: 0 / 90 / 180 / 270 (most még előkészítve van)\nNyomd meg: Commit\nbetolja a spare csempét\neltolja a megfelelő sort/oszlopot\nha játékos “kilökődne”, átkerül a túloldalra (shiftPlayers logika)\nfrissül a tábla és a tokenek megjelenítése.\n➡️ Ezután a fázis MOVE.\n2) MOVE (játékos lépés)\nA panelen add meg:\nTarget Row (1..7)\nTarget Col (1..7)\nNyomd meg: Move active player\ncsak akkor enged, ha a célmező elérhető (reachable)\nha a játékos a célkincsre lép, a kincs státusza frissül és új targetet kap\n➡️ Ezután a fázis END.\n3) END (kör vége)\nNyomd meg: Next Turn\naktív játékos vált a következő InGame játékosra\nfázis vissza PUSH-ra"]
[2]
[3]
[4]
[5]
[6,null,null,null,null,null,null,null,null,null,null,null,null,null,null,null,null,"Hasznos Gombok:\nRefresh GAME VIEW: a táblarajz és a spare csempe frissítése\nRefresh GAME HUD: HUD + tokenek frissítése\nUpdate Reachable: elérhető mezők újraszámolása (ha kell)\nReset Game - kiüríti a mozgatható csempéket.\nRandom Fill - Véletlenszerűen feltölti a mozgatható csempéket."]
[7]
["Coloumn",1,2,3,4,5,6,7]
[null,"Board (7x7): B2:H8"]
[null,"Spare slot: J2",null,null,null,null,null,null,null,null,"CONTROL PANEL"]
[null,null,null,null,null,null,null,null,null,null,"ACTIVE PLAYER","P2"]
[null,null,2,null,null,null,null,null,null,null,"PHASE",{"$f":"B256","v":"MOVE"}]
[null,null,"2000-02-01",null,null,null,null,null,null,null,"Side (L,R,U,D)","D"]
[null,null,"(no turns yet)",null,null,null,null,null,null,null,"Lane",2]
[null,null,"(n/a)",null,null,null,null,null,null,null,"Spare Rotation",0]
[null,null,null,null,null,null,null,null,null,null,"Target Row"]
[null,"Player","In Game","Type","Color","Start","Col/Row","Treasure",null,null,"Target Coloumn"]
[null,"P1","YES","HUMAN",null,"Top-Right","(1,3)","POSION"]
[null,"P2","YES","HUMAN",null,"Bottom-Right","(7,7)","MOUSE"]
[null,"P3","NO","HUMAN",null,"Bottom-Left","(7,1)","SPIDER"]
[null,"P4","NO","HUMAN",null,"Top-Left","(1,1)","OWL"]
[]
[]
[]
[]
[]
[]
[]
[]
[]
[]
[]
[]
[]
[]
[]
[]
[]
[]
[]
[]
[]
[]
[]
[]
[]
[]
[]
[]
[]
[]
[]
[]
[]
[]
[]
[]
[]
[]
[]
[]
[]
[]
[]
[]
[]
[]
[]
[]
[]
[]
[]
[]
[]
[]
[]
[]
[]
[]
[]
[]
[]
[]
[]
[]
[]
[]
[]
[]
[]
[]
[]
[]
[]
[]
[]
[]
[]
[]
[]
[]
[]
[]
[]
[]
[]
[]
[]
[]
[]
[]
[]
[]
[]
[]
[]
[]
[]
[]
[]
[]
[]
[]
[]
[]
[]
[]
[]
[]
[]
[]
[]
[]
[]
[]
[]
[]
[]
[]
[]
[]
[]
[]
[]
[]
[]
[]
[]
[]
[]
[]
[]
[]
[]
[]
[]
[]
[]
[]
[]
[]
[]
[]
[]
[]
[]
[]
[]
[]
[]
[]
[]
[]
[]
[]
[]
[]
[]
[]
[]
[]
[]
[]
[]
[]
[]
[]
[]
[]
[]
[]
[]
[]
[]
[]
[]
["ENGINE_CURRENT_STATE (generated)"]
["TileID 7x7",null,null,null,null,null,null,"SpareTileID",{"$f":"BOARD_GRID!K4","v":"M05"}]
[{"$f":"BOARD_GRID!B5","v":"F01"},{"$f":"BOARD_GRID!C5","v":"M29"},{"$f":"BOARD_GRID!D5","v":"F05"},{"$f":"BOARD_GRID!E5","v":"M11"},{"$f":"BOARD_GRID!F5","v":"F06"},{"$f":"BOARD_GRID!G5","v":"M21"},{"$f":"BOARD_GRID!H5","v":"F02"}]
[{"$f":"BOARD_GRID!B6","v":"M30"},{"$f":"BOARD_GRID!C6","v":"M01"},{"$f":"BOARD_GRID!D6","v":"M10"},{"$f":"BOARD_GRID!E6","v":"M23"},{"$f":"BOARD_GRID!F6","v":"M27"},{"$f":"BOARD_GRID!G6","v":"M24"},{"$f":"BOARD_GRID!H6","v":"M04"}]
[{"$f":"BOARD_GRID!B7","v":"F07"},{"$f":"BOARD_GRID!C7","v":"M31"},{"$f":"BOARD_GRID!D7","v":"F08"},{"$f":"BOARD_GRID!E7","v":"M32"},{"$f":"BOARD_GRID!F7","v":"F09"},{"$f":"BOARD_GRID!G7","v":"M13"},{"$f":"BOARD_GRID!H7","v":"F10"}]
[{"$f":"BOARD_GRID!B8","v":"M19"},{"$f":"BOARD_GRID!C8","v":"M07"},{"$f":"BOARD_GRID!D8","v":"M25"},{"$f":"BOARD_GRID!E8","v":"M16"},{"$f":"BOARD_GRID!F8","v":"M33"},{"$f":"BOARD_GRID!G8","v":"M15"},{"$f":"BOARD_GRID!H8","v":"M22"}]
[{"$f":"BOARD_GRID!B9","v":"F11"},{"$f":"BOARD_GRID!C9","v":"M02"},{"$f":"BOARD_GRID!D9","v":"F12"},{"$f":"BOARD_GRID!E9","v":"M20"},{"$f":"BOARD_GRID!F9","v":"F13"},{"$f":"BOARD_GRID!G9","v":"M17"},{"$f":"BOARD_GRID!H9","v":"F14"}]
[{"$f":"BOARD_GRID!B10","v":"M34"},{"$f":"BOARD_GRID!C10","v":"M18"},{"$f":"BOARD_GRID!D10","v":"M28"},{"$f":"BOARD_GRID!E10","v":"M12"},{"$f":"BOARD_GRID!F10","v":"M06"},{"$f":"BOARD_GRID!G10","v":"M26"},{"$f":"BOARD_GRID!H10","v":"M09"}]
[{"$f":"BOARD_GRID!B11","v":"F04"},{"$f":"BOARD_GRID!C11","v":"M08"},{"$f":"BOARD_GRID!D11","v":"F15"},{"$f":"BOARD_GRID!E11","v":"M03"},{"$f":"BOARD_GRID!F11","v":"F16"},{"$f":"BOARD_GRID!G11","v":"M14"},{"$f":"BOARD_GRID!H11","v":"F03"}]
["",null,null,null,null,null,null,"SpareRot",{"$f":"BOARD_GRID!K5","v":270}]
[]
["Rotation 7x7"]
[{"$f":"BOARD_GRID!B14","v":90},{"$f":"BOARD_GRID!C14","v":180},{"$f":"BOARD_GRID!D14","v":180},{"$f":"BOARD_GRID!E14","v":180},{"$f":"BOARD_GRID!F14","v":180},{"$f":"BOARD_GRID!G14","v":270},{"$f":"BOARD_GRID!H14","v":180}]
[{"$f":"BOARD_GRID!B15","v":90},{"$f":"BOARD_GRID!C15","v":270},{"$f":"BOARD_GRID!D15","v":180},{"$f":"BOARD_GRID!E15","v":90},{"$f":"BOARD_GRID!F15","v":180},{"$f":"BOARD_GRID!G15","v":180},{"$f":"BOARD_GRID!H15","v":270}]
[{"$f":"BOARD_GRID!B16","v":90},{"$f":"BOARD_GRID!C16","v":270},{"$f":"BOARD_GRID!D16","v":90},{"$f":"BOARD_GRID!E16","v":90},{"$f":"BOARD_GRID!F16","v":180},{"$f":"BOARD_GRID!G16","v":0},{"$f":"BOARD_GRID!H16","v":270}]
[{"$f":"BOARD_GRID!B17","v":0},{"$f":"BOARD_GRID!C17","v":90},{"$f":"BOARD_GRID!D17","v":0},{"$f":"BOARD_GRID!E17","v":270},{"$f":"BOARD_GRID!F17","v":90},{"$f":"BOARD_GRID!G17","v":270},{"$f":"BOARD_GRID!H17","v":0}]
[{"$f":"BOARD_GRID!B18","v":90},{"$f":"BOARD_GRID!C18","v":90},{"$f":"BOARD_GRID!D18","v":0},{"$f":"BOARD_GRID!E18","v":90},{"$f":"BOARD_GRID!F18","v":270},{"$f":"BOARD_GRID!G18","v":270},{"$f":"BOARD_GRID!H18","v":270}]
[{"$f":"BOARD_GRID!B19","v":0},{"$f":"BOARD_GRID!C19","v":180},{"$f":"BOARD_GRID!D19","v":180},{"$f":"BOARD_GRID!E19","v":270},{"$f":"BOARD_GRID!F19","v":180},{"$f":"BOARD_GRID!G19","v":180},{"$f":"BOARD_GRID!H19","v":0}]
[{"$f":"BOARD_GRID!B20","v":0},{"$f":"BOARD_GRID!C20","v":90},{"$f":"BOARD_GRID!D20","v":0},{"$f":"BOARD_GRID!E20","v":0},{"$f":"BOARD_GRID!F20","v":0},{"$f":"BOARD_GRID!G20","v":0},{"$f":"BOARD_GRID!H20","v":270}]
[]
[]
[]
["MOVE INPUT"]
[]
["Insert side (L/R/U/D)"]
["Lane(2/4/6)"]
["Spare Rotation (0/90/180/270)"]
[]
["Ejected TileID",{"$f":"IF(B222=\"L\",INDEX(BOARD_GRID!$B$5:$H$11,B223,7),\nIF(B222=\"R\",INDEX(BOARD_GRID!$B$5:$H$11,B223,1),\nIF(B222=\"U\",INDEX(BOARD_GRID!$B$5:$H$11,7,B223),\nIF(B222=\"D\",INDEX(BOARD_GRID!$B$5:$H$11,1,B223),\"\"))))","v":""}]
["Ejected Rotation",{"$f":"IF(B222=\"L\",INDEX(BOARD_GRID!$B$14:$H$20,B223,7),\nIF(B222=\"R\",INDEX(BOARD_GRID!$B$14:$H$20,B223,1),\nIF(B222=\"U\",INDEX(BOARD_GRID!$B$14:$H$20,7,B223),\nIF(B222=\"D\",INDEX(BOARD_GRID!$B$14:$H$20,1,B223),\"\"))))","v":""}]
[]
["PREVIEW TileID"]
[{"$f":"IF($B$222=\"\",\"\",IF($B$222=\"L\",\n    IF(ROW()-ROW($A$230)+1=VALUE($B$223),\n        IF(COLUMN()-COLUMN($A$230)+1=1,\n            BOARD_GRID!$K$4,\n            INDEX(BOARD_GRID!$B$5:$H$11,VALUE($B$223),COLUMN()-COLUMN($A$230))\n        ),\n        INDEX(BOARD_GRID!$B$5:$H$11,ROW()-ROW($A$230)+1,COLUMN()-COLUMN($A$230)+1)\n    ),\nIF($B$222=\"R\",\n    IF(ROW()-ROW($A$230)+1=VALUE($B$223),\n        IF(COLUMN()-COLUMN($A$230)+1=7,\n            BOARD_GRID!$K$4,\n            INDEX(BOARD_GRID!$B$5:$H$11,VALUE($B$223),COLUMN()-COLUMN($A$230)+2)\n        ),\n        INDEX(BOARD_GRID!$B$5:$H$11,ROW()-ROW($A$230)+1,COLUMN()-COLUMN($A$230)+1)\n    ),\nIF($B$222=\"U\",\n    IF(COLUMN()-COLUMN($A$230)+1=VALUE($B$223),\n        IF(ROW()-ROW($A$230)+1=1,\n            BOARD_GRID!$K$4,\n            INDEX(BOARD_GRID!$B$5:$H$11,ROW()-ROW($A$230),VALUE($B$223))\n        ),\n        INDEX(BOARD_GRID!$B$5:$H$11,ROW()-ROW($A$230)+1,COLUMN()-COLUMN($A$230)+1)\n    ),\nIF($B$222=\"D\",\n    IF(COLUMN()-COLUMN($A$230)+1=VALUE($B$223),\n        IF(ROW()-ROW($A$230)+1=7,\n            BOARD_GRID!$K$4,\n            INDEX(BOARD_GRID!$B$5:$H$11,ROW()-ROW($A$230)+2,VALUE($B$223))\n        ),\n        INDEX(BOARD_GRID!$B$5:$H$11,ROW()-ROW($A$230)+1,COLUMN()-COLUMN($A$230)+1)\n    ),\n\"\")))))","v":""},{"$f":"IF($B$222=\"\",\"\",IF($B$222=\"L\",\n    IF(ROW()-ROW($A$230)+1=VALUE($B$223),\n        IF(COLUMN()-COLUMN($A$230)+1=1,\n            BOARD_GRID!$K$4,\n            INDEX(BOARD_GRID!$B$5:$H$11,VALUE($B$223),COLUMN()-COLUMN($A$230))\n        ),\n        INDEX(BOARD_GRID!$B$5:$H$11,ROW()-ROW($A$230)+1,COLUMN()-COLUMN($A$230)+1)\n    ),\nIF($B$222=\"R\",\n    IF(ROW()-ROW($A$230)+1=VALUE($B$223),\n        IF(COLUMN()-COLUMN($A$230)+1=7,\n            BOARD_GRID!$K$4,\n            INDEX(BOARD_GRID!$B$5:$H$11,VALUE($B$223),COLUMN()-COLUMN($A$230)+2)\n        ),\n        INDEX(BOARD_GRID!$B$5:$H$11,ROW()-ROW($A$230)+1,COLUMN()-COLUMN($A$230)+1)\n    ),\nIF($B$222=\"U\",\n    IF(COLUMN()-COLUMN($A$230)+1=VALUE($B$223),\n        IF(ROW()-ROW($A$230)+1=1,\n            BOARD_GRID!$K$4,\n            INDEX(BOARD_GRID!$B$5:$H$11,ROW()-ROW($A$230),VALUE($B$223))\n        ),\n        INDEX(BOARD_GRID!$B$5:$H$11,ROW()-ROW($A$230)+1,COLUMN()-COLUMN($A$230)+1)\n    ),\nIF($B$222=\"D\",\n    IF(COLUMN()-COLUMN($A$230)+1=VALUE($B$223),\n        IF(ROW()-ROW($A$230)+1=7,\n            BOARD_GRID!$K$4,\n            INDEX(BOARD_GRID!$B$5:$H$11,ROW()-ROW($A$230)+2,VALUE($B$223))\n        ),\n        INDEX(BOARD_GRID!$B$5:$H$11,ROW()-ROW($A$230)+1,COLUMN()-COLUMN($A$230)+1)\n    ),\n\"\")))))","v":""},{"$f":"IF($B$222=\"\",\"\",IF($B$222=\"L\",\n    IF(ROW()-ROW($A$230)+1=VALUE($B$223),\n        IF(COLUMN()-COLUMN($A$230)+1=1,\n            BOARD_GRID!$K$4,\n            INDEX(BOARD_GRID!$B$5:$H$11,VALUE($B$223),COLUMN()-COLUMN($A$230))\n        ),\n        INDEX(BOARD_GRID!$B$5:$H$11,ROW()-ROW($A$230)+1,COLUMN()-COLUMN($A$230)+1)\n    ),\nIF($B$222=\"R\",\n    IF(ROW()-ROW($A$230)+1=VALUE($B$223),\n        IF(COLUMN()-COLUMN($A$230)+1=7,\n            BOARD_GRID!$K$4,\n            INDEX(BOARD_GRID!$B$5:$H$11,VALUE($B$223),COLUMN()-COLUMN($A$230)+2)\n        ),\n        INDEX(BOARD_GRID!$B$5:$H$11,ROW()-ROW($A$230)+1,COLUMN()-COLUMN($A$230)+1)\n    ),\nIF($B$222=\"U\",\n    IF(COLUMN()-COLUMN($A$230)+1=VALUE($B$223),\n        IF(ROW()-ROW($A$230)+1=1,\n            BOARD_GRID!$K$4,\n            INDEX(BOARD_GRID!$B$5:$H$11,ROW()-ROW($A$230),VALUE($B$223))\n        ),\n        INDEX(BOARD_GRID!$B$5:$H$11,ROW()-ROW($A$230)+1,COLUMN()-COLUMN($A$230)+1)\n    ),\nIF($B$222=\"D\",\n    IF(COLUMN()-COLUMN($A$230)+1=VALUE($B$223),\n        IF(ROW()-ROW($A$230)+1=7,\n            BOARD_GRID!$K$4,\n            INDEX(BOARD_GRID!$B$5:$H$11,ROW()-ROW($A$230)+2,VALUE($B$223))\n        ),\n        INDEX(BOARD_GRID!$B$5:$H$11,ROW()-ROW($A$230)+1,COLUMN()-COLUMN($A$230)+1)\n    ),\n\"\")))))","v":""},{"$f":"IF($B$222=\"\",\"\",IF($B$222=\"L\",\n    IF(ROW()-ROW($A$230)+1=VALUE($B$223),\n        IF(COLUMN()-COLUMN($A$230)+1=1,\n            BOARD_GRID!$K$4,\n            INDEX(BOARD_GRID!$B$5:$H$11,VALUE($B$223),COLUMN()-COLUMN($A$230))\n        ),\n        INDEX(BOARD_GRID!$B$5:$H$11,ROW()-ROW($A$230)+1,COLUMN()-COLUMN($A$230)+1)\n    ),\nIF($B$222=\"R\",\n    IF(ROW()-ROW($A$230)+1=VALUE($B$223),\n        IF(COLUMN()-COLUMN($A$230)+1=7,\n            BOARD_GRID!$K$4,\n            INDEX(BOARD_GRID!$B$5:$H$11,VALUE($B$223),COLUMN()-COLUMN($A$230)+2)\n        ),\n        INDEX(BOARD_GRID!$B$5:$H$11,ROW()-ROW($A$230)+1,COLUMN()-COLUMN($A$230)+1)\n    ),\nIF($B$222=\"U\",\n    IF(COLUMN()-COLUMN($A$230)+1=VALUE($B$223),\n        IF(ROW()-ROW($A$230)+1=1,\n            BOARD_GRID!$K$4,\n            INDEX(BOARD_GRID!$B$5:$H$11,ROW()-ROW($A$230),VALUE($B$223))\n        ),\n        INDEX(BOARD_GRID!$B$5:$H$11,ROW()-ROW($A$230)+1,COLUMN()-COLUMN($A$230)+1)\n    ),\nIF($B$222=\"D\",\n    IF(COLUMN()-COLUMN($A$230)+1=VALUE($B$223),\n        IF(ROW()-ROW($A$230)+1=7,\n            BOARD_GRID!$K$4,\n            INDEX(BOARD_GRID!$B$5:$H$11,ROW()-ROW($A$230)+2,VALUE($B$223))\n        ),\n        INDEX(BOARD_GRID!$B$5:$H$11,ROW()-ROW($A$230)+1,COLUMN()-COLUMN($A$230)+1)\n    ),\n\"\")))))","v":""},{"$f":"IF($B$222=\"\",\"\",IF($B$222=\"L\",\n    IF(ROW()-ROW($A$230)+1=VALUE($B$223),\n        IF(COLUMN()-COLUMN($A$230)+1=1,\n            BOARD_GRID!$K$4,\n            INDEX(BOARD_GRID!$B$5:$H$11,VALUE($B$223),COLUMN()-COLUMN($A$230))\n        ),\n        INDEX(BOARD_GRID!$B$5:$H$11,ROW()-ROW($A$230)+1,COLUMN()-COLUMN($A$230)+1)\n    ),\nIF($B$222=\"R\",\n    IF(ROW()-ROW($A$230)+1=VALUE($B$223),\n        IF(COLUMN()-COLUMN($A$230)+1=7,\n            BOARD_GRID!$K$4,\n            INDEX(BOARD_GRID!$B$5:$H$11,VALUE($B$223),COLUMN()-COLUMN($A$230)+2)\n        ),\n        INDEX(BOARD_GRID!$B$5:$H$11,ROW()-ROW($A$230)+1,COLUMN()-COLUMN($A$230)+1)\n    ),\nIF($B$222=\"U\",\n    IF(COLUMN()-COLUMN($A$230)+1=VALUE($B$223),\n        IF(ROW()-ROW($A$230)+1=1,\n            BOARD_GRID!$K$4,\n            INDEX(BOARD_GRID!$B$5:$H$11,ROW()-ROW($A$230),VALUE($B$223))\n        ),\n        INDEX(BOARD_GRID!$B$5:$H$11,ROW()-ROW($A$230)+1,COLUMN()-COLUMN($A$230)+1)\n    ),\nIF($B$222=\"D\",\n    IF(COLUMN()-COLUMN($A$230)+1=VALUE($B$223),\n        IF(ROW()-ROW($A$230)+1=7,\n            BOARD_GRID!$K$4,\n            INDEX(BOARD_GRID!$B$5:$H$11,ROW()-ROW($A$230)+2,VALUE($B$223))\n        ),\n        INDEX(BOARD_GRID!$B$5:$H$11,ROW()-ROW($A$230)+1,COLUMN()-COLUMN($A$230)+1)\n    ),\n\"\")))))","v":""},{"$f":"IF($B$222=\"\",\"\",IF($B$222=\"L\",\n    IF(ROW()-ROW($A$230)+1=VALUE($B$223),\n        IF(COLUMN()-COLUMN($A$230)+1=1,\n            BOARD_GRID!$K$4,\n            INDEX(BOARD_GRID!$B$5:$H$11,VALUE($B$223),COLUMN()-COLUMN($A$230))\n        ),\n        INDEX(BOARD_GRID!$B$5:$H$11,ROW()-ROW($A$230)+1,COLUMN()-COLUMN($A$230)+1)\n    ),\nIF($B$222=\"R\",\n    IF(ROW()-ROW($A$230)+1=VALUE($B$223),\n        IF(COLUMN()-COLUMN($A$230)+1=7,\n            BOARD_GRID!$K$4,\n            INDEX(BOARD_GRID!$B$5:$H$11,VALUE($B$223),COLUMN()-COLUMN($A$230)+2)\n        ),\n        INDEX(BOARD_GRID!$B$5:$H$11,ROW()-ROW($A$230)+1,COLUMN()-COLUMN($A$230)+1)\n    ),\nIF($B$222=\"U\",\n    IF(COLUMN()-COLUMN($A$230)+1=VALUE($B$223),\n        IF(ROW()-ROW($A$230)+1=1,\n            BOARD_GRID!$K$4,\n            INDEX(BOARD_GRID!$B$5:$H$11,ROW()-ROW($A$230),VALUE($B$223))\n        ),\n        INDEX(BOARD_GRID!$B$5:$H$11,ROW()-ROW($A$230)+1,COLUMN()-COLUMN($A$230)+1)\n    ),\nIF($B$222=\"D\",\n    IF(COLUMN()-COLUMN($A$230)+1=VALUE($B$223),\n        IF(ROW()-ROW($A$230)+1=7,\n            BOARD_GRID!$K$4,\n            INDEX(BOARD_GRID!$B$5:$H$11,ROW()-ROW($A$230)+2,VALUE($B$223))\n        ),\n        INDEX(BOARD_GRID!$B$5:$H$11,ROW()-ROW($A$230)+1,COLUMN()-COLUMN($A$230)+1)\n    ),\n\"\")))))","v":""},{"$f":"IF($B$222=\"\",\"\",IF($B$222=\"L\",\n    IF(ROW()-ROW($A$230)+1=VALUE($B$223),\n        IF(COLUMN()-COLUMN($A$230)+1=1,\n            BOARD_GRID!$K$4,\n            INDEX(BOARD_GRID!$B$5:$H$11,VALUE($B$223),COLUMN()-COLUMN($A$230))\n        ),\n        INDEX(BOARD_GRID!$B$5:$H$11,ROW()-ROW($A$230)+1,COLUMN()-COLUMN($A$230)+1)\n    ),\nIF($B$222=\"R\",\n    IF(ROW()-ROW($A$230)+1=VALUE($B$223),\n        IF(COLUMN()-COLUMN($A$230)+1=7,\n            BOARD_GRID!$K$4,\n            INDEX(BOARD_GRID!$B$5:$H$11,VALUE($B$223),COLUMN()-COLUMN($A$230)+2)\n        ),\n        INDEX(BOARD_GRID!$B$5:$H$11,ROW()-ROW($A$230)+1,COLUMN()-COLUMN($A$230)+1)\n    ),\nIF($B$222=\"U\",\n    IF(COLUMN()-COLUMN($A$230)+1=VALUE($B$223),\n        IF(ROW()-ROW($A$230)+1=1,\n            BOARD_GRID!$K$4,\n            INDEX(BOARD_GRID!$B$5:$H$11,ROW()-ROW($A$230),VALUE($B$223))\n        ),\n        INDEX(BOARD_GRID!$B$5:$H$11,ROW()-ROW($A$230)+1,COLUMN()-COLUMN($A$230)+1)\n    ),\nIF($B$222=\"D\",\n    IF(COLUMN()-COLUMN($A$230)+1=VALUE($B$223),\n        IF(ROW()-ROW($A$230)+1=7,\n            BOARD_GRID!$K$4,\n            INDEX(BOARD_GRID!$B$5:$H$11,ROW()-ROW($A$230)+2,VALUE($B$223))\n        ),\n        INDEX(BOARD_GRID!$B$5:$H$11,ROW()-ROW($A$230)+1,COLUMN()-COLUMN($A$230)+1)\n    ),\n\"\")))))","v":""}]
[{"$f":"IF($B$222=\"\",\"\",IF($B$222=\"L\",\n    IF(ROW()-ROW($A$230)+1=VALUE($B$223),\n        IF(COLUMN()-COLUMN($A$230)+1=1,\n            BOARD_GRID!$K$4,\n            INDEX(BOARD_GRID!$B$5:$H$11,VALUE($B$223),COLUMN()-COLUMN($A$230))\n        ),\n        INDEX(BOARD_GRID!$B$5:$H$11,ROW()-ROW($A$230)+1,COLUMN()-COLUMN($A$230)+1)\n    ),\nIF($B$222=\"R\",\n    IF(ROW()-ROW($A$230)+1=VALUE($B$223),\n        IF(COLUMN()-COLUMN($A$230)+1=7,\n            BOARD_GRID!$K$4,\n            INDEX(BOARD_GRID!$B$5:$H$11,VALUE($B$223),COLUMN()-COLUMN($A$230)+2)\n        ),\n        INDEX(BOARD_GRID!$B$5:$H$11,ROW()-ROW($A$230)+1,COLUMN()-COLUMN($A$230)+1)\n    ),\nIF($B$222=\"U\",\n    IF(COLUMN()-COLUMN($A$230)+1=VALUE($B$223),\n        IF(ROW()-ROW($A$230)+1=1,\n            BOARD_GRID!$K$4,\n            INDEX(BOARD_GRID!$B$5:$H$11,ROW()-ROW($A$230),VALUE($B$223))\n        ),\n        INDEX(BOARD_GRID!$B$5:$H$11,ROW()-ROW($A$230)+1,COLUMN()-COLUMN($A$230)+1)\n    ),\nIF($B$222=\"D\",\n    IF(COLUMN()-COLUMN($A$230)+1=VALUE($B$223),\n        IF(ROW()-ROW($A$230)+1=7,\n            BOARD_GRID!$K$4,\n            INDEX(BOARD_GRID!$B$5:$H$11,ROW()-ROW($A$230)+2,VALUE($B$223))\n        ),\n        INDEX(BOARD_GRID!$B$5:$H$11,ROW()-ROW($A$230)+1,COLUMN()-COLUMN($A$230)+1)\n    ),\n\"\")))))","v":""},{"$f":"IF($B$222=\"\",\"\",IF($B$222=\"L\",\n    IF(ROW()-ROW($A$230)+1=VALUE($B$223),\n        IF(COLUMN()-COLUMN($A$230)+1=1,\n            BOARD_GRID!$K$4,\n            INDEX(BOARD_GRID!$B$5:$H$11,VALUE($B$223),COLUMN()-COLUMN($A$230))\n        ),\n        INDEX(BOARD_GRID!$B$5:$H$11,ROW()-ROW($A$230)+1,COLUMN()-COLUMN($A$230)+1)\n    ),\nIF($B$222=\"R\",\n    IF(ROW()-ROW($A$230)+1=VALUE($B$223),\n        IF(COLUMN()-COLUMN($A$230)+1=7,\n            BOARD_GRID!$K$4,\n            INDEX(BOARD_GRID!$B$5:$H$11,VALUE($B$223),COLUMN()-COLUMN($A$230)+2)\n        ),\n        INDEX(BOARD_GRID!$B$5:$H$11,ROW()-ROW($A$230)+1,COLUMN()-COLUMN($A$230)+1)\n    ),\nIF($B$222=\"U\",\n    IF(COLUMN()-COLUMN($A$230)+1=VALUE($B$223),\n        IF(ROW()-ROW($A$230)+1=1,\n            BOARD_GRID!$K$4,\n            INDEX(BOARD_GRID!$B$5:$H$11,ROW()-ROW($A$230),VALUE($B$223))\n        ),\n        INDEX(BOARD_GRID!$B$5:$H$11,ROW()-ROW($A$230)+1,COLUMN()-COLUMN($A$230)+1)\n    ),\nIF($B$222=\"D\",\n    IF(COLUMN()-COLUMN($A$230)+1=VALUE($B$223),\n        IF(ROW()-ROW($A$230)+1=7,\n            BOARD_GRID!$K$4,\n            INDEX(BOARD_GRID!$B$5:$H$11,ROW()-ROW($A$230)+2,VALUE($B$223))\n        ),\n        INDEX(BOARD_GRID!$B$5:$H$11,ROW()-ROW($A$230)+1,COLUMN()-COLUMN($A$230)+1)\n    ),\n\"\")))))","v":""},{"$f":"IF($B$222=\"\",\"\",IF($B$222=\"L\",\n    IF(ROW()-ROW($A$230)+1=VALUE($B$223),\n        IF(COLUMN()-COLUMN($A$230)+1=1,\n            BOARD_GRID!$K$4,\n            INDEX(BOARD_GRID!$B$5:$H$11,VALUE($B$223),COLUMN()-COLUMN($A$230))\n        ),\n        INDEX(BOARD_GRID!$B$5:$H$11,ROW()-ROW($A$230)+1,COLUMN()-COLUMN($A$230)+1)\n    ),\nIF($B$222=\"R\",\n    IF(ROW()-ROW($A$230)+1=VALUE($B$223),\n        IF(COLUMN()-COLUMN($A$230)+1=7,\n            BOARD_GRID!$K$4,\n            INDEX(BOARD_GRID!$B$5:$H$11,VALUE($B$223),COLUMN()-COLUMN($A$230)+2)\n        ),\n        INDEX(BOARD_GRID!$B$5:$H$11,ROW()-ROW($A$230)+1,COLUMN()-COLUMN($A$230)+1)\n    ),\nIF($B$222=\"U\",\n    IF(COLUMN()-COLUMN($A$230)+1=VALUE($B$223),\n        IF(ROW()-ROW($A$230)+1=1,\n            BOARD_GRID!$K$4,\n            INDEX(BOARD_GRID!$B$5:$H$11,ROW()-ROW($A$230),VALUE($B$223))\n        ),\n        INDEX(BOARD_GRID!$B$5:$H$11,ROW()-ROW($A$230)+1,COLUMN()-COLUMN($A$230)+1)\n    ),\nIF($B$222=\"D\",\n    IF(COLUMN()-COLUMN($A$230)+1=VALUE($B$223),\n        IF(ROW()-ROW($A$230)+1=7,\n            BOARD_GRID!$K$4,\n            INDEX(BOARD_GRID!$B$5:$H$11,ROW()-ROW($A$230)+2,VALUE($B$223))\n        ),\n        INDEX(BOARD_GRID!$B$5:$H$11,ROW()-ROW($A$230)+1,COLUMN()-COLUMN($A$230)+1)\n    ),\n\"\")))))","v":""},{"$f":"IF($B$222=\"\",\"\",IF($B$222=\"L\",\n    IF(ROW()-ROW($A$230)+1=VALUE($B$223),\n        IF(COLUMN()-COLUMN($A$230)+1=1,\n            BOARD_GRID!$K$4,\n            INDEX(BOARD_GRID!$B$5:$H$11,VALUE($B$223),COLUMN()-COLUMN($A$230))\n        ),\n        INDEX(BOARD_GRID!$B$5:$H$11,ROW()-ROW($A$230)+1,COLUMN()-COLUMN($A$230)+1)\n    ),\nIF($B$222=\"R\",\n    IF(ROW()-ROW($A$230)+1=VALUE($B$223),\n        IF(COLUMN()-COLUMN($A$230)+1=7,\n            BOARD_GRID!$K$4,\n            INDEX(BOARD_GRID!$B$5:$H$11,VALUE($B$223),COLUMN()-COLUMN($A$230)+2)\n        ),\n        INDEX(BOARD_GRID!$B$5:$H$11,ROW()-ROW($A$230)+1,COLUMN()-COLUMN($A$230)+1)\n    ),\nIF($B$222=\"U\",\n    IF(COLUMN()-COLUMN($A$230)+1=VALUE($B$223),\n        IF(ROW()-ROW($A$230)+1=1,\n            BOARD_GRID!$K$4,\n            INDEX(BOARD_GRID!$B$5:$H$11,ROW()-ROW($A$230),VALUE($B$223))\n        ),\n        INDEX(BOARD_GRID!$B$5:$H$11,ROW()-ROW($A$230)+1,COLUMN()-COLUMN($A$230)+1)\n    ),\nIF($B$222=\"D\",\n    IF(COLUMN()-COLUMN($A$230)+1=VALUE($B$223),\n        IF(ROW()-ROW($A$230)+1=7,\n            BOARD_GRID!$K$4,\n            INDEX(BOARD_GRID!$B$5:$H$11,ROW()-ROW($A$230)+2,VALUE($B$223))\n        ),\n        INDEX(BOARD_GRID!$B$5:$H$11,ROW()-ROW($A$230)+1,COLUMN()-COLUMN($A$230)+1)\n    ),\n\"\")))))","v":""},{"$f":"IF($B$222=\"\",\"\",IF($B$222=\"L\",\n    IF(ROW()-ROW($A$230)+1=VALUE($B$223),\n        IF(COLUMN()-COLUMN($A$230)+1=1,\n            BOARD_GRID!$K$4,\n            INDEX(BOARD_GRID!$B$5:$H$11,VALUE($B$223),COLUMN()-COLUMN($A$230))\n        ),\n        INDEX(BOARD_GRID!$B$5:$H$11,ROW()-ROW($A$230)+1,COLUMN()-COLUMN($A$230)+1)\n    ),\nIF($B$222=\"R\",\n    IF(ROW()-ROW($A$230)+1=VALUE($B$223),\n        IF(COLUMN()-COLUMN($A$230)+1=7,\n            BOARD_GRID!$K$4,\n            INDEX(BOARD_GRID!$B$5:$H$11,VALUE($B$223),COLUMN()-COLUMN($A$230)+2)\n        ),\n        INDEX(BOARD_GRID!$B$5:$H$11,ROW()-ROW($A$230)+1,COLUMN()-COLUMN($A$230)+1)\n    ),\nIF($B$222=\"U\",\n    IF(COLUMN()-COLUMN($A$230)+1=VALUE($B$223),\n        IF(ROW()-ROW($A$230)+1=1,\n            BOARD_GRID!$K$4,\n            INDEX(BOARD_GRID!$B$5:$H$11,ROW()-ROW($A$230),VALUE($B$223))\n        ),\n        INDEX(BOARD_GRID!$B$5:$H$11,ROW()-ROW($A$230)+1,COLUMN()-COLUMN($A$230)+1)\n    ),\nIF($B$222=\"D\",\n    IF(COLUMN()-COLUMN($A$230)+1=VALUE($B$223),\n        IF(ROW()-ROW($A$230)+1=7,\n            BOARD_GRID!$K$4,\n            INDEX(BOARD_GRID!$B$5:$H$11,ROW()-ROW($A$230)+2,VALUE($B$223))\n        ),\n        INDEX(BOARD_GRID!$B$5:$H$11,ROW()-ROW($A$230)+1,COLUMN()-COLUMN($A$230)+1)\n    ),\n\"\")))))","v":""},{"$f":"IF($B$222=\"\",\"\",IF($B$222=\"L\",\n    IF(ROW()-ROW($A$230)+1=VALUE($B$223),\n        IF(COLUMN()-COLUMN($A$230)+1=1,\n            BOARD_GRID!$K$4,\n            INDEX(BOARD_GRID!$B$5:$H$11,VALUE($B$223),COLUMN()-COLUMN($A$230))\n        ),\n        INDEX(BOARD_GRID!$B$5:$H$11,ROW()-ROW($A$230)+1,COLUMN()-COLUMN($A$230)+1)\n    ),\nIF($B$222=\"R\",\n    IF(ROW()-ROW($A$230)+1=VALUE($B$223),\n        IF(COLUMN()-COLUMN($A$230)+1=7,\n            BOARD_GRID!$K$4,\n            INDEX(BOARD_GRID!$B$5:$H$11,VALUE($B$223),COLUMN()-COLUMN($A$230)+2)\n        ),\n        INDEX(BOARD_GRID!$B$5:$H$11,ROW()-ROW($A$230)+1,COLUMN()-COLUMN($A$230)+1)\n    ),\nIF($B$222=\"U\",\n    IF(COLUMN()-COLUMN($A$230)+1=VALUE($B$223),\n        IF(ROW()-ROW($A$230)+1=1,\n            BOARD_GRID!$K$4,\n            INDEX(BOARD_GRID!$B$5:$H$11,ROW()-ROW($A$230),VALUE($B$223))\n        ),\n        INDEX(BOARD_GRID!$B$5:$H$11,ROW()-ROW($A$230)+1,COLUMN()-COLUMN($A$230)+1)\n    ),\nIF($B$222=\"D\",\n    IF(COLUMN()-COLUMN($A$230)+1=VALUE($B$223),\n        IF(ROW()-ROW($A$230)+1=7,\n            BOARD_GRID!$K$4,\n            INDEX(BOARD_GRID!$B$5:$H$11,ROW()-ROW($A$230)+2,VALUE($B$223))\n        ),\n        INDEX(BOARD_GRID!$B$5:$H$11,ROW()-ROW($A$230)+1,COLUMN()-COLUMN($A$230)+1)\n    ),\n\"\")))))","v":""},{"$f":"IF($B$222=\"\",\"\",IF($B$222=\"L\",\n    IF(ROW()-ROW($A$230)+1=VALUE($B$223),\n        IF(COLUMN()-COLUMN($A$230)+1=1,\n            BOARD_GRID!$K$4,\n            INDEX(BOARD_GRID!$B$5:$H$11,VALUE($B$223),COLUMN()-COLUMN($A$230))\n        ),\n        INDEX(BOARD_GRID!$B$5:$H$11,ROW()-ROW($A$230)+1,COLUMN()-COLUMN($A$230)+1)\n    ),\nIF($B$222=\"R\",\n    IF(ROW()-ROW($A$230)+1=VALUE($B$223),\n        IF(COLUMN()-COLUMN($A$230)+1=7,\n            BOARD_GRID!$K$4,\n            INDEX(BOARD_GRID!$B$5:$H$11,VALUE($B$223),COLUMN()-COLUMN($A$230)+2)\n        ),\n        INDEX(BOARD_GRID!$B$5:$H$11,ROW()-ROW($A$230)+1,COLUMN()-COLUMN($A$230)+1)\n    ),\nIF($B$222=\"U\",\n    IF(COLUMN()-COLUMN($A$230)+1=VALUE($B$223),\n        IF(ROW()-ROW($A$230)+1=1,\n            BOARD_GRID!$K$4,\n            INDEX(BOARD_GRID!$B$5:$H$11,ROW()-ROW($A$230),VALUE($B$223))\n        ),\n        INDEX(BOARD_GRID!$B$5:$H$11,ROW()-ROW($A$230)+1,COLUMN()-COLUMN($A$230)+1)\n    ),\nIF($B$222=\"D\",\n    IF(COLUMN()-COLUMN($A$230)+1=VALUE($B$223),\n        IF(ROW()-ROW($A$230)+1=7,\n            BOARD_GRID!$K$4,\n            INDEX(BOARD_GRID!$B$5:$H$11,ROW()-ROW($A$230)+2,VALUE($B$223))\n        ),\n        INDEX(BOARD_GRID!$B$5:$H$11,ROW()-ROW($A$230)+1,COLUMN()-COLUMN($A$230)+1)\n    ),\n\"\")))))","v":""}]
[{"$f":"IF($B$222=\"\",\"\",IF($B$222=\"L\",\n    IF(ROW()-ROW($A$230)+1=VALUE($B$223),\n        IF(COLUMN()-COLUMN($A$230)+1=1,\n            BOARD_GRID!$K$4,\n            INDEX(BOARD_GRID!$B$5:$H$11,VALUE($B$223),COLUMN()-COLUMN($A$230))\n        ),\n        INDEX(BOARD_GRID!$B$5:$H$11,ROW()-ROW($A$230)+1,COLUMN()-COLUMN($A$230)+1)\n    ),\nIF($B$222=\"R\",\n    IF(ROW()-ROW($A$230)+1=VALUE($B$223),\n        IF(COLUMN()-COLUMN($A$230)+1=7,\n            BOARD_GRID!$K$4,\n            INDEX(BOARD_GRID!$B$5:$H$11,VALUE($B$223),COLUMN()-COLUMN($A$230)+2)\n        ),\n        INDEX(BOARD_GRID!$B$5:$H$11,ROW()-ROW($A$230)+1,COLUMN()-COLUMN($A$230)+1)\n    ),\nIF($B$222=\"U\",\n    IF(COLUMN()-COLUMN($A$230)+1=VALUE($B$223),\n        IF(ROW()-ROW($A$230)+1=1,\n            BOARD_GRID!$K$4,\n            INDEX(BOARD_GRID!$B$5:$H$11,ROW()-ROW($A$230),VALUE($B$223))\n        ),\n        INDEX(BOARD_GRID!$B$5:$H$11,ROW()-ROW($A$230)+1,COLUMN()-COLUMN($A$230)+1)\n    ),\nIF($B$222=\"D\",\n    IF(COLUMN()-COLUMN($A$230)+1=VALUE($B$223),\n        IF(ROW()-ROW($A$230)+1=7,\n            BOARD_GRID!$K$4,\n            INDEX(BOARD_GRID!$B$5:$H$11,ROW()-ROW($A$230)+2,VALUE($B$223))\n        ),\n        INDEX(BOARD_GRID!$B$5:$H$11,ROW()-ROW($A$230)+1,COLUMN()-COLUMN($A$230)+1)\n    ),\n\"\")))))","v":""},{"$f":"IF($B$222=\"\",\"\",IF($B$222=\"L\",\n    IF(ROW()-ROW($A$230)+1=VALUE($B$223),\n        IF(COLUMN()-COLUMN($A$230)+1=1,\n            BOARD_GRID!$K$4,\n            INDEX(BOARD_GRID!$B$5:$H$11,VALUE($B$223),COLUMN()-COLUMN($A$230))\n        ),\n        INDEX(BOARD_GRID!$B$5:$H$11,ROW()-ROW($A$230)+1,COLUMN()-COLUMN($A$230)+1)\n    ),\nIF($B$222=\"R\",\n    IF(ROW()-ROW($A$230)+1=VALUE($B$223),\n        IF(COLUMN()-COLUMN($A$230)+1=7,\n            BOARD_GRID!$K$4,\n            INDEX(BOARD_GRID!$B$5:$H$11,VALUE($B$223),COLUMN()-COLUMN($A$230)+2)\n        ),\n        INDEX(BOARD_GRID!$B$5:$H$11,ROW()-ROW($A$230)+1,COLUMN()-COLUMN($A$230)+1)\n    ),\nIF($B$222=\"U\",\n    IF(COLUMN()-COLUMN($A$230)+1=VALUE($B$223),\n        IF(ROW()-ROW($A$230)+1=1,\n            BOARD_GRID!$K$4,\n            INDEX(BOARD_GRID!$B$5:$H$11,ROW()-ROW($A$230),VALUE($B$223))\n        ),\n        INDEX(BOARD_GRID!$B$5:$H$11,ROW()-ROW($A$230)+1,COLUMN()-COLUMN($A$230)+1)\n    ),\nIF($B$222=\"D\",\n    IF(COLUMN()-COLUMN($A$230)+1=VALUE($B$223),\n        IF(ROW()-ROW($A$230)+1=7,\n            BOARD_GRID!$K$4,\n            INDEX(BOARD_GRID!$B$5:$H$11,ROW()-ROW($A$230)+2,VALUE($B$223))\n        ),\n        INDEX(BOARD_GRID!$B$5:$H$11,ROW()-ROW($A$230)+1,COLUMN()-COLUMN($A$230)+1)\n    ),\n\"\")))))","v":""},{"$f":"IF($B$222=\"\",\"\",IF($B$222=\"L\",\n    IF(ROW()-ROW($A$230)+1=VALUE($B$223),\n        IF(COLUMN()-COLUMN($A$230)+1=1,\n            BOARD_GRID!$K$4,\n            INDEX(BOARD_GRID!$B$5:$H$11,VALUE($B$223),COLUMN()-COLUMN($A$230))\n        ),\n        INDEX(BOARD_GRID!$B$5:$H$11,ROW()-ROW($A$230)+1,COLUMN()-COLUMN($A$230)+1)\n    ),\nIF($B$222=\"R\",\n    IF(ROW()-ROW($A$230)+1=VALUE($B$223),\n        IF(COLUMN()-COLUMN($A$230)+1=7,\n            BOARD_GRID!$K$4,\n            INDEX(BOARD_GRID!$B$5:$H$11,VALUE($B$223),COLUMN()-COLUMN($A$230)+2)\n        ),\n        INDEX(BOARD_GRID!$B$5:$H$11,ROW()-ROW($A$230)+1,COLUMN()-COLUMN($A$230)+1)\n    ),\nIF($B$222=\"U\",\n    IF(COLUMN()-COLUMN($A$230)+1=VALUE($B$223),\n        IF(ROW()-ROW($A$230)+1=1,\n            BOARD_GRID!$K$4,\n            INDEX(BOARD_GRID!$B$5:$H$11,ROW()-ROW($A$230),VALUE($B$223))\n        ),\n        INDEX(BOARD_GRID!$B$5:$H$11,ROW()-ROW($A$230)+1,COLUMN()-COLUMN($A$230)+1)\n    ),\nIF($B$222=\"D\",\n    IF(COLUMN()-COLUMN($A$230)+1=VALUE($B$223),\n        IF(ROW()-ROW($A$230)+1=7,\n            BOARD_GRID!$K$4,\n            INDEX(BOARD_GRID!$B$5:$H$11,ROW()-ROW($A$230)+2,VALUE($B$223))\n        ),\n        INDEX(BOARD_GRID!$B$5:$H$11,ROW()-ROW($A$230)+1,COLUMN()-COLUMN($A$230)+1)\n    ),\n\"\")))))","v":""},{"$f":"IF($B$222=\"\",\"\",IF($B$222=\"L\",\n    IF(ROW()-ROW($A$230)+1=VALUE($B$223),\n        IF(COLUMN()-COLUMN($A$230)+1=1,\n            BOARD_GRID!$K$4,\n            INDEX(BOARD_GRID!$B$5:$H$11,VALUE($B$223),COLUMN()-COLUMN($A$230))\n        ),\n        INDEX(BOARD_GRID!$B$5:$H$11,ROW()-ROW($A$230)+1,COLUMN()-COLUMN($A$230)+1)\n    ),\nIF($B$222=\"R\",\n    IF(ROW()-ROW($A$230)+1=VALUE($B$223),\n        IF(COLUMN()-COLUMN($A$230)+1=7,\n            BOARD_GRID!$K$4,\n            INDEX(BOARD_GRID!$B$5:$H$11,VALUE($B$223),COLUMN()-COLUMN($A$230)+2)\n        ),\n        INDEX(BOARD_GRID!$B$5:$H$11,ROW()-ROW($A$230)+1,COLUMN()-COLUMN($A$230)+1)\n    ),\nIF($B$222=\"U\",\n    IF(COLUMN()-COLUMN($A$230)+1=VALUE($B$223),\n        IF(ROW()-ROW($A$230)+1=1,\n            BOARD_GRID!$K$4,\n            INDEX(BOARD_GRID!$B$5:$H$11,ROW()-ROW($A$230),VALUE($B$223))\n        ),\n        INDEX(BOARD_GRID!$B$5:$H$11,ROW()-ROW($A$230)+1,COLUMN()-COLUMN($A$230)+1)\n    ),\nIF($B$222=\"D\",\n    IF(COLUMN()-COLUMN($A$230)+1=VALUE($B$223),\n        IF(ROW()-ROW($A$230)+1=7,\n            BOARD_GRID!$K$4,\n            INDEX(BOARD_GRID!$B$5:$H$11,ROW()-ROW($A$230)+2,VALUE($B$223))\n        ),\n        INDEX(BOARD_GRID!$B$5:$H$11,ROW()-ROW($A$230)+1,COLUMN()-COLUMN($A$230)+1)\n    ),\n\"\")))))","v":""},{"$f":"IF($B$222=\"\",\"\",IF($B$222=\"L\",\n    IF(ROW()-ROW($A$230)+1=VALUE($B$223),\n        IF(COLUMN()-COLUMN($A$230)+1=1,\n            BOARD_GRID!$K$4,\n            INDEX(BOARD_GRID!$B$5:$H$11,VALUE($B$223),COLUMN()-COLUMN($A$230))\n        ),\n        INDEX(BOARD_GRID!$B$5:$H$11,ROW()-ROW($A$230)+1,COLUMN()-COLUMN($A$230)+1)\n    ),\nIF($B$222=\"R\",\n    IF(ROW()-ROW($A$230)+1=VALUE($B$223),\n        IF(COLUMN()-COLUMN($A$230)+1=7,\n            BOARD_GRID!$K$4,\n            INDEX(BOARD_GRID!$B$5:$H$11,VALUE($B$223),COLUMN()-COLUMN($A$230)+2)\n        ),\n        INDEX(BOARD_GRID!$B$5:$H$11,ROW()-ROW($A$230)+1,COLUMN()-COLUMN($A$230)+1)\n    ),\nIF($B$222=\"U\",\n    IF(COLUMN()-COLUMN($A$230)+1=VALUE($B$223),\n        IF(ROW()-ROW($A$230)+1=1,\n            BOARD_GRID!$K$4,\n            INDEX(BOARD_GRID!$B$5:$H$11,ROW()-ROW($A$230),VALUE($B$223))\n        ),\n        INDEX(BOARD_GRID!$B$5:$H$11,ROW()-ROW($A$230)+1,COLUMN()-COLUMN($A$230)+1)\n    ),\nIF($B$222=\"D\",\n    IF(COLUMN()-COLUMN($A$230)+1=VALUE($B$223),\n        IF(ROW()-ROW($A$230)+1=7,\n            BOARD_GRID!$K$4,\n            INDEX(BOARD_GRID!$B$5:$H$11,ROW()-ROW($A$230)+2,VALUE($B$223))\n        ),\n        INDEX(BOARD_GRID!$B$5:$H$11,ROW()-ROW($A$230)+1,COLUMN()-COLUMN($A$230)+1)\n    ),\n\"\")))))","v":""},{"$f":"IF($B$222=\"\",\"\",IF($B$222=\"L\",\n    IF(ROW()-ROW($A$230)+1=VALUE($B$223),\n        IF(COLUMN()-COLUMN($A$230)+1=1,\n            BOARD_GRID!$K$4,\n            INDEX(BOARD_GRID!$B$5:$H$11,VALUE($B$223),COLUMN()-COLUMN($A$230))\n        ),\n        INDEX(BOARD_GRID!$B$5:$H$11,ROW()-ROW($A$230)+1,COLUMN()-COLUMN($A$230)+1)\n    ),\nIF($B$222=\"R\",\n    IF(ROW()-ROW($A$230)+1=VALUE($B$223),\n        IF(COLUMN()-COLUMN($A$230)+1=7,\n            BOARD_GRID!$K$4,\n            INDEX(BOARD_GRID!$B$5:$H$11,VALUE($B$223),COLUMN()-COLUMN($A$230)+2)\n        ),\n        INDEX(BOARD_GRID!$B$5:$H$11,ROW()-ROW($A$230)+1,COLUMN()-COLUMN($A$230)+1)\n    ),\nIF($B$222=\"U\",\n    IF(COLUMN()-COLUMN($A$230)+1=VALUE($B$223),\n        IF(ROW()-ROW($A$230)+1=1,\n            BOARD_GRID!$K$4,\n            INDEX(BOARD_GRID!$B$5:$H$11,ROW()-ROW($A$230),VALUE($B$223))\n        ),\n        INDEX(BOARD_GRID!$B$5:$H$11,ROW()-ROW($A$230)+1,COLUMN()-COLUMN($A$230)+1)\n    ),\nIF($B$222=\"D\",\n    IF(COLUMN()-COLUMN($A$230)+1=VALUE($B$223),\n        IF(ROW()-ROW($A$230)+1=7,\n            BOARD_GRID!$K$4,\n            INDEX(BOARD_GRID!$B$5:$H$11,ROW()-ROW($A$230)+2,VALUE($B$223))\n        ),\n        INDEX(BOARD_GRID!$B$5:$H$11,ROW()-ROW($A$230)+1,COLUMN()-COLUMN($A$230)+1)\n    ),\n\"\")))))","v":""},{"$f":"IF($B$222=\"\",\"\",IF($B$222=\"L\",\n    IF(ROW()-ROW($A$230)+1=VALUE($B$223),\n        IF(COLUMN()-COLUMN($A$230)+1=1,\n            BOARD_GRID!$K$4,\n            INDEX(BOARD_GRID!$B$5:$H$11,VALUE($B$223),COLUMN()-COLUMN($A$230))\n        ),\n        INDEX(BOARD_GRID!$B$5:$H$11,ROW()-ROW($A$230)+1,COLUMN()-COLUMN($A$230)+1)\n    ),\nIF($B$222=\"R\",\n    IF(ROW()-ROW($A$230)+1=VALUE($B$223),\n        IF(COLUMN()-COLUMN($A$230)+1=7,\n            BOARD_GRID!$K$4,\n            INDEX(BOARD_GRID!$B$5:$H$11,VALUE($B$223),COLUMN()-COLUMN($A$230)+2)\n        ),\n        INDEX(BOARD_GRID!$B$5:$H$11,ROW()-ROW($A$230)+1,COLUMN()-COLUMN($A$230)+1)\n    ),\nIF($B$222=\"U\",\n    IF(COLUMN()-COLUMN($A$230)+1=VALUE($B$223),\n        IF(ROW()-ROW($A$230)+1=1,\n            BOARD_GRID!$K$4,\n            INDEX(BOARD_GRID!$B$5:$H$11,ROW()-ROW($A$230),VALUE($B$223))\n        ),\n        INDEX(BOARD_GRID!$B$5:$H$11,ROW()-ROW($A$230)+1,COLUMN()-COLUMN($A$230)+1)\n    ),\nIF($B$222=\"D\",\n    IF(COLUMN()-COLUMN($A$230)+1=VALUE($B$223),\n        IF(ROW()-ROW($A$230)+1=7,\n            BOARD_GRID!$K$4,\n            INDEX(BOARD_GRID!$B$5:$H$11,ROW()-ROW($A$230)+2,VALUE($B$223))\n        ),\n        INDEX(BOARD_GRID!$B$5:$H$11,ROW()-ROW($A$230)+1,COLUMN()-COLUMN($A$230)+1)\n    ),\n\"\")))))","v":""}]
[{"$f":"IF($B$222=\"\",\"\",IF($B$222=\"L\",\n    IF(ROW()-ROW($A$230)+1=VALUE($B$223),\n        IF(COLUMN()-COLUMN($A$230)+1=1,\n            BOARD_GRID!$K$4,\n            INDEX(BOARD_GRID!$B$5:$H$11,VALUE($B$223),COLUMN()-COLUMN($A$230))\n        ),\n        INDEX(BOARD_GRID!$B$5:$H$11,ROW()-ROW($A$230)+1,COLUMN()-COLUMN($A$230)+1)\n    ),\nIF($B$222=\"R\",\n    IF(ROW()-ROW($A$230)+1=VALUE($B$223),\n        IF(COLUMN()-COLUMN($A$230)+1=7,\n            BOARD_GRID!$K$4,\n            INDEX(BOARD_GRID!$B$5:$H$11,VALUE($B$223),COLUMN()-COLUMN($A$230)+2)\n        ),\n        INDEX(BOARD_GRID!$B$5:$H$11,ROW()-ROW($A$230)+1,COLUMN()-COLUMN($A$230)+1)\n    ),\nIF($B$222=\"U\",\n    IF(COLUMN()-COLUMN($A$230)+1=VALUE($B$223),\n        IF(ROW()-ROW($A$230)+1=1,\n            BOARD_GRID!$K$4,\n            INDEX(BOARD_GRID!$B$5:$H$11,ROW()-ROW($A$230),VALUE($B$223))\n        ),\n        INDEX(BOARD_GRID!$B$5:$H$11,ROW()-ROW($A$230)+1,COLUMN()-COLUMN($A$230)+1)\n    ),\nIF($B$222=\"D\",\n    IF(COLUMN()-COLUMN($A$230)+1=VALUE($B$223),\n        IF(ROW()-ROW($A$230)+1=7,\n            BOARD_GRID!$K$4,\n            INDEX(BOARD_GRID!$B$5:$H$11,ROW()-ROW($A$230)+2,VALUE($B$223))\n        ),\n        INDEX(BOARD_GRID!$B$5:$H$11,ROW()-ROW($A$230)+1,COLUMN()-COLUMN($A$230)+1)\n    ),\n\"\")))))","v":""},{"$f":"IF($B$222=\"\",\"\",IF($B$222=\"L\",\n    IF(ROW()-ROW($A$230)+1=VALUE($B$223),\n        IF(COLUMN()-COLUMN($A$230)+1=1,\n            BOARD_GRID!$K$4,\n            INDEX(BOARD_GRID!$B$5:$H$11,VALUE($B$223),COLUMN()-COLUMN($A$230))\n        ),\n        INDEX(BOARD_GRID!$B$5:$H$11,ROW()-ROW($A$230)+1,COLUMN()-COLUMN($A$230)+1)\n    ),\nIF($B$222=\"R\",\n    IF(ROW()-ROW($A$230)+1=VALUE($B$223),\n        IF(COLUMN()-COLUMN($A$230)+1=7,\n            BOARD_GRID!$K$4,\n            INDEX(BOARD_GRID!$B$5:$H$11,VALUE($B$223),COLUMN()-COLUMN($A$230)+2)\n        ),\n        INDEX(BOARD_GRID!$B$5:$H$11,ROW()-ROW($A$230)+1,COLUMN()-COLUMN($A$230)+1)\n    ),\nIF($B$222=\"U\",\n    IF(COLUMN()-COLUMN($A$230)+1=VALUE($B$223),\n        IF(ROW()-ROW($A$230)+1=1,\n            BOARD_GRID!$K$4,\n            INDEX(BOARD_GRID!$B$5:$H$11,ROW()-ROW($A$230),VALUE($B$223))\n        ),\n        INDEX(BOARD_GRID!$B$5:$H$11,ROW()-ROW($A$230)+1,COLUMN()-COLUMN($A$230)+1)\n    ),\nIF($B$222=\"D\",\n    IF(COLUMN()-COLUMN($A$230)+1=VALUE($B$223),\n        IF(ROW()-ROW($A$230)+1=7,\n            BOARD_GRID!$K$4,\n            INDEX(BOARD_GRID!$B$5:$H$11,ROW()-ROW($A$230)+2,VALUE($B$223))\n        ),\n        INDEX(BOARD_GRID!$B$5:$H$11,ROW()-ROW($A$230)+1,COLUMN()-COLUMN($A$230)+1)\n    ),\n\"\")))))","v":""},{"$f":"IF($B$222=\"\",\"\",IF($B$222=\"L\",\n    IF(ROW()-ROW($A$230)+1=VALUE($B$223),\n        IF(COLUMN()-COLUMN($A$230)+1=1,\n            BOARD_GRID!$K$4,\n            INDEX(BOARD_GRID!$B$5:$H$11,VALUE($B$223),COLUMN()-COLUMN($A$230))\n        ),\n        INDEX(BOARD_GRID!$B$5:$H$11,ROW()-ROW($A$230)+1,COLUMN()-COLUMN($A$230)+1)\n    ),\nIF($B$222=\"R\",\n    IF(ROW()-ROW($A$230)+1=VALUE($B$223),\n        IF(COLUMN()-COLUMN($A$230)+1=7,\n            BOARD_GRID!$K$4,\n            INDEX(BOARD_GRID!$B$5:$H$11,VALUE($B$223),COLUMN()-COLUMN($A$230)+2)\n        ),\n        INDEX(BOARD_GRID!$B$5:$H$11,ROW()-ROW($A$230)+1,COLUMN()-COLUMN($A$230)+1)\n    ),\nIF($B$222=\"U\",\n    IF(COLUMN()-COLUMN($A$230)+1=VALUE($B$223),\n        IF(ROW()-ROW($A$230)+1=1,\n            BOARD_GRID!$K$4,\n            INDEX(BOARD_GRID!$B$5:$H$11,ROW()-ROW($A$230),VALUE($B$223))\n        ),\n        INDEX(BOARD_GRID!$B$5:$H$11,ROW()-ROW($A$230)+1,COLUMN()-COLUMN($A$230)+1)\n    ),\nIF($B$222=\"D\",\n    IF(COLUMN()-COLUMN($A$230)+1=VALUE($B$223),\n        IF(ROW()-ROW($A$230)+1=7,\n            BOARD_GRID!$K$4,\n            INDEX(BOARD_GRID!$B$5:$H$11,ROW()-ROW($A$230)+2,VALUE($B$223))\n        ),\n        INDEX(BOARD_GRID!$B$5:$H$11,ROW()-ROW($A$230)+1,COLUMN()-COLUMN($A$230)+1)\n    ),\n\"\")))))","v":""},{"$f":"IF($B$222=\"\",\"\",IF($B$222=\"L\",\n    IF(ROW()-ROW($A$230)+1=VALUE($B$223),\n        IF(COLUMN()-COLUMN($A$230)+1=1,\n            BOARD_GRID!$K$4,\n            INDEX(BOARD_GRID!$B$5:$H$11,VALUE($B$223),COLUMN()-COLUMN($A$230))\n        ),\n        INDEX(BOARD_GRID!$B$5:$H$11,ROW()-ROW($A$230)+1,COLUMN()-COLUMN($A$230)+1)\n    ),\nIF($B$222=\"R\",\n    IF(ROW()-ROW($A$230)+1=VALUE($B$223),\n        IF(COLUMN()-COLUMN($A$230)+1=7,\n            BOARD_GRID!$K$4,\n            INDEX(BOARD_GRID!$B$5:$H$11,VALUE($B$223),COLUMN()-COLUMN($A$230)+2)\n        ),\n        INDEX(BOARD_GRID!$B$5:$H$11,ROW()-ROW($A$230)+1,COLUMN()-COLUMN($A$230)+1)\n    ),\nIF($B$222=\"U\",\n    IF(COLUMN()-COLUMN($A$230)+1=VALUE($B$223),\n        IF(ROW()-ROW($A$230)+1=1,\n            BOARD_GRID!$K$4,\n            INDEX(BOARD_GRID!$B$5:$H$11,ROW()-ROW($A$230),VALUE($B$223))\n        ),\n        INDEX(BOARD_GRID!$B$5:$H$11,ROW()-ROW($A$230)+1,COLUMN()-COLUMN($A$230)+1)\n    ),\nIF($B$222=\"D\",\n    IF(COLUMN()-COLUMN($A$230)+1=VALUE($B$223),\n        IF(ROW()-ROW($A$230)+1=7,\n            BOARD_GRID!$K$4,\n            INDEX(BOARD_GRID!$B$5:$H$11,ROW()-ROW($A$230)+2,VALUE($B$223))\n        ),\n        INDEX(BOARD_GRID!$B$5:$H$11,ROW()-ROW($A$230)+1,COLUMN()-COLUMN($A$230)+1)\n    ),\n\"\")))))","v":""},{"$f":"IF($B$222=\"\",\"\",IF($B$222=\"L\",\n    IF(ROW()-ROW($A$230)+1=VALUE($B$223),\n        IF(COLUMN()-COLUMN($A$230)+1=1,\n            BOARD_GRID!$K$4,\n            INDEX(BOARD_GRID!$B$5:$H$11,VALUE($B$223),COLUMN()-COLUMN($A$230))\n        ),\n        INDEX(BOARD_GRID!$B$5:$H$11,ROW()-ROW($A$230)+1,COLUMN()-COLUMN($A$230)+1)\n    ),\nIF($B$222=\"R\",\n    IF(ROW()-ROW($A$230)+1=VALUE($B$223),\n        IF(COLUMN()-COLUMN($A$230)+1=7,\n            BOARD_GRID!$K$4,\n            INDEX(BOARD_GRID!$B$5:$H$11,VALUE($B$223),COLUMN()-COLUMN($A$230)+2)\n        ),\n        INDEX(BOARD_GRID!$B$5:$H$11,ROW()-ROW($A$230)+1,COLUMN()-COLUMN($A$230)+1)\n    ),\nIF($B$222=\"U\",\n    IF(COLUMN()-COLUMN($A$230)+1=VALUE($B$223),\n        IF(ROW()-ROW($A$230)+1=1,\n            BOARD_GRID!$K$4,\n            INDEX(BOARD_GRID!$B$5:$H$11,ROW()-ROW($A$230),VALUE($B$223))\n        ),\n        INDEX(BOARD_GRID!$B$5:$H$11,ROW()-ROW($A$230)+1,COLUMN()-COLUMN($A$230)+1)\n    ),\nIF($B$222=\"D\",\n    IF(COLUMN()-COLUMN($A$230)+1=VALUE($B$223),\n        IF(ROW()-ROW($A$230)+1=7,\n            BOARD_GRID!$K$4,\n            INDEX(BOARD_GRID!$B$5:$H$11,ROW()-ROW($A$230)+2,VALUE($B$223))\n        ),\n        INDEX(BOARD_GRID!$B$5:$H$11,ROW()-ROW($A$230)+1,COLUMN()-COLUMN($A$230)+1)\n    ),\n\"\")))))","v":""},{"$f":"IF($B$222=\"\",\"\",IF($B$222=\"L\",\n    IF(ROW()-ROW($A$230)+1=VALUE($B$223),\n        IF(COLUMN()-COLUMN($A$230)+1=1,\n            BOARD_GRID!$K$4,\n            INDEX(BOARD_GRID!$B$5:$H$11,VALUE($B$223),COLUMN()-COLUMN($A$230))\n        ),\n        INDEX(BOARD_GRID!$B$5:$H$11,ROW()-ROW($A$230)+1,COLUMN()-COLUMN($A$230)+1)\n    ),\nIF($B$222=\"R\",\n    IF(ROW()-ROW($A$230)+1=VALUE($B$223),\n        IF(COLUMN()-COLUMN($A$230)+1=7,\n            BOARD_GRID!$K$4,\n            INDEX(BOARD_GRID!$B$5:$H$11,VALUE($B$223),COLUMN()-COLUMN($A$230)+2)\n        ),\n        INDEX(BOARD_GRID!$B$5:$H$11,ROW()-ROW($A$230)+1,COLUMN()-COLUMN($A$230)+1)\n    ),\nIF($B$222=\"U\",\n    IF(COLUMN()-COLUMN($A$230)+1=VALUE($B$223),\n        IF(ROW()-ROW($A$230)+1=1,\n            BOARD_GRID!$K$4,\n            INDEX(BOARD_GRID!$B$5:$H$11,ROW()-ROW($A$230),VALUE($B$223))\n        ),\n        INDEX(BOARD_GRID!$B$5:$H$11,ROW()-ROW($A$230)+1,COLUMN()-COLUMN($A$230)+1)\n    ),\nIF($B$222=\"D\",\n    IF(COLUMN()-COLUMN($A$230)+1=VALUE($B$223),\n        IF(ROW()-ROW($A$230)+1=7,\n            BOARD_GRID!$K$4,\n            INDEX(BOARD_GRID!$B$5:$H$11,ROW()-ROW($A$230)+2,VALUE($B$223))\n        ),\n        INDEX(BOARD_GRID!$B$5:$H$11,ROW()-ROW($A$230)+1,COLUMN()-COLUMN($A$230)+1)\n    ),\n\"\")))))","v":""},{"$f":"IF($B$222=\"\",\"\",IF($B$222=\"L\",\n    IF(ROW()-ROW($A$230)+1=VALUE($B$223),\n        IF(COLUMN()-COLUMN($A$230)+1=1,\n            BOARD_GRID!$K$4,\n            INDEX(BOARD_GRID!$B$5:$H$11,VALUE($B$223),COLUMN()-COLUMN($A$230))\n        ),\n        INDEX(BOARD_GRID!$B$5:$H$11,ROW()-ROW($A$230)+1,COLUMN()-COLUMN($A$230)+1)\n    ),\nIF($B$222=\"R\",\n    IF(ROW()-ROW($A$230)+1=VALUE($B$223),\n        IF(COLUMN()-COLUMN($A$230)+1=7,\n            BOARD_GRID!$K$4,\n            INDEX(BOARD_GRID!$B$5:$H$11,VALUE($B$223),COLUMN()-COLUMN($A$230)+2)\n        ),\n        INDEX(BOARD_GRID!$B$5:$H$11,ROW()-ROW($A$230)+1,COLUMN()-COLUMN($A$230)+1)\n    ),\nIF($B$222=\"U\",\n    IF(COLUMN()-COLUMN($A$230)+1=VALUE($B$223),\n        IF(ROW()-ROW($A$230)+1=1,\n            BOARD_GRID!$K$4,\n            INDEX(BOARD_GRID!$B$5:$H$11,ROW()-ROW($A$230),VALUE($B$223))\n        ),\n        INDEX(BOARD_GRID!$B$5:$H$11,ROW()-ROW($A$230)+1,COLUMN()-COLUMN($A$230)+1)\n    ),\nIF($B$222=\"D\",\n    IF(COLUMN()-COLUMN($A$230)+1=VALUE($B$223),\n        IF(ROW()-ROW($A$230)+1=7,\n            BOARD_GRID!$K$4,\n            INDEX(BOARD_GRID!$B$5:$H$11,ROW()-ROW($A$230)+2,VALUE($B$223))\n        ),\n        INDEX(BOARD_GRID!$B$5:$H$11,ROW()-ROW($A$230)+1,COLUMN()-COLUMN($A$230)+1)\n    ),\n\"\")))))","v":""}]
[{"$f":"IF($B$222=\"\",\"\",IF($B$222=\"L\",\n    IF(ROW()-ROW($A$230)+1=VALUE($B$223),\n        IF(COLUMN()-COLUMN($A$230)+1=1,\n            BOARD_GRID!$K$4,\n            INDEX(BOARD_GRID!$B$5:$H$11,VALUE($B$223),COLUMN()-COLUMN($A$230))\n        ),\n        INDEX(BOARD_GRID!$B$5:$H$11,ROW()-ROW($A$230)+1,COLUMN()-COLUMN($A$230)+1)\n    ),\nIF($B$222=\"R\",\n    IF(ROW()-ROW($A$230)+1=VALUE($B$223),\n        IF(COLUMN()-COLUMN($A$230)+1=7,\n            BOARD_GRID!$K$4,\n            INDEX(BOARD_GRID!$B$5:$H$11,VALUE($B$223),COLUMN()-COLUMN($A$230)+2)\n        ),\n        INDEX(BOARD_GRID!$B$5:$H$11,ROW()-ROW($A$230)+1,COLUMN()-COLUMN($A$230)+1)\n    ),\nIF($B$222=\"U\",\n    IF(COLUMN()-COLUMN($A$230)+1=VALUE($B$223),\n        IF(ROW()-ROW($A$230)+1=1,\n            BOARD_GRID!$K$4,\n            INDEX(BOARD_GRID!$B$5:$H$11,ROW()-ROW($A$230),VALUE($B$223))\n        ),\n        INDEX(BOARD_GRID!$B$5:$H$11,ROW()-ROW($A$230)+1,COLUMN()-COLUMN($A$230)+1)\n    ),\nIF($B$222=\"D\",\n    IF(COLUMN()-COLUMN($A$230)+1=VALUE($B$223),\n        IF(ROW()-ROW($A$230)+1=7,\n            BOARD_GRID!$K$4,\n            INDEX(BOARD_GRID!$B$5:$H$11,ROW()-ROW($A$230)+2,VALUE($B$223))\n        ),\n        INDEX(BOARD_GRID!$B$5:$H$11,ROW()-ROW($A$230)+1,COLUMN()-COLUMN($A$230)+1)\n    ),\n\"\")))))","v":""},{"$f":"IF($B$222=\"\",\"\",IF($B$222=\"L\",\n    IF(ROW()-ROW($A$230)+1=VALUE($B$223),\n        IF(COLUMN()-COLUMN($A$230)+1=1,\n            BOARD_GRID!$K$4,\n            INDEX(BOARD_GRID!$B$5:$H$11,VALUE($B$223),COLUMN()-COLUMN($A$230))\n        ),\n        INDEX(BOARD_GRID!$B$5:$H$11,ROW()-ROW($A$230)+1,COLUMN()-COLUMN($A$230)+1)\n    ),\nIF($B$222=\"R\",\n    IF(ROW()-ROW($A$230)+1=VALUE($B$223),\n        IF(COLUMN()-COLUMN($A$230)+1=7,\n            BOARD_GRID!$K$4,\n            INDEX(BOARD_GRID!$B$5:$H$11,VALUE($B$223),COLUMN()-COLUMN($A$230)+2)\n        ),\n        INDEX(BOARD_GRID!$B$5:$H$11,ROW()-ROW($A$230)+1,COLUMN()-COLUMN($A$230)+1)\n    ),\nIF($B$222=\"U\",\n    IF(COLUMN()-COLUMN($A$230)+1=VALUE($B$223),\n        IF(ROW()-ROW($A$230)+1=1,\n            BOARD_GRID!$K$4,\n            INDEX(BOARD_GRID!$B$5:$H$11,ROW()-ROW($A$230),VALUE($B$223))\n        ),\n        INDEX(BOARD_GRID!$B$5:$H$11,ROW()-ROW($A$230)+1,COLUMN()-COLUMN($A$230)+1)\n    ),\nIF($B$222=\"D\",\n    IF(COLUMN()-COLUMN($A$230)+1=VALUE($B$223),\n        IF(ROW()-ROW($A$230)+1=7,\n            BOARD_GRID!$K$4,\n            INDEX(BOARD_GRID!$B$5:$H$11,ROW()-ROW($A$230)+2,VALUE($B$223))\n        ),\n        INDEX(BOARD_GRID!$B$5:$H$11,ROW()-ROW($A$230)+1,COLUMN()-COLUMN($A$230)+1)\n    ),\n\"\")))))","v":""},{"$f":"IF($B$222=\"\",\"\",IF($B$222=\"L\",\n    IF(ROW()-ROW($A$230)+1=VALUE($B$223),\n        IF(COLUMN()-COLUMN($A$230)+1=1,\n            BOARD_GRID!$K$4,\n            INDEX(BOARD_GRID!$B$5:$H$11,VALUE($B$223),COLUMN()-COLUMN($A$230))\n        ),\n        INDEX(BOARD_GRID!$B$5:$H$11,ROW()-ROW($A$230)+1,COLUMN()-COLUMN($A$230)+1)\n    ),\nIF($B$222=\"R\",\n    IF(ROW()-ROW($A$230)+1=VALUE($B$223),\n        IF(COLUMN()-COLUMN($A$230)+1=7,\n            BOARD_GRID!$K$4,\n            INDEX(BOARD_GRID!$B$5:$H$11,VALUE($B$223),COLUMN()-COLUMN($A$230)+2)\n        ),\n        INDEX(BOARD_GRID!$B$5:$H$11,ROW()-ROW($A$230)+1,COLUMN()-COLUMN($A$230)+1)\n    ),\nIF($B$222=\"U\",\n    IF(COLUMN()-COLUMN($A$230)+1=VALUE($B$223),\n        IF(ROW()-ROW($A$230)+1=1,\n            BOARD_GRID!$K$4,\n            INDEX(BOARD_GRID!$B$5:$H$11,ROW()-ROW($A$230),VALUE($B$223))\n        ),\n        INDEX(BOARD_GRID!$B$5:$H$11,ROW()-ROW($A$230)+1,COLUMN()-COLUMN($A$230)+1)\n    ),\nIF($B$222=\"D\",\n    IF(COLUMN()-COLUMN($A$230)+1=VALUE($B$223),\n        IF(ROW()-ROW($A$230)+1=7,\n            BOARD_GRID!$K$4,\n            INDEX(BOARD_GRID!$B$5:$H$11,ROW()-ROW($A$230)+2,VALUE($B$223))\n        ),\n        INDEX(BOARD_GRID!$B$5:$H$11,ROW()-ROW($A$230)+1,COLUMN()-COLUMN($A$230)+1)\n    ),\n\"\")))))","v":""},{"$f":"IF($B$222=\"\",\"\",IF($B$222=\"L\",\n    IF(ROW()-ROW($A$230)+1=VALUE($B$223),\n        IF(COLUMN()-COLUMN($A$230)+1=1,\n            BOARD_GRID!$K$4,\n            INDEX(BOARD_GRID!$B$5:$H$11,VALUE($B$223),COLUMN()-COLUMN($A$230))\n        ),\n        INDEX(BOARD_GRID!$B$5:$H$11,ROW()-ROW($A$230)+1,COLUMN()-COLUMN($A$230)+1)\n    ),\nIF($B$222=\"R\",\n    IF(ROW()-ROW($A$230)+1=VALUE($B$223),\n        IF(COLUMN()-COLUMN($A$230)+1=7,\n            BOARD_GRID!$K$4,\n            INDEX(BOARD_GRID!$B$5:$H$11,VALUE($B$223),COLUMN()-COLUMN($A$230)+2)\n        ),\n        INDEX(BOARD_GRID!$B$5:$H$11,ROW()-ROW($A$230)+1,COLUMN()-COLUMN($A$230)+1)\n    ),\nIF($B$222=\"U\",\n    IF(COLUMN()-COLUMN($A$230)+1=VALUE($B$223),\n        IF(ROW()-ROW($A$230)+1=1,\n            BOARD_GRID!$K$4,\n            INDEX(BOARD_GRID!$B$5:$H$11,ROW()-ROW($A$230),VALUE($B$223))\n        ),\n        INDEX(BOARD_GRID!$B$5:$H$11,ROW()-ROW($A$230)+1,COLUMN()-COLUMN($A$230)+1)\n    ),\nIF($B$222=\"D\",\n    IF(COLUMN()-COLUMN($A$230)+1=VALUE($B$223),\n        IF(ROW()-ROW($A$230)+1=7,\n            BOARD_GRID!$K$4,\n            INDEX(BOARD_GRID!$B$5:$H$11,ROW()-ROW($A$230)+2,VALUE($B$223))\n        ),\n        INDEX(BOARD_GRID!$B$5:$H$11,ROW()-ROW($A$230)+1,COLUMN()-COLUMN($A$230)+1)\n    ),\n\"\")))))","v":""},{"$f":"IF($B$222=\"\",\"\",IF($B$222=\"L\",\n    IF(ROW()-ROW($A$230)+1=VALUE($B$223),\n        IF(COLUMN()-COLUMN($A$230)+1=1,\n            BOARD_GRID!$K$4,\n            INDEX(BOARD_GRID!$B$5:$H$11,VALUE($B$223),COLUMN()-COLUMN($A$230))\n        ),\n        INDEX(BOARD_GRID!$B$5:$H$11,ROW()-ROW($A$230)+1,COLUMN()-COLUMN($A$230)+1)\n    ),\nIF($B$222=\"R\",\n    IF(ROW()-ROW($A$230)+1=VALUE($B$223),\n        IF(COLUMN()-COLUMN($A$230)+1=7,\n            BOARD_GRID!$K$4,\n            INDEX(BOARD_GRID!$B$5:$H$11,VALUE($B$223),COLUMN()-COLUMN($A$230)+2)\n        ),\n        INDEX(BOARD_GRID!$B$5:$H$11,ROW()-ROW($A$230)+1,COLUMN()-COLUMN($A$230)+1)\n    ),\nIF($B$222=\"U\",\n    IF(COLUMN()-COLUMN($A$230)+1=VALUE($B$223),\n        IF(ROW()-ROW($A$230)+1=1,\n            BOARD_GRID!$K$4,\n            INDEX(BOARD_GRID!$B$5:$H$11,ROW()-ROW($A$230),VALUE($B$223))\n        ),\n        INDEX(BOARD_GRID!$B$5:$H$11,ROW()-ROW($A$230)+1,COLUMN()-COLUMN($A$230)+1)\n    ),\nIF($B$222=\"D\",\n    IF(COLUMN()-COLUMN($A$230)+1=VALUE($B$223),\n        IF(ROW()-ROW($A$230)+1=7,\n            BOARD_GRID!$K$4,\n            INDEX(BOARD_GRID!$B$5:$H$11,ROW()-ROW($A$230)+2,VALUE($B$223))\n        ),\n        INDEX(BOARD_GRID!$B$5:$H$11,ROW()-ROW($A$230)+1,COLUMN()-COLUMN($A$230)+1)\n    ),\n\"\")))))","v":""},{"$f":"IF($B$222=\"\",\"\",IF($B$222=\"L\",\n    IF(ROW()-ROW($A$230)+1=VALUE($B$223),\n        IF(COLUMN()-COLUMN($A$230)+1=1,\n            BOARD_GRID!$K$4,\n            INDEX(BOARD_GRID!$B$5:$H$11,VALUE($B$223),COLUMN()-COLUMN($A$230))\n        ),\n        INDEX(BOARD_GRID!$B$5:$H$11,ROW()-ROW($A$230)+1,COLUMN()-COLUMN($A$230)+1)\n    ),\nIF($B$222=\"R\",\n    IF(ROW()-ROW($A$230)+1=VALUE($B$223),\n        IF(COLUMN()-COLUMN($A$230)+1=7,\n            BOARD_GRID!$K$4,\n            INDEX(BOARD_GRID!$B$5:$H$11,VALUE($B$223),COLUMN()-COLUMN($A$230)+2)\n        ),\n        INDEX(BOARD_GRID!$B$5:$H$11,ROW()-ROW($A$230)+1,COLUMN()-COLUMN($A$230)+1)\n    ),\nIF($B$222=\"U\",\n    IF(COLUMN()-COLUMN($A$230)+1=VALUE($B$223),\n        IF(ROW()-ROW($A$230)+1=1,\n            BOARD_GRID!$K$4,\n            INDEX(BOARD_GRID!$B$5:$H$11,ROW()-ROW($A$230),VALUE($B$223))\n        ),\n        INDEX(BOARD_GRID!$B$5:$H$11,ROW()-ROW($A$230)+1,COLUMN()-COLUMN($A$230)+1)\n    ),\nIF($B$222=\"D\",\n    IF(COLUMN()-COLUMN($A$230)+1=VALUE($B$223),\n        IF(ROW()-ROW($A$230)+1=7,\n            BOARD_GRID!$K$4,\n            INDEX(BOARD_GRID!$B$5:$H$11,ROW()-ROW($A$230)+2,VALUE($B$223))\n        ),\n        INDEX(BOARD_GRID!$B$5:$H$11,ROW()-ROW($A$230)+1,COLUMN()-COLUMN($A$230)+1)\n    ),\n\"\")))))","v":""},{"$f":"IF($B$222=\"\",\"\",IF($B$222=\"L\",\n    IF(ROW()-ROW($A$230)+1=VALUE($B$223),\n        IF(COLUMN()-COLUMN($A$230)+1=1,\n            BOARD_GRID!$K$4,\n            INDEX(BOARD_GRID!$B$5:$H$11,VALUE($B$223),COLUMN()-COLUMN($A$230))\n        ),\n        INDEX(BOARD_GRID!$B$5:$H$11,ROW()-ROW($A$230)+1,COLUMN()-COLUMN($A$230)+1)\n    ),\nIF($B$222=\"R\",\n    IF(ROW()-ROW($A$230)+1=VALUE($B$223),\n        IF(COLUMN()-COLUMN($A$230)+1=7,\n            BOARD_GRID!$K$4,\n            INDEX(BOARD_GRID!$B$5:$H$11,VALUE($B$223),COLUMN()-COLUMN($A$230)+2)\n        ),\n        INDEX(BOARD_GRID!$B$5:$H$11,ROW()-ROW($A$230)+1,COLUMN()-COLUMN($A$230)+1)\n    ),\nIF($B$222=\"U\",\n    IF(COLUMN()-COLUMN($A$230)+1=VALUE($B$223),\n        IF(ROW()-ROW($A$230)+1=1,\n            BOARD_GRID!$K$4,\n            INDEX(BOARD_GRID!$B$5:$H$11,ROW()-ROW($A$230),VALUE($B$223))\n        ),\n        INDEX(BOARD_GRID!$B$5:$H$11,ROW()-ROW($A$230)+1,COLUMN()-COLUMN($A$230)+1)\n    ),\nIF($B$222=\"D\",\n    IF(COLUMN()-COLUMN($A$230)+1=VALUE($B$223),\n        IF(ROW()-ROW($A$230)+1=7,\n            BOARD_GRID!$K$4,\n            INDEX(BOARD_GRID!$B$5:$H$11,ROW()-ROW($A$230)+2,VALUE($B$223))\n        ),\n        INDEX(BOARD_GRID!$B$5:$H$11,ROW()-ROW($A$230)+1,COLUMN()-COLUMN($A$230)+1)\n    ),\n\"\")))))","v":""}]
[{"$f":"IF($B$222=\"\",\"\",IF($B$222=\"L\",\n    IF(ROW()-ROW($A$230)+1=VALUE($B$223),\n        IF(COLUMN()-COLUMN($A$230)+1=1,\n            BOARD_GRID!$K$4,\n            INDEX(BOARD_GRID!$B$5:$H$11,VALUE($B$223),COLUMN()-COLUMN($A$230))\n        ),\n        INDEX(BOARD_GRID!$B$5:$H$11,ROW()-ROW($A$230)+1,COLUMN()-COLUMN($A$230)+1)\n    ),\nIF($B$222=\"R\",\n    IF(ROW()-ROW($A$230)+1=VALUE($B$223),\n        IF(COLUMN()-COLUMN($A$230)+1=7,\n            BOARD_GRID!$K$4,\n            INDEX(BOARD_GRID!$B$5:$H$11,VALUE($B$223),COLUMN()-COLUMN($A$230)+2)\n        ),\n        INDEX(BOARD_GRID!$B$5:$H$11,ROW()-ROW($A$230)+1,COLUMN()-COLUMN($A$230)+1)\n    ),\nIF($B$222=\"U\",\n    IF(COLUMN()-COLUMN($A$230)+1=VALUE($B$223),\n        IF(ROW()-ROW($A$230)+1=1,\n            BOARD_GRID!$K$4,\n            INDEX(BOARD_GRID!$B$5:$H$11,ROW()-ROW($A$230),VALUE($B$223))\n        ),\n        INDEX(BOARD_GRID!$B$5:$H$11,ROW()-ROW($A$230)+1,COLUMN()-COLUMN($A$230)+1)\n    ),\nIF($B$222=\"D\",\n    IF(COLUMN()-COLUMN($A$230)+1=VALUE($B$223),\n        IF(ROW()-ROW($A$230)+1=7,\n            BOARD_GRID!$K$4,\n            INDEX(BOARD_GRID!$B$5:$H$11,ROW()-ROW($A$230)+2,VALUE($B$223))\n        ),\n        INDEX(BOARD_GRID!$B$5:$H$11,ROW()-ROW($A$230)+1,COLUMN()-COLUMN($A$230)+1)\n    ),\n\"\")))))","v":""},{"$f":"IF($B$222=\"\",\"\",IF($B$222=\"L\",\n    IF(ROW()-ROW($A$230)+1=VALUE($B$223),\n        IF(COLUMN()-COLUMN($A$230)+1=1,\n            BOARD_GRID!$K$4,\n            INDEX(BOARD_GRID!$B$5:$H$11,VALUE($B$223),COLUMN()-COLUMN($A$230))\n        ),\n        INDEX(BOARD_GRID!$B$5:$H$11,ROW()-ROW($A$230)+1,COLUMN()-COLUMN($A$230)+1)\n    ),\nIF($B$222=\"R\",\n    IF(ROW()-ROW($A$230)+1=VALUE($B$223),\n        IF(COLUMN()-COLUMN($A$230)+1=7,\n            BOARD_GRID!$K$4,\n            INDEX(BOARD_GRID!$B$5:$H$11,VALUE($B$223),COLUMN()-COLUMN($A$230)+2)\n        ),\n        INDEX(BOARD_GRID!$B$5:$H$11,ROW()-ROW($A$230)+1,COLUMN()-COLUMN($A$230)+1)\n    ),\nIF($B$222=\"U\",\n    IF(COLUMN()-COLUMN($A$230)+1=VALUE($B$223),\n        IF(ROW()-ROW($A$230)+1=1,\n            BOARD_GRID!$K$4,\n            INDEX(BOARD_GRID!$B$5:$H$11,ROW()-ROW($A$230),VALUE($B$223))\n        ),\n        INDEX(BOARD_GRID!$B$5:$H$11,ROW()-ROW($A$230)+1,COLUMN()-COLUMN($A$230)+1)\n    ),\nIF($B$222=\"D\",\n    IF(COLUMN()-COLUMN($A$230)+1=VALUE($B$223),\n        IF(ROW()-ROW($A$230)+1=7,\n            BOARD_GRID!$K$4,\n            INDEX(BOARD_GRID!$B$5:$H$11,ROW()-ROW($A$230)+2,VALUE($B$223))\n        ),\n        INDEX(BOARD_GRID!$B$5:$H$11,ROW()-ROW($A$230)+1,COLUMN()-COLUMN($A$230)+1)\n    ),\n\"\")))))","v":""},{"$f":"IF($B$222=\"\",\"\",IF($B$222=\"L\",\n    IF(ROW()-ROW($A$230)+1=VALUE($B$223),\n        IF(COLUMN()-COLUMN($A$230)+1=1,\n            BOARD_GRID!$K$4,\n            INDEX(BOARD_GRID!$B$5:$H$11,VALUE($B$223),COLUMN()-COLUMN($A$230))\n        ),\n        INDEX(BOARD_GRID!$B$5:$H$11,ROW()-ROW($A$230)+1,COLUMN()-COLUMN($A$230)+1)\n    ),\nIF($B$222=\"R\",\n    IF(ROW()-ROW($A$230)+1=VALUE($B$223),\n        IF(COLUMN()-COLUMN($A$230)+1=7,\n            BOARD_GRID!$K$4,\n            INDEX(BOARD_GRID!$B$5:$H$11,VALUE($B$223),COLUMN()-COLUMN($A$230)+2)\n        ),\n        INDEX(BOARD_GRID!$B$5:$H$11,ROW()-ROW($A$230)+1,COLUMN()-COLUMN($A$230)+1)\n    ),\nIF($B$222=\"U\",\n    IF(COLUMN()-COLUMN($A$230)+1=VALUE($B$223),\n        IF(ROW()-ROW($A$230)+1=1,\n            BOARD_GRID!$K$4,\n            INDEX(BOARD_GRID!$B$5:$H$11,ROW()-ROW($A$230),VALUE($B$223))\n        ),\n        INDEX(BOARD_GRID!$B$5:$H$11,ROW()-ROW($A$230)+1,COLUMN()-COLUMN($A$230)+1)\n    ),\nIF($B$222=\"D\",\n    IF(COLUMN()-COLUMN($A$230)+1=VALUE($B$223),\n        IF(ROW()-ROW($A$230)+1=7,\n            BOARD_GRID!$K$4,\n            INDEX(BOARD_GRID!$B$5:$H$11,ROW()-ROW($A$230)+2,VALUE($B$223))\n        ),\n        INDEX(BOARD_GRID!$B$5:$H$11,ROW()-ROW($A$230)+1,COLUMN()-COLUMN($A$230)+1)\n    ),\n\"\")))))","v":""},{"$f":"IF($B$222=\"\",\"\",IF($B$222=\"L\",\n    IF(ROW()-ROW($A$230)+1=VALUE($B$223),\n        IF(COLUMN()-COLUMN($A$230)+1=1,\n            BOARD_GRID!$K$4,\n            INDEX(BOARD_GRID!$B$5:$H$11,VALUE($B$223),COLUMN()-COLUMN($A$230))\n        ),\n        INDEX(BOARD_GRID!$B$5:$H$11,ROW()-ROW($A$230)+1,COLUMN()-COLUMN($A$230)+1)\n    ),\nIF($B$222=\"R\",\n    IF(ROW()-ROW($A$230)+1=VALUE($B$223),\n        IF(COLUMN()-COLUMN($A$230)+1=7,\n            BOARD_GRID!$K$4,\n            INDEX(BOARD_GRID!$B$5:$H$11,VALUE($B$223),COLUMN()-COLUMN($A$230)+2)\n        ),\n        INDEX(BOARD_GRID!$B$5:$H$11,ROW()-ROW($A$230)+1,COLUMN()-COLUMN($A$230)+1)\n    ),\nIF($B$222=\"U\",\n    IF(COLUMN()-COLUMN($A$230)+1=VALUE($B$223),\n        IF(ROW()-ROW($A$230)+1=1,\n            BOARD_GRID!$K$4,\n            INDEX(BOARD_GRID!$B$5:$H$11,ROW()-ROW($A$230),VALUE($B$223))\n        ),\n        INDEX(BOARD_GRID!$B$5:$H$11,ROW()-ROW($A$230)+1,COLUMN()-COLUMN($A$230)+1)\n    ),\nIF($B$222=\"D\",\n    IF(COLUMN()-COLUMN($A$230)+1=VALUE($B$223),\n        IF(ROW()-ROW($A$230)+1=7,\n            BOARD_GRID!$K$4,\n            INDEX(BOARD_GRID!$B$5:$H$11,ROW()-ROW($A$230)+2,VALUE($B$223))\n        ),\n        INDEX(BOARD_GRID!$B$5:$H$11,ROW()-ROW($A$230)+1,COLUMN()-COLUMN($A$230)+1)\n    ),\n\"\")))))","v":""},{"$f":"IF($B$222=\"\",\"\",IF($B$222=\"L\",\n    IF(ROW()-ROW($A$230)+1=VALUE($B$223),\n        IF(COLUMN()-COLUMN($A$230)+1=1,\n            BOARD_GRID!$K$4,\n            INDEX(BOARD_GRID!$B$5:$H$11,VALUE($B$223),COLUMN()-COLUMN($A$230))\n        ),\n        INDEX(BOARD_GRID!$B$5:$H$11,ROW()-ROW($A$230)+1,COLUMN()-COLUMN($A$230)+1)\n    ),\nIF($B$222=\"R\",\n    IF(ROW()-ROW($A$230)+1=VALUE($B$223),\n        IF(COLUMN()-COLUMN($A$230)+1=7,\n            BOARD_GRID!$K$4,\n            INDEX(BOARD_GRID!$B$5:$H$11,VALUE($B$223),COLUMN()-COLUMN($A$230)+2)\n        ),\n        INDEX(BOARD_GRID!$B$5:$H$11,ROW()-ROW($A$230)+1,COLUMN()-COLUMN($A$230)+1)\n    ),\nIF($B$222=\"U\",\n    IF(COLUMN()-COLUMN($A$230)+1=VALUE($B$223),\n        IF(ROW()-ROW($A$230)+1=1,\n            BOARD_GRID!$K$4,\n            INDEX(BOARD_GRID!$B$5:$H$11,ROW()-ROW($A$230),VALUE($B$223))\n        ),\n        INDEX(BOARD_GRID!$B$5:$H$11,ROW()-ROW($A$230)+1,COLUMN()-COLUMN($A$230)+1)\n    ),\nIF($B$222=\"D\",\n    IF(COLUMN()-COLUMN($A$230)+1=VALUE($B$223),\n        IF(ROW()-ROW($A$230)+1=7,\n            BOARD_GRID!$K$4,\n            INDEX(BOARD_GRID!$B$5:$H$11,ROW()-ROW($A$230)+2,VALUE($B$223))\n        ),\n        INDEX(BOARD_GRID!$B$5:$H$11,ROW()-ROW($A$230)+1,COLUMN()-COLUMN($A$230)+1)\n    ),\n\"\")))))","v":""},{"$f":"IF($B$222=\"\",\"\",IF($B$222=\"L\",\n    IF(ROW()-ROW($A$230)+1=VALUE($B$223),\n        IF(COLUMN()-COLUMN($A$230)+1=1,\n            BOARD_GRID!$K$4,\n            INDEX(BOARD_GRID!$B$5:$H$11,VALUE($B$223),COLUMN()-COLUMN($A$230))\n        ),\n        INDEX(BOARD_GRID!$B$5:$H$11,ROW()-ROW($A$230)+1,COLUMN()-COLUMN($A$230)+1)\n    ),\nIF($B$222=\"R\",\n    IF(ROW()-ROW($A$230)+1=VALUE($B$223),\n        IF(COLUMN()-COLUMN($A$230)+1=7,\n            BOARD_GRID!$K$4,\n            INDEX(BOARD_GRID!$B$5:$H$11,VALUE($B$223),COLUMN()-COLUMN($A$230)+2)\n        ),\n        INDEX(BOARD_GRID!$B$5:$H$11,ROW()-ROW($A$230)+1,COLUMN()-COLUMN($A$230)+1)\n    ),\nIF($B$222=\"U\",\n    IF(COLUMN()-COLUMN($A$230)+1=VALUE($B$223),\n        IF(ROW()-ROW($A$230)+1=1,\n            BOARD_GRID!$K$4,\n            INDEX(BOARD_GRID!$B$5:$H$11,ROW()-ROW($A$230),VALUE($B$223))\n        ),\n        INDEX(BOARD_GRID!$B$5:$H$11,ROW()-ROW($A$230)+1,COLUMN()-COLUMN($A$230)+1)\n    ),\nIF($B$222=\"D\",\n    IF(COLUMN()-COLUMN($A$230)+1=VALUE($B$223),\n        IF(ROW()-ROW($A$230)+1=7,\n            BOARD_GRID!$K$4,\n            INDEX(BOARD_GRID!$B$5:$H$11,ROW()-ROW($A$230)+2,VALUE($B$223))\n        ),\n        INDEX(BOARD_GRID!$B$5:$H$11,ROW()-ROW($A$230)+1,COLUMN()-COLUMN($A$230)+1)\n    ),\n\"\")))))","v":""},{"$f":"IF($B$222=\"\",\"\",IF($B$222=\"L\",\n    IF(ROW()-ROW($A$230)+1=VALUE($B$223),\n        IF(COLUMN()-COLUMN($A$230)+1=1,\n            BOARD_GRID!$K$4,\n            INDEX(BOARD_GRID!$B$5:$H$11,VALUE($B$223),COLUMN()-COLUMN($A$230))\n        ),\n        INDEX(BOARD_GRID!$B$5:$H$11,ROW()-ROW($A$230)+1,COLUMN()-COLUMN($A$230)+1)\n    ),\nIF($B$222=\"R\",\n    IF(ROW()-ROW($A$230)+1=VALUE($B$223),\n        IF(COLUMN()-COLUMN($A$230)+1=7,\n            BOARD_GRID!$K$4,\n            INDEX(BOARD_GRID!$B$5:$H$11,VALUE($B$223),COLUMN()-COLUMN($A$230)+2)\n        ),\n        INDEX(BOARD_GRID!$B$5:$H$11,ROW()-ROW($A$230)+1,COLUMN()-COLUMN($A$230)+1)\n    ),\nIF($B$222=\"U\",\n    IF(COLUMN()-COLUMN($A$230)+1=VALUE($B$223),\n        IF(ROW()-ROW($A$230)+1=1,\n            BOARD_GRID!$K$4,\n            INDEX(BOARD_GRID!$B$5:$H$11,ROW()-ROW($A$230),VALUE($B$223))\n        ),\n        INDEX(BOARD_GRID!$B$5:$H$11,ROW()-ROW($A$230)+1,COLUMN()-COLUMN($A$230)+1)\n    ),\nIF($B$222=\"D\",\n    IF(COLUMN()-COLUMN($A$230)+1=VALUE($B$223),\n        IF(ROW()-ROW($A$230)+1=7,\n            BOARD_GRID!$K$4,\n            INDEX(BOARD_GRID!$B$5:$H$11,ROW()-ROW($A$230)+2,VALUE($B$223))\n        ),\n        INDEX(BOARD_GRID!$B$5:$H$11,ROW()-ROW($A$230)+1,COLUMN()-COLUMN($A$230)+1)\n    ),\n\"\")))))","v":""}]
[{"$f":"IF($B$222=\"\",\"\",IF($B$222=\"L\",\n    IF(ROW()-ROW($A$230)+1=VALUE($B$223),\n        IF(COLUMN()-COLUMN($A$230)+1=1,\n            BOARD_GRID!$K$4,\n            INDEX(BOARD_GRID!$B$5:$H$11,VALUE($B$223),COLUMN()-COLUMN($A$230))\n        ),\n        INDEX(BOARD_GRID!$B$5:$H$11,ROW()-ROW($A$230)+1,COLUMN()-COLUMN($A$230)+1)\n    ),\nIF($B$222=\"R\",\n    IF(ROW()-ROW($A$230)+1=VALUE($B$223),\n        IF(COLUMN()-COLUMN($A$230)+1=7,\n            BOARD_GRID!$K$4,\n            INDEX(BOARD_GRID!$B$5:$H$11,VALUE($B$223),COLUMN()-COLUMN($A$230)+2)\n        ),\n        INDEX(BOARD_GRID!$B$5:$H$11,ROW()-ROW($A$230)+1,COLUMN()-COLUMN($A$230)+1)\n    ),\nIF($B$222=\"U\",\n    IF(COLUMN()-COLUMN($A$230)+1=VALUE($B$223),\n        IF(ROW()-ROW($A$230)+1=1,\n            BOARD_GRID!$K$4,\n            INDEX(BOARD_GRID!$B$5:$H$11,ROW()-ROW($A$230),VALUE($B$223))\n        ),\n        INDEX(BOARD_GRID!$B$5:$H$11,ROW()-ROW($A$230)+1,COLUMN()-COLUMN($A$230)+1)\n    ),\nIF($B$222=\"D\",\n    IF(COLUMN()-COLUMN($A$230)+1=VALUE($B$223),\n        IF(ROW()-ROW($A$230)+1=7,\n            BOARD_GRID!$K$4,\n            INDEX(BOARD_GRID!$B$5:$H$11,ROW()-ROW($A$230)+2,VALUE($B$223))\n        ),\n        INDEX(BOARD_GRID!$B$5:$H$11,ROW()-ROW($A$230)+1,COLUMN()-COLUMN($A$230)+1)\n    ),\n\"\")))))","v":""},{"$f":"IF($B$222=\"\",\"\",IF($B$222=\"L\",\n    IF(ROW()-ROW($A$230)+1=VALUE($B$223),\n        IF(COLUMN()-COLUMN($A$230)+1=1,\n            BOARD_GRID!$K$4,\n            INDEX(BOARD_GRID!$B$5:$H$11,VALUE($B$223),COLUMN()-COLUMN($A$230))\n        ),\n        INDEX(BOARD_GRID!$B$5:$H$11,ROW()-ROW($A$230)+1,COLUMN()-COLUMN($A$230)+1)\n    ),\nIF($B$222=\"R\",\n    IF(ROW()-ROW($A$230)+1=VALUE($B$223),\n        IF(COLUMN()-COLUMN($A$230)+1=7,\n            BOARD_GRID!$K$4,\n            INDEX(BOARD_GRID!$B$5:$H$11,VALUE($B$223),COLUMN()-COLUMN($A$230)+2)\n        ),\n        INDEX(BOARD_GRID!$B$5:$H$11,ROW()-ROW($A$230)+1,COLUMN()-COLUMN($A$230)+1)\n    ),\nIF($B$222=\"U\",\n    IF(COLUMN()-COLUMN($A$230)+1=VALUE($B$223),\n        IF(ROW()-ROW($A$230)+1=1,\n            BOARD_GRID!$K$4,\n            INDEX(BOARD_GRID!$B$5:$H$11,ROW()-ROW($A$230),VALUE($B$223))\n        ),\n        INDEX(BOARD_GRID!$B$5:$H$11,ROW()-ROW($A$230)+1,COLUMN()-COLUMN($A$230)+1)\n    ),\nIF($B$222=\"D\",\n    IF(COLUMN()-COLUMN($A$230)+1=VALUE($B$223),\n        IF(ROW()-ROW($A$230)+1=7,\n            BOARD_GRID!$K$4,\n            INDEX(BOARD_GRID!$B$5:$H$11,ROW()-ROW($A$230)+2,VALUE($B$223))\n        ),\n        INDEX(BOARD_GRID!$B$5:$H$11,ROW()-ROW($A$230)+1,COLUMN()-COLUMN($A$230)+1)\n    ),\n\"\")))))","v":""},{"$f":"IF($B$222=\"\",\"\",IF($B$222=\"L\",\n    IF(ROW()-ROW($A$230)+1=VALUE($B$223),\n        IF(COLUMN()-COLUMN($A$230)+1=1,\n            BOARD_GRID!$K$4,\n            INDEX(BOARD_GRID!$B$5:$H$11,VALUE($B$223),COLUMN()-COLUMN($A$230))\n        ),\n        INDEX(BOARD_GRID!$B$5:$H$11,ROW()-ROW($A$230)+1,COLUMN()-COLUMN($A$230)+1)\n    ),\nIF($B$222=\"R\",\n    IF(ROW()-ROW($A$230)+1=VALUE($B$223),\n        IF(COLUMN()-COLUMN($A$230)+1=7,\n            BOARD_GRID!$K$4,\n            INDEX(BOARD_GRID!$B$5:$H$11,VALUE($B$223),COLUMN()-COLUMN($A$230)+2)\n        ),\n        INDEX(BOARD_GRID!$B$5:$H$11,ROW()-ROW($A$230)+1,COLUMN()-COLUMN($A$230)+1)\n    ),\nIF($B$222=\"U\",\n    IF(COLUMN()-COLUMN($A$230)+1=VALUE($B$223),\n        IF(ROW()-ROW($A$230)+1=1,\n            BOARD_GRID!$K$4,\n            INDEX(BOARD_GRID!$B$5:$H$11,ROW()-ROW($A$230),VALUE($B$223))\n        ),\n        INDEX(BOARD_GRID!$B$5:$H$11,ROW()-ROW($A$230)+1,COLUMN()-COLUMN($A$230)+1)\n    ),\nIF($B$222=\"D\",\n    IF(COLUMN()-COLUMN($A$230)+1=VALUE($B$223),\n        IF(ROW()-ROW($A$230)+1=7,\n            BOARD_GRID!$K$4,\n            INDEX(BOARD_GRID!$B$5:$H$11,ROW()-ROW($A$230)+2,VALUE($B$223))\n        ),\n        INDEX(BOARD_GRID!$B$5:$H$11,ROW()-ROW($A$230)+1,COLUMN()-COLUMN($A$230)+1)\n    ),\n\"\")))))","v":""},{"$f":"IF($B$222=\"\",\"\",IF($B$222=\"L\",\n    IF(ROW()-ROW($A$230)+1=VALUE($B$223),\n        IF(COLUMN()-COLUMN($A$230)+1=1,\n            BOARD_GRID!$K$4,\n            INDEX(BOARD_GRID!$B$5:$H$11,VALUE($B$223),COLUMN()-COLUMN($A$230))\n        ),\n        INDEX(BOARD_GRID!$B$5:$H$11,ROW()-ROW($A$230)+1,COLUMN()-COLUMN($A$230)+1)\n    ),\nIF($B$222=\"R\",\n    IF(ROW()-ROW($A$230)+1=VALUE($B$223),\n        IF(COLUMN()-COLUMN($A$230)+1=7,\n            BOARD_GRID!$K$4,\n            INDEX(BOARD_GRID!$B$5:$H$11,VALUE($B$223),COLUMN()-COLUMN($A$230)+2)\n        ),\n        INDEX(BOARD_GRID!$B$5:$H$11,ROW()-ROW($A$230)+1,COLUMN()-COLUMN($A$230)+1)\n    ),\nIF($B$222=\"U\",\n    IF(COLUMN()-COLUMN($A$230)+1=VALUE($B$223),\n        IF(ROW()-ROW($A$230)+1=1,\n            BOARD_GRID!$K$4,\n            INDEX(BOARD_GRID!$B$5:$H$11,ROW()-ROW($A$230),VALUE($B$223))\n        ),\n        INDEX(BOARD_GRID!$B$5:$H$11,ROW()-ROW($A$230)+1,COLUMN()-COLUMN($A$230)+1)\n    ),\nIF($B$222=\"D\",\n    IF(COLUMN()-COLUMN($A$230)+1=VALUE($B$223),\n        IF(ROW()-ROW($A$230)+1=7,\n            BOARD_GRID!$K$4,\n            INDEX(BOARD_GRID!$B$5:$H$11,ROW()-ROW($A$230)+2,VALUE($B$223))\n        ),\n        INDEX(BOARD_GRID!$B$5:$H$11,ROW()-ROW($A$230)+1,COLUMN()-COLUMN($A$230)+1)\n    ),\n\"\")))))","v":""},{"$f":"IF($B$222=\"\",\"\",IF($B$222=\"L\",\n    IF(ROW()-ROW($A$230)+1=VALUE($B$223),\n        IF(COLUMN()-COLUMN($A$230)+1=1,\n            BOARD_GRID!$K$4,\n            INDEX(BOARD_GRID!$B$5:$H$11,VALUE($B$223),COLUMN()-COLUMN($A$230))\n        ),\n        INDEX(BOARD_GRID!$B$5:$H$11,ROW()-ROW($A$230)+1,COLUMN()-COLUMN($A$230)+1)\n    ),\nIF($B$222=\"R\",\n    IF(ROW()-ROW($A$230)+1=VALUE($B$223),\n        IF(COLUMN()-COLUMN($A$230)+1=7,\n            BOARD_GRID!$K$4,\n            INDEX(BOARD_GRID!$B$5:$H$11,VALUE($B$223),COLUMN()-COLUMN($A$230)+2)\n        ),\n        INDEX(BOARD_GRID!$B$5:$H$11,ROW()-ROW($A$230)+1,COLUMN()-COLUMN($A$230)+1)\n    ),\nIF($B$222=\"U\",\n    IF(COLUMN()-COLUMN($A$230)+1=VALUE($B$223),\n        IF(ROW()-ROW($A$230)+1=1,\n            BOARD_GRID!$K$4,\n            INDEX(BOARD_GRID!$B$5:$H$11,ROW()-ROW($A$230),VALUE($B$223))\n        ),\n        INDEX(BOARD_GRID!$B$5:$H$11,ROW()-ROW($A$230)+1,COLUMN()-COLUMN($A$230)+1)\n    ),\nIF($B$222=\"D\",\n    IF(COLUMN()-COLUMN($A$230)+1=VALUE($B$223),\n        IF(ROW()-ROW($A$230)+1=7,\n            BOARD_GRID!$K$4,\n            INDEX(BOARD_GRID!$B$5:$H$11,ROW()-ROW($A$230)+2,VALUE($B$223))\n        ),\n        INDEX(BOARD_GRID!$B$5:$H$11,ROW()-ROW($A$230)+1,COLUMN()-COLUMN($A$230)+1)\n    ),\n\"\")))))","v":""},{"$f":"IF($B$222=\"\",\"\",IF($B$222=\"L\",\n    IF(ROW()-ROW($A$230)+1=VALUE($B$223),\n        IF(COLUMN()-COLUMN($A$230)+1=1,\n            BOARD_GRID!$K$4,\n            INDEX(BOARD_GRID!$B$5:$H$11,VALUE($B$223),COLUMN()-COLUMN($A$230))\n        ),\n        INDEX(BOARD_GRID!$B$5:$H$11,ROW()-ROW($A$230)+1,COLUMN()-COLUMN($A$230)+1)\n    ),\nIF($B$222=\"R\",\n    IF(ROW()-ROW($A$230)+1=VALUE($B$223),\n        IF(COLUMN()-COLUMN($A$230)+1=7,\n            BOARD_GRID!$K$4,\n            INDEX(BOARD_GRID!$B$5:$H$11,VALUE($B$223),COLUMN()-COLUMN($A$230)+2)\n        ),\n        INDEX(BOARD_GRID!$B$5:$H$11,ROW()-ROW($A$230)+1,COLUMN()-COLUMN($A$230)+1)\n    ),\nIF($B$222=\"U\",\n    IF(COLUMN()-COLUMN($A$230)+1=VALUE($B$223),\n        IF(ROW()-ROW($A$230)+1=1,\n            BOARD_GRID!$K$4,\n            INDEX(BOARD_GRID!$B$5:$H$11,ROW()-ROW($A$230),VALUE($B$223))\n        ),\n        INDEX(BOARD_GRID!$B$5:$H$11,ROW()-ROW($A$230)+1,COLUMN()-COLUMN($A$230)+1)\n    ),\nIF($B$222=\"D\",\n    IF(COLUMN()-COLUMN($A$230)+1=VALUE($B$223),\n        IF(ROW()-ROW($A$230)+1=7,\n            BOARD_GRID!$K$4,\n            INDEX(BOARD_GRID!$B$5:$H$11,ROW()-ROW($A$230)+2,VALUE($B$223))\n        ),\n        INDEX(BOARD_GRID!$B$5:$H$11,ROW()-ROW($A$230)+1,COLUMN()-COLUMN($A$230)+1)\n    ),\n\"\")))))","v":""},{"$f":"IF($B$222=\"\",\"\",IF($B$222=\"L\",\n    IF(ROW()-ROW($A$230)+1=VALUE($B$223),\n        IF(COLUMN()-COLUMN($A$230)+1=1,\n            BOARD_GRID!$K$4,\n            INDEX(BOARD_GRID!$B$5:$H$11,VALUE($B$223),COLUMN()-COLUMN($A$230))\n        ),\n        INDEX(BOARD_GRID!$B$5:$H$11,ROW()-ROW($A$230)+1,COLUMN()-COLUMN($A$230)+1)\n    ),\nIF($B$222=\"R\",\n    IF(ROW()-ROW($A$230)+1=VALUE($B$223),\n        IF(COLUMN()-COLUMN($A$230)+1=7,\n            BOARD_GRID!$K$4,\n            INDEX(BOARD_GRID!$B$5:$H$11,VALUE($B$223),COLUMN()-COLUMN($A$230)+2)\n        ),\n        INDEX(BOARD_GRID!$B$5:$H$11,ROW()-ROW($A$230)+1,COLUMN()-COLUMN($A$230)+1)\n    ),\nIF($B$222=\"U\",\n    IF(COLUMN()-COLUMN($A$230)+1=VALUE($B$223),\n        IF(ROW()-ROW($A$230)+1=1,\n            BOARD_GRID!$K$4,\n            INDEX(BOARD_GRID!$B$5:$H$11,ROW()-ROW($A$230),VALUE($B$223))\n        ),\n        INDEX(BOARD_GRID!$B$5:$H$11,ROW()-ROW($A$230)+1,COLUMN()-COLUMN($A$230)+1)\n    ),\nIF($B$222=\"D\",\n    IF(COLUMN()-COLUMN($A$230)+1=VALUE($B$223),\n        IF(ROW()-ROW($A$230)+1=7,\n            BOARD_GRID!$K$4,\n            INDEX(BOARD_GRID!$B$5:$H$11,ROW()-ROW($A$230)+2,VALUE($B$223))\n        ),\n        INDEX(BOARD_GRID!$B$5:$H$11,ROW()-ROW($A$230)+1,COLUMN()-COLUMN($A$230)+1)\n    ),\n\"\")))))","v":""}]
[]
[]
["PREVIEW Rotation"]
[{"$f":"IF($B$222=\"\",\"\",IF($B$222=\"L\",\n    IF(ROW()-ROW($A$240)+1=VALUE($B$223),\n        IF(COLUMN()-COLUMN($A$240)+1=1,\n            IF($B$224=\"\",BOARD_GRID!$K$5,VALUE($B$224)),\n            INDEX(BOARD_GRID!$B$14:$H$20,VALUE($B$223),COLUMN()-COLUMN($A$240))\n        ),\n        INDEX(BOARD_GRID!$B$14:$H$20,ROW()-ROW($A$240)+1,COLUMN()-COLUMN($A$240)+1)\n    ),\nIF($B$222=\"R\",\n    IF(ROW()-ROW($A$240)+1=VALUE($B$223),\n        IF(COLUMN()-COLUMN($A$240)+1=7,\n            IF($B$224=\"\",BOARD_GRID!$K$5,VALUE($B$224)),\n            INDEX(BOARD_GRID!$B$14:$H$20,VALUE($B$223),COLUMN()-COLUMN($A$240)+2)\n        ),\n        INDEX(BOARD_GRID!$B$14:$H$20,ROW()-ROW($A$240)+1,COLUMN()-COLUMN($A$240)+1)\n    ),\nIF($B$222=\"U\",\n    IF(COLUMN()-COLUMN($A$240)+1=VALUE($B$223),\n        IF(ROW()-ROW($A$240)+1=1,\n            IF($B$224=\"\",BOARD_GRID!$K$5,VALUE($B$224)),\n            INDEX(BOARD_GRID!$B$14:$H$20,ROW()-ROW($A$240),VALUE($B$223))\n        ),\n        INDEX(BOARD_GRID!$B$14:$H$20,ROW()-ROW($A$240)+1,COLUMN()-COLUMN($A$240)+1)\n    ),\nIF($B$222=\"D\",\n    IF(COLUMN()-COLUMN($A$240)+1=VALUE($B$223),\n        IF(ROW()-ROW($A$240)+1=7,\n            IF($B$224=\"\",BOARD_GRID!$K$5,VALUE($B$224)),\n            INDEX(BOARD_GRID!$B$14:$H$20,ROW()-ROW($A$240)+2,VALUE($B$223))\n        ),\n        INDEX(BOARD_GRID!$B$14:$H$20,ROW()-ROW($A$240)+1,COLUMN()-COLUMN($A$240)+1)\n    ),\n\"\")))))","v":""},{"$f":"IF($B$222=\"\",\"\",IF($B$222=\"L\",\n    IF(ROW()-ROW($A$240)+1=VALUE($B$223),\n        IF(COLUMN()-COLUMN($A$240)+1=1,\n            IF($B$224=\"\",BOARD_GRID!$K$5,VALUE($B$224)),\n            INDEX(BOARD_GRID!$B$14:$H$20,VALUE($B$223),COLUMN()-COLUMN($A$240))\n        ),\n        INDEX(BOARD_GRID!$B$14:$H$20,ROW()-ROW($A$240)+1,COLUMN()-COLUMN($A$240)+1)\n    ),\nIF($B$222=\"R\",\n    IF(ROW()-ROW($A$240)+1=VALUE($B$223),\n        IF(COLUMN()-COLUMN($A$240)+1=7,\n            IF($B$224=\"\",BOARD_GRID!$K$5,VALUE($B$224)),\n            INDEX(BOARD_GRID!$B$14:$H$20,VALUE($B$223),COLUMN()-COLUMN($A$240)+2)\n        ),\n        INDEX(BOARD_GRID!$B$14:$H$20,ROW()-ROW($A$240)+1,COLUMN()-COLUMN($A$240)+1)\n    ),\nIF($B$222=\"U\",\n    IF(COLUMN()-COLUMN($A$240)+1=VALUE($B$223),\n        IF(ROW()-ROW($A$240)+1=1,\n            IF($B$224=\"\",BOARD_GRID!$K$5,VALUE($B$224)),\n            INDEX(BOARD_GRID!$B$14:$H$20,ROW()-ROW($A$240),VALUE($B$223))\n        ),\n        INDEX(BOARD_GRID!$B$14:$H$20,ROW()-ROW($A$240)+1,COLUMN()-COLUMN($A$240)+1)\n    ),\nIF($B$222=\"D\",\n    IF(COLUMN()-COLUMN($A$240)+1=VALUE($B$223),\n        IF(ROW()-ROW($A$240)+1=7,\n            IF($B$224=\"\",BOARD_GRID!$K$5,VALUE($B$224)),\n            INDEX(BOARD_GRID!$B$14:$H$20,ROW()-ROW($A$240)+2,VALUE($B$223))\n        ),\n        INDEX(BOARD_GRID!$B$14:$H$20,ROW()-ROW($A$240)+1,COLUMN()-COLUMN($A$240)+1)\n    ),\n\"\")))))","v":""},{"$f":"IF($B$222=\"\",\"\",IF($B$222=\"L\",\n    IF(ROW()-ROW($A$240)+1=VALUE($B$223),\n        IF(COLUMN()-COLUMN($A$240)+1=1,\n            IF($B$224=\"\",BOARD_GRID!$K$5,VALUE($B$224)),\n            INDEX(BOARD_GRID!$B$14:$H$20,VALUE($B$223),COLUMN()-COLUMN($A$240))\n        ),\n        INDEX(BOARD_GRID!$B$14:$H$20,ROW()-ROW($A$240)+1,COLUMN()-COLUMN($A$240)+1)\n    ),\nIF($B$222=\"R\",\n    IF(ROW()-ROW($A$240)+1=VALUE($B$223),\n        IF(COLUMN()-COLUMN($A$240)+1=7,\n            IF($B$224=\"\",BOARD_GRID!$K$5,VALUE($B$224)),\n            INDEX(BOARD_GRID!$B$14:$H$20,VALUE($B$223),COLUMN()-COLUMN($A$240)+2)\n        ),\n        INDEX(BOARD_GRID!$B$14:$H$20,ROW()-ROW($A$240)+1,COLUMN()-COLUMN($A$240)+1)\n    ),\nIF($B$222=\"U\",\n    IF(COLUMN()-COLUMN($A$240)+1=VALUE($B$223),\n        IF(ROW()-ROW($A$240)+1=1,\n            IF($B$224=\"\",BOARD_GRID!$K$5,VALUE($B$224)),\n            INDEX(BOARD_GRID!$B$14:$H$20,ROW()-ROW($A$240),VALUE($B$223))\n        ),\n        INDEX(BOARD_GRID!$B$14:$H$20,ROW()-ROW($A$240)+1,COLUMN()-COLUMN($A$240)+1)\n    ),\nIF($B$222=\"D\",\n    IF(COLUMN()-COLUMN($A$240)+1=VALUE($B$223),\n        IF(ROW()-ROW($A$240)+1=7,\n            IF($B$224=\"\",BOARD_GRID!$K$5,VALUE($B$224)),\n            INDEX(BOARD_GRID!$B$14:$H$20,ROW()-ROW($A$240)+2,VALUE($B$223))\n        ),\n        INDEX(BOARD_GRID!$B$14:$H$20,ROW()-ROW($A$240)+1,COLUMN()-COLUMN($A$240)+1)\n    ),\n\"\")))))","v":""},{"$f":"IF($B$222=\"\",\"\",IF($B$222=\"L\",\n    IF(ROW()-ROW($A$240)+1=VALUE($B$223),\n        IF(COLUMN()-COLUMN($A$240)+1=1,\n            IF($B$224=\"\",BOARD_GRID!$K$5,VALUE($B$224)),\n            INDEX(BOARD_GRID!$B$14:$H$20,VALUE($B$223),COLUMN()-COLUMN($A$240))\n        ),\n        INDEX(BOARD_GRID!$B$14:$H$20,ROW()-ROW($A$240)+1,COLUMN()-COLUMN($A$240)+1)\n    ),\nIF($B$222=\"R\",\n    IF(ROW()-ROW($A$240)+1=VALUE($B$223),\n        IF(COLUMN()-COLUMN($A$240)+1=7,\n            IF($B$224=\"\",BOARD_GRID!$K$5,VALUE($B$224)),\n            INDEX(BOARD_GRID!$B$14:$H$20,VALUE($B$223),COLUMN()-COLUMN($A$240)+2)\n        ),\n        INDEX(BOARD_GRID!$B$14:$H$20,ROW()-ROW($A$240)+1,COLUMN()-COLUMN($A$240)+1)\n    ),\nIF($B$222=\"U\",\n    IF(COLUMN()-COLUMN($A$240)+1=VALUE($B$223),\n        IF(ROW()-ROW($A$240)+1=1,\n            IF($B$224=\"\",BOARD_GRID!$K$5,VALUE($B$224)),\n            INDEX(BOARD_GRID!$B$14:$H$20,ROW()-ROW($A$240),VALUE($B$223))\n        ),\n        INDEX(BOARD_GRID!$B$14:$H$20,ROW()-ROW($A$240)+1,COLUMN()-COLUMN($A$240)+1)\n    ),\nIF($B$222=\"D\",\n    IF(COLUMN()-COLUMN($A$240)+1=VALUE($B$223),\n        IF(ROW()-ROW($A$240)+1=7,\n            IF($B$224=\"\",BOARD_GRID!$K$5,VALUE($B$224)),\n            INDEX(BOARD_GRID!$B$14:$H$20,ROW()-ROW($A$240)+2,VALUE($B$223))\n        ),\n        INDEX(BOARD_GRID!$B$14:$H$20,ROW()-ROW($A$240)+1,COLUMN()-COLUMN($A$240)+1)\n    ),\n\"\")))))","v":""},{"$f":"IF($B$222=\"\",\"\",IF($B$222=\"L\",\n    IF(ROW()-ROW($A$240)+1=VALUE($B$223),\n        IF(COLUMN()-COLUMN($A$240)+1=1,\n            IF($B$224=\"\",BOARD_GRID!$K$5,VALUE($B$224)),\n            INDEX(BOARD_GRID!$B$14:$H$20,VALUE($B$223),COLUMN()-COLUMN($A$240))\n        ),\n        INDEX(BOARD_GRID!$B$14:$H$20,ROW()-ROW($A$240)+1,COLUMN()-COLUMN($A$240)+1)\n    ),\nIF($B$222=\"R\",\n    IF(ROW()-ROW($A$240)+1=VALUE($B$223),\n        IF(COLUMN()-COLUMN($A$240)+1=7,\n            IF($B$224=\"\",BOARD_GRID!$K$5,VALUE($B$224)),\n            INDEX(BOARD_GRID!$B$14:$H$20,VALUE($B$223),COLUMN()-COLUMN($A$240)+2)\n        ),\n        INDEX(BOARD_GRID!$B$14:$H$20,ROW()-ROW($A$240)+1,COLUMN()-COLUMN($A$240)+1)\n    ),\nIF($B$222=\"U\",\n    IF(COLUMN()-COLUMN($A$240)+1=VALUE($B$223),\n        IF(ROW()-ROW($A$240)+1=1,\n            IF($B$224=\"\",BOARD_GRID!$K$5,VALUE($B$224)),\n            INDEX(BOARD_GRID!$B$14:$H$20,ROW()-ROW($A$240),VALUE($B$223))\n        ),\n        INDEX(BOARD_GRID!$B$14:$H$20,ROW()-ROW($A$240)+1,COLUMN()-COLUMN($A$240)+1)\n    ),\nIF($B$222=\"D\",\n    IF(COLUMN()-COLUMN($A$240)+1=VALUE($B$223),\n        IF(ROW()-ROW($A$240)+1=7,\n            IF($B$224=\"\",BOARD_GRID!$K$5,VALUE($B$224)),\n            INDEX(BOARD_GRID!$B$14:$H$20,ROW()-ROW($A$240)+2,VALUE($B$223))\n        ),\n        INDEX(BOARD_GRID!$B$14:$H$20,ROW()-ROW($A$240)+1,COLUMN()-COLUMN($A$240)+1)\n    ),\n\"\")))))","v":""},{"$f":"IF($B$222=\"\",\"\",IF($B$222=\"L\",\n    IF(ROW()-ROW($A$240)+1=VALUE($B$223),\n        IF(COLUMN()-COLUMN($A$240)+1=1,\n            IF($B$224=\"\",BOARD_GRID!$K$5,VALUE($B$224)),\n            INDEX(BOARD_GRID!$B$14:$H$20,VALUE($B$223),COLUMN()-COLUMN($A$240))\n        ),\n        INDEX(BOARD_GRID!$B$14:$H$20,ROW()-ROW($A$240)+1,COLUMN()-COLUMN($A$240)+1)\n    ),\nIF($B$222=\"R\",\n    IF(ROW()-ROW($A$240)+1=VALUE($B$223),\n        IF(COLUMN()-COLUMN($A$240)+1=7,\n            IF($B$224=\"\",BOARD_GRID!$K$5,VALUE($B$224)),\n            INDEX(BOARD_GRID!$B$14:$H$20,VALUE($B$223),COLUMN()-COLUMN($A$240)+2)\n        ),\n        INDEX(BOARD_GRID!$B$14:$H$20,ROW()-ROW($A$240)+1,COLUMN()-COLUMN($A$240)+1)\n    ),\nIF($B$222=\"U\",\n    IF(COLUMN()-COLUMN($A$240)+1=VALUE($B$223),\n        IF(ROW()-ROW($A$240)+1=1,\n            IF($B$224=\"\",BOARD_GRID!$K$5,VALUE($B$224)),\n            INDEX(BOARD_GRID!$B$14:$H$20,ROW()-ROW($A$240),VALUE($B$223))\n        ),\n        INDEX(BOARD_GRID!$B$14:$H$20,ROW()-ROW($A$240)+1,COLUMN()-COLUMN($A$240)+1)\n    ),\nIF($B$222=\"D\",\n    IF(COLUMN()-COLUMN($A$240)+1=VALUE($B$223),\n        IF(ROW()-ROW($A$240)+1=7,\n            IF($B$224=\"\",BOARD_GRID!$K$5,VALUE($B$224)),\n            INDEX(BOARD_GRID!$B$14:$H$20,ROW()-ROW($A$240)+2,VALUE($B$223))\n        ),\n        INDEX(BOARD_GRID!$B$14:$H$20,ROW()-ROW($A$240)+1,COLUMN()-COLUMN($A$240)+1)\n    ),\n\"\")))))","v":""},{"$f":"IF($B$222=\"\",\"\",IF($B$222=\"L\",\n    IF(ROW()-ROW($A$240)+1=VALUE($B$223),\n        IF(COLUMN()-COLUMN($A$240)+1=1,\n            IF($B$224=\"\",BOARD_GRID!$K$5,VALUE($B$224)),\n            INDEX(BOARD_GRID!$B$14:$H$20,VALUE($B$223),COLUMN()-COLUMN($A$240))\n        ),\n        INDEX(BOARD_GRID!$B$14:$H$20,ROW()-ROW($A$240)+1,COLUMN()-COLUMN($A$240)+1)\n    ),\nIF($B$222=\"R\",\n    IF(ROW()-ROW($A$240)+1=VALUE($B$223),\n        IF(COLUMN()-COLUMN($A$240)+1=7,\n            IF($B$224=\"\",BOARD_GRID!$K$5,VALUE($B$224)),\n            INDEX(BOARD_GRID!$B$14:$H$20,VALUE($B$223),COLUMN()-COLUMN($A$240)+2)\n        ),\n        INDEX(BOARD_GRID!$B$14:$H$20,ROW()-ROW($A$240)+1,COLUMN()-COLUMN($A$240)+1)\n    ),\nIF($B$222=\"U\",\n    IF(COLUMN()-COLUMN($A$240)+1=VALUE($B$223),\n        IF(ROW()-ROW($A$240)+1=1,\n            IF($B$224=\"\",BOARD_GRID!$K$5,VALUE($B$224)),\n            INDEX(BOARD_GRID!$B$14:$H$20,ROW()-ROW($A$240),VALUE($B$223))\n        ),\n        INDEX(BOARD_GRID!$B$14:$H$20,ROW()-ROW($A$240)+1,COLUMN()-COLUMN($A$240)+1)\n    ),\nIF($B$222=\"D\",\n    IF(COLUMN()-COLUMN($A$240)+1=VALUE($B$223),\n        IF(ROW()-ROW($A$240)+1=7,\n            IF($B$224=\"\",BOARD_GRID!$K$5,VALUE($B$224)),\n            INDEX(BOARD_GRID!$B$14:$H$20,ROW()-ROW($A$240)+2,VALUE($B$223))\n        ),\n        INDEX(BOARD_GRID!$B$14:$H$20,ROW()-ROW($A$240)+1,COLUMN()-COLUMN($A$240)+1)\n    ),\n\"\")))))","v":""}]
[{"$f":"IF($B$222=\"\",\"\",IF($B$222=\"L\",\n    IF(ROW()-ROW($A$240)+1=VALUE($B$223),\n        IF(COLUMN()-COLUMN($A$240)+1=1,\n            IF($B$224=\"\",BOARD_GRID!$K$5,VALUE($B$224)),\n            INDEX(BOARD_GRID!$B$14:$H$20,VALUE($B$223),COLUMN()-COLUMN($A$240))\n        ),\n        INDEX(BOARD_GRID!$B$14:$H$20,ROW()-ROW($A$240)+1,COLUMN()-COLUMN($A$240)+1)\n    ),\nIF($B$222=\"R\",\n    IF(ROW()-ROW($A$240)+1=VALUE($B$223),\n        IF(COLUMN()-COLUMN($A$240)+1=7,\n            IF($B$224=\"\",BOARD_GRID!$K$5,VALUE($B$224)),\n            INDEX(BOARD_GRID!$B$14:$H$20,VALUE($B$223),COLUMN()-COLUMN($A$240)+2)\n        ),\n        INDEX(BOARD_GRID!$B$14:$H$20,ROW()-ROW($A$240)+1,COLUMN()-COLUMN($A$240)+1)\n    ),\nIF($B$222=\"U\",\n    IF(COLUMN()-COLUMN($A$240)+1=VALUE($B$223),\n        IF(ROW()-ROW($A$240)+1=1,\n            IF($B$224=\"\",BOARD_GRID!$K$5,VALUE($B$224)),\n            INDEX(BOARD_GRID!$B$14:$H$20,ROW()-ROW($A$240),VALUE($B$223))\n        ),\n        INDEX(BOARD_GRID!$B$14:$H$20,ROW()-ROW($A$240)+1,COLUMN()-COLUMN($A$240)+1)\n    ),\nIF($B$222=\"D\",\n    IF(COLUMN()-COLUMN($A$240)+1=VALUE($B$223),\n        IF(ROW()-ROW($A$240)+1=7,\n            IF($B$224=\"\",BOARD_GRID!$K$5,VALUE($B$224)),\n            INDEX(BOARD_GRID!$B$14:$H$20,ROW()-ROW($A$240)+2,VALUE($B$223))\n        ),\n        INDEX(BOARD_GRID!$B$14:$H$20,ROW()-ROW($A$240)+1,COLUMN()-COLUMN($A$240)+1)\n    ),\n\"\")))))","v":""},{"$f":"IF($B$222=\"\",\"\",IF($B$222=\"L\",\n    IF(ROW()-ROW($A$240)+1=VALUE($B$223),\n        IF(COLUMN()-COLUMN($A$240)+1=1,\n            IF($B$224=\"\",BOARD_GRID!$K$5,VALUE($B$224)),\n            INDEX(BOARD_GRID!$B$14:$H$20,VALUE($B$223),COLUMN()-COLUMN($A$240))\n        ),\n        INDEX(BOARD_GRID!$B$14:$H$20,ROW()-ROW($A$240)+1,COLUMN()-COLUMN($A$240)+1)\n    ),\nIF($B$222=\"R\",\n    IF(ROW()-ROW($A$240)+1=VALUE($B$223),\n        IF(COLUMN()-COLUMN($A$240)+1=7,\n            IF($B$224=\"\",BOARD_GRID!$K$5,VALUE($B$224)),\n            INDEX(BOARD_GRID!$B$14:$H$20,VALUE($B$223),COLUMN()-COLUMN($A$240)+2)\n        ),\n        INDEX(BOARD_GRID!$B$14:$H$20,ROW()-ROW($A$240)+1,COLUMN()-COLUMN($A$240)+1)\n    ),\nIF($B$222=\"U\",\n    IF(COLUMN()-COLUMN($A$240)+1=VALUE($B$223),\n        IF(ROW()-ROW($A$240)+1=1,\n            IF($B$224=\"\",BOARD_GRID!$K$5,VALUE($B$224)),\n            INDEX(BOARD_GRID!$B$14:$H$20,ROW()-ROW($A$240),VALUE($B$223))\n        ),\n        INDEX(BOARD_GRID!$B$14:$H$20,ROW()-ROW($A$240)+1,COLUMN()-COLUMN($A$240)+1)\n    ),\nIF($B$222=\"D\",\n    IF(COLUMN()-COLUMN($A$240)+1=VALUE($B$223),\n        IF(ROW()-ROW($A$240)+1=7,\n            IF($B$224=\"\",BOARD_GRID!$K$5,VALUE($B$224)),\n            INDEX(BOARD_GRID!$B$14:$H$20,ROW()-ROW($A$240)+2,VALUE($B$223))\n        ),\n        INDEX(BOARD_GRID!$B$14:$H$20,ROW()-ROW($A$240)+1,COLUMN()-COLUMN($A$240)+1)\n    ),\n\"\")))))","v":""},{"$f":"IF($B$222=\"\",\"\",IF($B$222=\"L\",\n    IF(ROW()-ROW($A$240)+1=VALUE($B$223),\n        IF(COLUMN()-COLUMN($A$240)+1=1,\n            IF($B$224=\"\",BOARD_GRID!$K$5,VALUE($B$224)),\n            INDEX(BOARD_GRID!$B$14:$H$20,VALUE($B$223),COLUMN()-COLUMN($A$240))\n        ),\n        INDEX(BOARD_GRID!$B$14:$H$20,ROW()-ROW($A$240)+1,COLUMN()-COLUMN($A$240)+1)\n    ),\nIF($B$222=\"R\",\n    IF(ROW()-ROW($A$240)+1=VALUE($B$223),\n        IF(COLUMN()-COLUMN($A$240)+1=7,\n            IF($B$224=\"\",BOARD_GRID!$K$5,VALUE($B$224)),\n            INDEX(BOARD_GRID!$B$14:$H$20,VALUE($B$223),COLUMN()-COLUMN($A$240)+2)\n        ),\n        INDEX(BOARD_GRID!$B$14:$H$20,ROW()-ROW($A$240)+1,COLUMN()-COLUMN($A$240)+1)\n    ),\nIF($B$222=\"U\",\n    IF(COLUMN()-COLUMN($A$240)+1=VALUE($B$223),\n        IF(ROW()-ROW($A$240)+1=1,\n            IF($B$224=\"\",BOARD_GRID!$K$5,VALUE($B$224)),\n            INDEX(BOARD_GRID!$B$14:$H$20,ROW()-ROW($A$240),VALUE($B$223))\n        ),\n        INDEX(BOARD_GRID!$B$14:$H$20,ROW()-ROW($A$240)+1,COLUMN()-COLUMN($A$240)+1)\n    ),\nIF($B$222=\"D\",\n    IF(COLUMN()-COLUMN($A$240)+1=VALUE($B$223),\n        IF(ROW()-ROW($A$240)+1=7,\n            IF($B$224=\"\",BOARD_GRID!$K$5,VALUE($B$224)),\n            INDEX(BOARD_GRID!$B$14:$H$20,ROW()-ROW($A$240)+2,VALUE($B$223))\n        ),\n        INDEX(BOARD_GRID!$B$14:$H$20,ROW()-ROW($A$240)+1,COLUMN()-COLUMN($A$240)+1)\n    ),\n\"\")))))","v":""},{"$f":"IF($B$222=\"\",\"\",IF($B$222=\"L\",\n    IF(ROW()-ROW($A$240)+1=VALUE($B$223),\n        IF(COLUMN()-COLUMN($A$240)+1=1,\n            IF($B$224=\"\",BOARD_GRID!$K$5,VALUE($B$224)),\n            INDEX(BOARD_GRID!$B$14:$H$20,VALUE($B$223),COLUMN()-COLUMN($A$240))\n        ),\n        INDEX(BOARD_GRID!$B$14:$H$20,ROW()-ROW($A$240)+1,COLUMN()-COLUMN($A$240)+1)\n    ),\nIF($B$222=\"R\",\n    IF(ROW()-ROW($A$240)+1=VALUE($B$223),\n        IF(COLUMN()-COLUMN($A$240)+1=7,\n            IF($B$224=\"\",BOARD_GRID!$K$5,VALUE($B$224)),\n            INDEX(BOARD_GRID!$B$14:$H$20,VALUE($B$223),COLUMN()-COLUMN($A$240)+2)\n        ),\n        INDEX(BOARD_GRID!$B$14:$H$20,ROW()-ROW($A$240)+1,COLUMN()-COLUMN($A$240)+1)\n    ),\nIF($B$222=\"U\",\n    IF(COLUMN()-COLUMN($A$240)+1=VALUE($B$223),\n        IF(ROW()-ROW($A$240)+1=1,\n            IF($B$224=\"\",BOARD_GRID!$K$5,VALUE($B$224)),\n            INDEX(BOARD_GRID!$B$14:$H$20,ROW()-ROW($A$240),VALUE($B$223))\n        ),\n        INDEX(BOARD_GRID!$B$14:$H$20,ROW()-ROW($A$240)+1,COLUMN()-COLUMN($A$240)+1)\n    ),\nIF($B$222=\"D\",\n    IF(COLUMN()-COLUMN($A$240)+1=VALUE($B$223),\n        IF(ROW()-ROW($A$240)+1=7,\n            IF($B$224=\"\",BOARD_GRID!$K$5,VALUE($B$224)),\n            INDEX(BOARD_GRID!$B$14:$H$20,ROW()-ROW($A$240)+2,VALUE($B$223))\n        ),\n        INDEX(BOARD_GRID!$B$14:$H$20,ROW()-ROW($A$240)+1,COLUMN()-COLUMN($A$240)+1)\n    ),\n\"\")))))","v":""},{"$f":"IF($B$222=\"\",\"\",IF($B$222=\"L\",\n    IF(ROW()-ROW($A$240)+1=VALUE($B$223),\n        IF(COLUMN()-COLUMN($A$240)+1=1,\n            IF($B$224=\"\",BOARD_GRID!$K$5,VALUE($B$224)),\n            INDEX(BOARD_GRID!$B$14:$H$20,VALUE($B$223),COLUMN()-COLUMN($A$240))\n        ),\n        INDEX(BOARD_GRID!$B$14:$H$20,ROW()-ROW($A$240)+1,COLUMN()-COLUMN($A$240)+1)\n    ),\nIF($B$222=\"R\",\n    IF(ROW()-ROW($A$240)+1=VALUE($B$223),\n        IF(COLUMN()-COLUMN($A$240)+1=7,\n            IF($B$224=\"\",BOARD_GRID!$K$5,VALUE($B$224)),\n            INDEX(BOARD_GRID!$B$14:$H$20,VALUE($B$223),COLUMN()-COLUMN($A$240)+2)\n        ),\n        INDEX(BOARD_GRID!$B$14:$H$20,ROW()-ROW($A$240)+1,COLUMN()-COLUMN($A$240)+1)\n    ),\nIF($B$222=\"U\",\n    IF(COLUMN()-COLUMN($A$240)+1=VALUE($B$223),\n        IF(ROW()-ROW($A$240)+1=1,\n            IF($B$224=\"\",BOARD_GRID!$K$5,VALUE($B$224)),\n            INDEX(BOARD_GRID!$B$14:$H$20,ROW()-ROW($A$240),VALUE($B$223))\n        ),\n        INDEX(BOARD_GRID!$B$14:$H$20,ROW()-ROW($A$240)+1,COLUMN()-COLUMN($A$240)+1)\n    ),\nIF($B$222=\"D\",\n    IF(COLUMN()-COLUMN($A$240)+1=VALUE($B$223),\n        IF(ROW()-ROW($A$240)+1=7,\n            IF($B$224=\"\",BOARD_GRID!$K$5,VALUE($B$224)),\n            INDEX(BOARD_GRID!$B$14:$H$20,ROW()-ROW($A$240)+2,VALUE($B$223))\n        ),\n        INDEX(BOARD_GRID!$B$14:$H$20,ROW()-ROW($A$240)+1,COLUMN()-COLUMN($A$240)+1)\n    ),\n\"\")))))","v":""},{"$f":"IF($B$222=\"\",\"\",IF($B$222=\"L\",\n    IF(ROW()-ROW($A$240)+1=VALUE($B$223),\n        IF(COLUMN()-COLUMN($A$240)+1=1,\n            IF($B$224=\"\",BOARD_GRID!$K$5,VALUE($B$224)),\n            INDEX(BOARD_GRID!$B$14:$H$20,VALUE($B$223),COLUMN()-COLUMN($A$240))\n        ),\n        INDEX(BOARD_GRID!$B$14:$H$20,ROW()-ROW($A$240)+1,COLUMN()-COLUMN($A$240)+1)\n    ),\nIF($B$222=\"R\",\n    IF(ROW()-ROW($A$240)+1=VALUE($B$223),\n        IF(COLUMN()-COLUMN($A$240)+1=7,\n            IF($B$224=\"\",BOARD_GRID!$K$5,VALUE($B$224)),\n            INDEX(BOARD_GRID!$B$14:$H$20,VALUE($B$223),COLUMN()-COLUMN($A$240)+2)\n        ),\n        INDEX(BOARD_GRID!$B$14:$H$20,ROW()-ROW($A$240)+1,COLUMN()-COLUMN($A$240)+1)\n    ),\nIF($B$222=\"U\",\n    IF(COLUMN()-COLUMN($A$240)+1=VALUE($B$223),\n        IF(ROW()-ROW($A$240)+1=1,\n            IF($B$224=\"\",BOARD_GRID!$K$5,VALUE($B$224)),\n            INDEX(BOARD_GRID!$B$14:$H$20,ROW()-ROW($A$240),VALUE($B$223))\n        ),\n        INDEX(BOARD_GRID!$B$14:$H$20,ROW()-ROW($A$240)+1,COLUMN()-COLUMN($A$240)+1)\n    ),\nIF($B$222=\"D\",\n    IF(COLUMN()-COLUMN($A$240)+1=VALUE($B$223),\n        IF(ROW()-ROW($A$240)+1=7,\n            IF($B$224=\"\",BOARD_GRID!$K$5,VALUE($B$224)),\n            INDEX(BOARD_GRID!$B$14:$H$20,ROW()-ROW($A$240)+2,VALUE($B$223))\n        ),\n        INDEX(BOARD_GRID!$B$14:$H$20,ROW()-ROW($A$240)+1,COLUMN()-COLUMN($A$240)+1)\n    ),\n\"\")))))","v":""}]
[{"$f":"IF($B$222=\"\",\"\",IF($B$222=\"L\",\n    IF(ROW()-ROW($A$240)+1=VALUE($B$223),\n        IF(COLUMN()-COLUMN($A$240)+1=1,\n            IF($B$224=\"\",BOARD_GRID!$K$5,VALUE($B$224)),\n            INDEX(BOARD_GRID!$B$14:$H$20,VALUE($B$223),COLUMN()-COLUMN($A$240))\n        ),\n        INDEX(BOARD_GRID!$B$14:$H$20,ROW()-ROW($A$240)+1,COLUMN()-COLUMN($A$240)+1)\n    ),\nIF($B$222=\"R\",\n    IF(ROW()-ROW($A$240)+1=VALUE($B$223),\n        IF(COLUMN()-COLUMN($A$240)+1=7,\n            IF($B$224=\"\",BOARD_GRID!$K$5,VALUE($B$224)),\n            INDEX(BOARD_GRID!$B$14:$H$20,VALUE($B$223),COLUMN()-COLUMN($A$240)+2)\n        ),\n        INDEX(BOARD_GRID!$B$14:$H$20,ROW()-ROW($A$240)+1,COLUMN()-COLUMN($A$240)+1)\n    ),\nIF($B$222=\"U\",\n    IF(COLUMN()-COLUMN($A$240)+1=VALUE($B$223),\n        IF(ROW()-ROW($A$240)+1=1,\n            IF($B$224=\"\",BOARD_GRID!$K$5,VALUE($B$224)),\n            INDEX(BOARD_GRID!$B$14:$H$20,ROW()-ROW($A$240),VALUE($B$223))\n        ),\n        INDEX(BOARD_GRID!$B$14:$H$20,ROW()-ROW($A$240)+1,COLUMN()-COLUMN($A$240)+1)\n    ),\nIF($B$222=\"D\",\n    IF(COLUMN()-COLUMN($A$240)+1=VALUE($B$223),\n        IF(ROW()-ROW($A$240)+1=7,\n            IF($B$224=\"\",BOARD_GRID!$K$5,VALUE($B$224)),\n            INDEX(BOARD_GRID!$B$14:$H$20,ROW()-ROW($A$240)+2,VALUE($B$223))\n        ),\n        INDEX(BOARD_GRID!$B$14:$H$20,ROW()-ROW($A$240)+1,COLUMN()-COLUMN($A$240)+1)\n    ),\n\"\")))))","v":""},{"$f":"IF($B$222=\"\",\"\",IF($B$222=\"L\",\n    IF(ROW()-ROW($A$240)+1=VALUE($B$223),\n        IF(COLUMN()-COLUMN($A$240)+1=1,\n            IF($B$224=\"\",BOARD_GRID!$K$5,VALUE($B$224)),\n            INDEX(BOARD_GRID!$B$14:$H$20,VALUE($B$223),COLUMN()-COLUMN($A$240))\n        ),\n        INDEX(BOARD_GRID!$B$14:$H$20,ROW()-ROW($A$240)+1,COLUMN()-COLUMN($A$240)+1)\n    ),\nIF($B$222=\"R\",\n    IF(ROW()-ROW($A$240)+1=VALUE($B$223),\n        IF(COLUMN()-COLUMN($A$240)+1=7,\n            IF($B$224=\"\",BOARD_GRID!$K$5,VALUE($B$224)),\n            INDEX(BOARD_GRID!$B$14:$H$20,VALUE($B$223),COLUMN()-COLUMN($A$240)+2)\n        ),\n        INDEX(BOARD_GRID!$B$14:$H$20,ROW()-ROW($A$240)+1,COLUMN()-COLUMN($A$240)+1)\n    ),\nIF($B$222=\"U\",\n    IF(COLUMN()-COLUMN($A$240)+1=VALUE($B$223),\n        IF(ROW()-ROW($A$240)+1=1,\n            IF($B$224=\"\",BOARD_GRID!$K$5,VALUE($B$224)),\n            INDEX(BOARD_GRID!$B$14:$H$20,ROW()-ROW($A$240),VALUE($B$223))\n        ),\n        INDEX(BOARD_GRID!$B$14:$H$20,ROW()-ROW($A$240)+1,COLUMN()-COLUMN($A$240)+1)\n    ),\nIF($B$222=\"D\",\n    IF(COLUMN()-COLUMN($A$240)+1=VALUE($B$223),\n        IF(ROW()-ROW($A$240)+1=7,\n            IF($B$224=\"\",BOARD_GRID!$K$5,VALUE($B$224)),\n            INDEX(BOARD_GRID!$B$14:$H$20,ROW()-ROW($A$240)+2,VALUE($B$223))\n        ),\n        INDEX(BOARD_GRID!$B$14:$H$20,ROW()-ROW($A$240)+1,COLUMN()-COLUMN($A$240)+1)\n    ),\n\"\")))))","v":""},{"$f":"IF($B$222=\"\",\"\",IF($B$222=\"L\",\n    IF(ROW()-ROW($A$240)+1=VALUE($B$223),\n        IF(COLUMN()-COLUMN($A$240)+1=1,\n            IF($B$224=\"\",BOARD_GRID!$K$5,VALUE($B$224)),\n            INDEX(BOARD_GRID!$B$14:$H$20,VALUE($B$223),COLUMN()-COLUMN($A$240))\n        ),\n        INDEX(BOARD_GRID!$B$14:$H$20,ROW()-ROW($A$240)+1,COLUMN()-COLUMN($A$240)+1)\n    ),\nIF($B$222=\"R\",\n    IF(ROW()-ROW($A$240)+1=VALUE($B$223),\n        IF(COLUMN()-COLUMN($A$240)+1=7,\n            IF($B$224=\"\",BOARD_GRID!$K$5,VALUE($B$224)),\n            INDEX(BOARD_GRID!$B$14:$H$20,VALUE($B$223),COLUMN()-COLUMN($A$240)+2)\n        ),\n        INDEX(BOARD_GRID!$B$14:$H$20,ROW()-ROW($A$240)+1,COLUMN()-COLUMN($A$240)+1)\n    ),\nIF($B$222=\"U\",\n    IF(COLUMN()-COLUMN($A$240)+1=VALUE($B$223),\n        IF(ROW()-ROW($A$240)+1=1,\n            IF($B$224=\"\",BOARD_GRID!$K$5,VALUE($B$224)),\n            INDEX(BOARD_GRID!$B$14:$H$20,ROW()-ROW($A$240),VALUE($B$223))\n        ),\n        INDEX(BOARD_GRID!$B$14:$H$20,ROW()-ROW($A$240)+1,COLUMN()-COLUMN($A$240)+1)\n    ),\nIF($B$222=\"D\",\n    IF(COLUMN()-COLUMN($A$240)+1=VALUE($B$223),\n        IF(ROW()-ROW($A$240)+1=7,\n            IF($B$224=\"\",BOARD_GRID!$K$5,VALUE($B$224)),\n            INDEX(BOARD_GRID!$B$14:$H$20,ROW()-ROW($A$240)+2,VALUE($B$223))\n        ),\n        INDEX(BOARD_GRID!$B$14:$H$20,ROW()-ROW($A$240)+1,COLUMN()-COLUMN($A$240)+1)\n    ),\n\"\")))))","v":""},{"$f":"IF($B$222=\"\",\"\",IF($B$222=\"L\",\n    IF(ROW()-ROW($A$240)+1=VALUE($B$223),\n        IF(COLUMN()-COLUMN($A$240)+1=1,\n            IF($B$224=\"\",BOARD_GRID!$K$5,VALUE($B$224)),\n            INDEX(BOARD_GRID!$B$14:$H$20,VALUE($B$223),COLUMN()-COLUMN($A$240))\n        ),\n        INDEX(BOARD_GRID!$B$14:$H$20,ROW()-ROW($A$240)+1,COLUMN()-COLUMN($A$240)+1)\n    ),\nIF($B$222=\"R\",\n    IF(ROW()-ROW($A$240)+1=VALUE($B$223),\n        IF(COLUMN()-COLUMN($A$240)+1=7,\n            IF($B$224=\"\",BOARD_GRID!$K$5,VALUE($B$224)),\n            INDEX(BOARD_GRID!$B$14:$H$20,VALUE($B$223),COLUMN()-COLUMN($A$240)+2)\n        ),\n        INDEX(BOARD_GRID!$B$14:$H$20,ROW()-ROW($A$240)+1,COLUMN()-COLUMN($A$240)+1)\n    ),\nIF($B$222=\"U\",\n    IF(COLUMN()-COLUMN($A$240)+1=VALUE($B$223),\n        IF(ROW()-ROW($A$240)+1=1,\n            IF($B$224=\"\",BOARD_GRID!$K$5,VALUE($B$224)),\n            INDEX(BOARD_GRID!$B$14:$H$20,ROW()-ROW($A$240),VALUE($B$223))\n        ),\n        INDEX(BOARD_GRID!$B$14:$H$20,ROW()-ROW($A$240)+1,COLUMN()-COLUMN($A$240)+1)\n    ),\nIF($B$222=\"D\",\n    IF(COLUMN()-COLUMN($A$240)+1=VALUE($B$223),\n        IF(ROW()-ROW($A$240)+1=7,\n            IF($B$224=\"\",BOARD_GRID!$K$5,VALUE($B$224)),\n            INDEX(BOARD_GRID!$B$14:$H$20,ROW()-ROW($A$240)+2,VALUE($B$223))\n        ),\n        INDEX(BOARD_GRID!$B$14:$H$20,ROW()-ROW($A$240)+1,COLUMN()-COLUMN($A$240)+1)\n    ),\n\"\")))))","v":""},{"$f":"IF($B$222=\"\",\"\",IF($B$222=\"L\",\n    IF(ROW()-ROW($A$240)+1=VALUE($B$223),\n        IF(COLUMN()-COLUMN($A$240)+1=1,\n            IF($B$224=\"\",BOARD_GRID!$K$5,VALUE($B$224)),\n            INDEX(BOARD_GRID!$B$14:$H$20,VALUE($B$223),COLUMN()-COLUMN($A$240))\n        ),\n        INDEX(BOARD_GRID!$B$14:$H$20,ROW()-ROW($A$240)+1,COLUMN()-COLUMN($A$240)+1)\n    ),\nIF($B$222=\"R\",\n    IF(ROW()-ROW($A$240)+1=VALUE($B$223),\n        IF(COLUMN()-COLUMN($A$240)+1=7,\n            IF($B$224=\"\",BOARD_GRID!$K$5,VALUE($B$224)),\n            INDEX(BOARD_GRID!$B$14:$H$20,VALUE($B$223),COLUMN()-COLUMN($A$240)+2)\n        ),\n        INDEX(BOARD_GRID!$B$14:$H$20,ROW()-ROW($A$240)+1,COLUMN()-COLUMN($A$240)+1)\n    ),\nIF($B$222=\"U\",\n    IF(COLUMN()-COLUMN($A$240)+1=VALUE($B$223),\n        IF(ROW()-ROW($A$240)+1=1,\n            IF($B$224=\"\",BOARD_GRID!$K$5,VALUE($B$224)),\n            INDEX(BOARD_GRID!$B$14:$H$20,ROW()-ROW($A$240),VALUE($B$223))\n        ),\n        INDEX(BOARD_GRID!$B$14:$H$20,ROW()-ROW($A$240)+1,COLUMN()-COLUMN($A$240)+1)\n    ),\nIF($B$222=\"D\",\n    IF(COLUMN()-COLUMN($A$240)+1=VALUE($B$223),\n        IF(ROW()-ROW($A$240)+1=7,\n            IF($B$224=\"\",BOARD_GRID!$K$5,VALUE($B$224)),\n            INDEX(BOARD_GRID!$B$14:$H$20,ROW()-ROW($A$240)+2,VALUE($B$223))\n        ),\n        INDEX(BOARD_GRID!$B$14:$H$20,ROW()-ROW($A$240)+1,COLUMN()-COLUMN($A$240)+1)\n    ),\n\"\")))))","v":""},{"$f":"IF($B$222=\"\",\"\",IF($B$222=\"L\",\n    IF(ROW()-ROW($A$240)+1=VALUE($B$223),\n        IF(COLUMN()-COLUMN($A$240)+1=1,\n            IF($B$224=\"\",BOARD_GRID!$K$5,VALUE($B$224)),\n            INDEX(BOARD_GRID!$B$14:$H$20,VALUE($B$223),COLUMN()-COLUMN($A$240))\n        ),\n        INDEX(BOARD_GRID!$B$14:$H$20,ROW()-ROW($A$240)+1,COLUMN()-COLUMN($A$240)+1)\n    ),\nIF($B$222=\"R\",\n    IF(ROW()-ROW($A$240)+1=VALUE($B$223),\n        IF(COLUMN()-COLUMN($A$240)+1=7,\n            IF($B$224=\"\",BOARD_GRID!$K$5,VALUE($B$224)),\n            INDEX(BOARD_GRID!$B$14:$H$20,VALUE($B$223),COLUMN()-COLUMN($A$240)+2)\n        ),\n        INDEX(BOARD_GRID!$B$14:$H$20,ROW()-ROW($A$240)+1,COLUMN()-COLUMN($A$240)+1)\n    ),\nIF($B$222=\"U\",\n    IF(COLUMN()-COLUMN($A$240)+1=VALUE($B$223),\n        IF(ROW()-ROW($A$240)+1=1,\n            IF($B$224=\"\",BOARD_GRID!$K$5,VALUE($B$224)),\n            INDEX(BOARD_GRID!$B$14:$H$20,ROW()-ROW($A$240),VALUE($B$223))\n        ),\n        INDEX(BOARD_GRID!$B$14:$H$20,ROW()-ROW($A$240)+1,COLUMN()-COLUMN($A$240)+1)\n    ),\nIF($B$222=\"D\",\n    IF(COLUMN()-COLUMN($A$240)+1=VALUE($B$223),\n        IF(ROW()-ROW($A$240)+1=7,\n            IF($B$224=\"\",BOARD_GRID!$K$5,VALUE($B$224)),\n            INDEX(BOARD_GRID!$B$14:$H$20,ROW()-ROW($A$240)+2,VALUE($B$223))\n        ),\n        INDEX(BOARD_GRID!$B$14:$H$20,ROW()-ROW($A$240)+1,COLUMN()-COLUMN($A$240)+1)\n    ),\n\"\")))))","v":""},{"$f":"IF($B$222=\"\",\"\",IF($B$222=\"L\",\n    IF(ROW()-ROW($A$240)+1=VALUE($B$223),\n        IF(COLUMN()-COLUMN($A$240)+1=1,\n            IF($B$224=\"\",BOARD_GRID!$K$5,VALUE($B$224)),\n            INDEX(BOARD_GRID!$B$14:$H$20,VALUE($B$223),COLUMN()-COLUMN($A$240))\n        ),\n        INDEX(BOARD_GRID!$B$14:$H$20,ROW()-ROW($A$240)+1,COLUMN()-COLUMN($A$240)+1)\n    ),\nIF($B$222=\"R\",\n    IF(ROW()-ROW($A$240)+1=VALUE($B$223),\n        IF(COLUMN()-COLUMN($A$240)+1=7,\n            IF($B$224=\"\",BOARD_GRID!$K$5,VALUE($B$224)),\n            INDEX(BOARD_GRID!$B$14:$H$20,VALUE($B$223),COLUMN()-COLUMN($A$240)+2)\n        ),\n        INDEX(BOARD_GRID!$B$14:$H$20,ROW()-ROW($A$240)+1,COLUMN()-COLUMN($A$240)+1)\n    ),\nIF($B$222=\"U\",\n    IF(COLUMN()-COLUMN($A$240)+1=VALUE($B$223),\n        IF(ROW()-ROW($A$240)+1=1,\n            IF($B$224=\"\",BOARD_GRID!$K$5,VALUE($B$224)),\n            INDEX(BOARD_GRID!$B$14:$H$20,ROW()-ROW($A$240),VALUE($B$223))\n        ),\n        INDEX(BOARD_GRID!$B$14:$H$20,ROW()-ROW($A$240)+1,COLUMN()-COLUMN($A$240)+1)\n    ),\nIF($B$222=\"D\",\n    IF(COLUMN()-COLUMN($A$240)+1=VALUE($B$223),\n        IF(ROW()-ROW($A$240)+1=7,\n            IF($B$224=\"\",BOARD_GRID!$K$5,VALUE($B$224)),\n            INDEX(BOARD_GRID!$B$14:$H$20,ROW()-ROW($A$240)+2,VALUE($B$223))\n        ),\n        INDEX(BOARD_GRID!$B$14:$H$20,ROW()-ROW($A$240)+1,COLUMN()-COLUMN($A$240)+1)\n    ),\n\"\")))))","v":""}]
[{"$f":"IF($B$222=\"\",\"\",IF($B$222=\"L\",\n    IF(ROW()-ROW($A$240)+1=VALUE($B$223),\n        IF(COLUMN()-COLUMN($A$240)+1=1,\n            IF($B$224=\"\",BOARD_GRID!$K$5,VALUE($B$224)),\n            INDEX(BOARD_GRID!$B$14:$H$20,VALUE($B$223),COLUMN()-COLUMN($A$240))\n        ),\n        INDEX(BOARD_GRID!$B$14:$H$20,ROW()-ROW($A$240)+1,COLUMN()-COLUMN($A$240)+1)\n    ),\nIF($B$222=\"R\",\n    IF(ROW()-ROW($A$240)+1=VALUE($B$223),\n        IF(COLUMN()-COLUMN($A$240)+1=7,\n            IF($B$224=\"\",BOARD_GRID!$K$5,VALUE($B$224)),\n            INDEX(BOARD_GRID!$B$14:$H$20,VALUE($B$223),COLUMN()-COLUMN($A$240)+2)\n        ),\n        INDEX(BOARD_GRID!$B$14:$H$20,ROW()-ROW($A$240)+1,COLUMN()-COLUMN($A$240)+1)\n    ),\nIF($B$222=\"U\",\n    IF(COLUMN()-COLUMN($A$240)+1=VALUE($B$223),\n        IF(ROW()-ROW($A$240)+1=1,\n            IF($B$224=\"\",BOARD_GRID!$K$5,VALUE($B$224)),\n            INDEX(BOARD_GRID!$B$14:$H$20,ROW()-ROW($A$240),VALUE($B$223))\n        ),\n        INDEX(BOARD_GRID!$B$14:$H$20,ROW()-ROW($A$240)+1,COLUMN()-COLUMN($A$240)+1)\n    ),\nIF($B$222=\"D\",\n    IF(COLUMN()-COLUMN($A$240)+1=VALUE($B$223),\n        IF(ROW()-ROW($A$240)+1=7,\n            IF($B$224=\"\",BOARD_GRID!$K$5,VALUE($B$224)),\n            INDEX(BOARD_GRID!$B$14:$H$20,ROW()-ROW($A$240)+2,VALUE($B$223))\n        ),\n        INDEX(BOARD_GRID!$B$14:$H$20,ROW()-ROW($A$240)+1,COLUMN()-COLUMN($A$240)+1)\n    ),\n\"\")))))","v":""},{"$f":"IF($B$222=\"\",\"\",IF($B$222=\"L\",\n    IF(ROW()-ROW($A$240)+1=VALUE($B$223),\n        IF(COLUMN()-COLUMN($A$240)+1=1,\n            IF($B$224=\"\",BOARD_GRID!$K$5,VALUE($B$224)),\n            INDEX(BOARD_GRID!$B$14:$H$20,VALUE($B$223),COLUMN()-COLUMN($A$240))\n        ),\n        INDEX(BOARD_GRID!$B$14:$H$20,ROW()-ROW($A$240)+1,COLUMN()-COLUMN($A$240)+1)\n    ),\nIF($B$222=\"R\",\n    IF(ROW()-ROW($A$240)+1=VALUE($B$223),\n        IF(COLUMN()-COLUMN($A$240)+1=7,\n            IF($B$224=\"\",BOARD_GRID!$K$5,VALUE($B$224)),\n            INDEX(BOARD_GRID!$B$14:$H$20,VALUE($B$223),COLUMN()-COLUMN($A$240)+2)\n        ),\n        INDEX(BOARD_GRID!$B$14:$H$20,ROW()-ROW($A$240)+1,COLUMN()-COLUMN($A$240)+1)\n    ),\nIF($B$222=\"U\",\n    IF(COLUMN()-COLUMN($A$240)+1=VALUE($B$223),\n        IF(ROW()-ROW($A$240)+1=1,\n            IF($B$224=\"\",BOARD_GRID!$K$5,VALUE($B$224)),\n            INDEX(BOARD_GRID!$B$14:$H$20,ROW()-ROW($A$240),VALUE($B$223))\n        ),\n        INDEX(BOARD_GRID!$B$14:$H$20,ROW()-ROW($A$240)+1,COLUMN()-COLUMN($A$240)+1)\n    ),\nIF($B$222=\"D\",\n    IF(COLUMN()-COLUMN($A$240)+1=VALUE($B$223),\n        IF(ROW()-ROW($A$240)+1=7,\n            IF($B$224=\"\",BOARD_GRID!$K$5,VALUE($B$224)),\n            INDEX(BOARD_GRID!$B$14:$H$20,ROW()-ROW($A$240)+2,VALUE($B$223))\n        ),\n        INDEX(BOARD_GRID!$B$14:$H$20,ROW()-ROW($A$240)+1,COLUMN()-COLUMN($A$240)+1)\n    ),\n\"\")))))","v":""},{"$f":"IF($B$222=\"\",\"\",IF($B$222=\"L\",\n    IF(ROW()-ROW($A$240)+1=VALUE($B$223),\n        IF(COLUMN()-COLUMN($A$240)+1=1,\n            IF($B$224=\"\",BOARD_GRID!$K$5,VALUE($B$224)),\n            INDEX(BOARD_GRID!$B$14:$H$20,VALUE($B$223),COLUMN()-COLUMN($A$240))\n        ),\n        INDEX(BOARD_GRID!$B$14:$H$20,ROW()-ROW($A$240)+1,COLUMN()-COLUMN($A$240)+1)\n    ),\nIF($B$222=\"R\",\n    IF(ROW()-ROW($A$240)+1=VALUE($B$223),\n        IF(COLUMN()-COLUMN($A$240)+1=7,\n            IF($B$224=\"\",BOARD_GRID!$K$5,VALUE($B$224)),\n            INDEX(BOARD_GRID!$B$14:$H$20,VALUE($B$223),COLUMN()-COLUMN($A$240)+2)\n        ),\n        INDEX(BOARD_GRID!$B$14:$H$20,ROW()-ROW($A$240)+1,COLUMN()-COLUMN($A$240)+1)\n    ),\nIF($B$222=\"U\",\n    IF(COLUMN()-COLUMN($A$240)+1=VALUE($B$223),\n        IF(ROW()-ROW($A$240)+1=1,\n            IF($B$224=\"\",BOARD_GRID!$K$5,VALUE($B$224)),\n            INDEX(BOARD_GRID!$B$14:$H$20,ROW()-ROW($A$240),VALUE($B$223))\n        ),\n        INDEX(BOARD_GRID!$B$14:$H$20,ROW()-ROW($A$240)+1,COLUMN()-COLUMN($A$240)+1)\n    ),\nIF($B$222=\"D\",\n    IF(COLUMN()-COLUMN($A$240)+1=VALUE($B$223),\n        IF(ROW()-ROW($A$240)+1=7,\n            IF($B$224=\"\",BOARD_GRID!$K$5,VALUE($B$224)),\n            INDEX(BOARD_GRID!$B$14:$H$20,ROW()-ROW($A$240)+2,VALUE($B$223))\n        ),\n        INDEX(BOARD_GRID!$B$14:$H$20,ROW()-ROW($A$240)+1,COLUMN()-COLUMN($A$240)+1)\n    ),\n\"\")))))","v":""},{"$f":"IF($B$222=\"\",\"\",IF($B$222=\"L\",\n    IF(ROW()-ROW($A$240)+1=VALUE($B$223),\n        IF(COLUMN()-COLUMN($A$240)+1=1,\n            IF($B$224=\"\",BOARD_GRID!$K$5,VALUE($B$224)),\n            INDEX(BOARD_GRID!$B$14:$H$20,VALUE($B$223),COLUMN()-COLUMN($A$240))\n        ),\n        INDEX(BOARD_GRID!$B$14:$H$20,ROW()-ROW($A$240)+1,COLUMN()-COLUMN($A$240)+1)\n    ),\nIF($B$222=\"R\",\n    IF(ROW()-ROW($A$240)+1=VALUE($B$223),\n        IF(COLUMN()-COLUMN($A$240)+1=7,\n            IF($B$224=\"\",BOARD_GRID!$K$5,VALUE($B$224)),\n            INDEX(BOARD_GRID!$B$14:$H$20,VALUE($B$223),COLUMN()-COLUMN($A$240)+2)\n        ),\n        INDEX(BOARD_GRID!$B$14:$H$20,ROW()-ROW($A$240)+1,COLUMN()-COLUMN($A$240)+1)\n    ),\nIF($B$222=\"U\",\n    IF(COLUMN()-COLUMN($A$240)+1=VALUE($B$223),\n        IF(ROW()-ROW($A$240)+1=1,\n            IF($B$224=\"\",BOARD_GRID!$K$5,VALUE($B$224)),\n            INDEX(BOARD_GRID!$B$14:$H$20,ROW()-ROW($A$240),VALUE($B$223))\n        ),\n        INDEX(BOARD_GRID!$B$14:$H$20,ROW()-ROW($A$240)+1,COLUMN()-COLUMN($A$240)+1)\n    ),\nIF($B$222=\"D\",\n    IF(COLUMN()-COLUMN($A$240)+1=VALUE($B$223),\n        IF(ROW()-ROW($A$240)+1=7,\n            IF($B$224=\"\",BOARD_GRID!$K$5,VALUE($B$224)),\n            INDEX(BOARD_GRID!$B$14:$H$20,ROW()-ROW($A$240)+2,VALUE($B$223))\n        ),\n        INDEX(BOARD_GRID!$B$14:$H$20,ROW()-ROW($A$240)+1,COLUMN()-COLUMN($A$240)+1)\n    ),\n\"\")))))","v":""},{"$f":"IF($B$222=\"\",\"\",IF($B$222=\"L\",\n    IF(ROW()-ROW($A$240)+1=VALUE($B$223),\n        IF(COLUMN()-COLUMN($A$240)+1=1,\n            IF($B$224=\"\",BOARD_GRID!$K$5,VALUE($B$224)),\n            INDEX(BOARD_GRID!$B$14:$H$20,VALUE($B$223),COLUMN()-COLUMN($A$240))\n        ),\n        INDEX(BOARD_GRID!$B$14:$H$20,ROW()-ROW($A$240)+1,COLUMN()-COLUMN($A$240)+1)\n    ),\nIF($B$222=\"R\",\n    IF(ROW()-ROW($A$240)+1=VALUE($B$223),\n        IF(COLUMN()-COLUMN($A$240)+1=7,\n            IF($B$224=\"\",BOARD_GRID!$K$5,VALUE($B$224)),\n            INDEX(BOARD_GRID!$B$14:$H$20,VALUE($B$223),COLUMN()-COLUMN($A$240)+2)\n        ),\n        INDEX(BOARD_GRID!$B$14:$H$20,ROW()-ROW($A$240)+1,COLUMN()-COLUMN($A$240)+1)\n    ),\nIF($B$222=\"U\",\n    IF(COLUMN()-COLUMN($A$240)+1=VALUE($B$223),\n        IF(ROW()-ROW($A$240)+1=1,\n            IF($B$224=\"\",BOARD_GRID!$K$5,VALUE($B$224)),\n            INDEX(BOARD_GRID!$B$14:$H$20,ROW()-ROW($A$240),VALUE($B$223))\n        ),\n        INDEX(BOARD_GRID!$B$14:$H$20,ROW()-ROW($A$240)+1,COLUMN()-COLUMN($A$240)+1)\n    ),\nIF($B$222=\"D\",\n    IF(COLUMN()-COLUMN($A$240)+1=VALUE($B$223),\n        IF(ROW()-ROW($A$240)+1=7,\n            IF($B$224=\"\",BOARD_GRID!$K$5,VALUE($B$224)),\n            INDEX(BOARD_GRID!$B$14:$H$20,ROW()-ROW($A$240)+2,VALUE($B$223))\n        ),\n        INDEX(BOARD_GRID!$B$14:$H$20,ROW()-ROW($A$240)+1,COLUMN()-COLUMN($A$240)+1)\n    ),\n\"\")))))","v":""},{"$f":"IF($B$222=\"\",\"\",IF($B$222=\"L\",\n    IF(ROW()-ROW($A$240)+1=VALUE($B$223),\n        IF(COLUMN()-COLUMN($A$240)+1=1,\n            IF($B$224=\"\",BOARD_GRID!$K$5,VALUE($B$224)),\n            INDEX(BOARD_GRID!$B$14:$H$20,VALUE($B$223),COLUMN()-COLUMN($A$240))\n        ),\n        INDEX(BOARD_GRID!$B$14:$H$20,ROW()-ROW($A$240)+1,COLUMN()-COLUMN($A$240)+1)\n    ),\nIF($B$222=\"R\",\n    IF(ROW()-ROW($A$240)+1=VALUE($B$223),\n        IF(COLUMN()-COLUMN($A$240)+1=7,\n            IF($B$224=\"\",BOARD_GRID!$K$5,VALUE($B$224)),\n            INDEX(BOARD_GRID!$B$14:$H$20,VALUE($B$223),COLUMN()-COLUMN($A$240)+2)\n        ),\n        INDEX(BOARD_GRID!$B$14:$H$20,ROW()-ROW($A$240)+1,COLUMN()-COLUMN($A$240)+1)\n    ),\nIF($B$222=\"U\",\n    IF(COLUMN()-COLUMN($A$240)+1=VALUE($B$223),\n        IF(ROW()-ROW($A$240)+1=1,\n            IF($B$224=\"\",BOARD_GRID!$K$5,VALUE($B$224)),\n            INDEX(BOARD_GRID!$B$14:$H$20,ROW()-ROW($A$240),VALUE($B$223))\n        ),\n        INDEX(BOARD_GRID!$B$14:$H$20,ROW()-ROW($A$240)+1,COLUMN()-COLUMN($A$240)+1)\n    ),\nIF($B$222=\"D\",\n    IF(COLUMN()-COLUMN($A$240)+1=VALUE($B$223),\n        IF(ROW()-ROW($A$240)+1=7,\n            IF($B$224=\"\",BOARD_GRID!$K$5,VALUE($B$224)),\n            INDEX(BOARD_GRID!$B$14:$H$20,ROW()-ROW($A$240)+2,VALUE($B$223))\n        ),\n        INDEX(BOARD_GRID!$B$14:$H$20,ROW()-ROW($A$240)+1,COLUMN()-COLUMN($A$240)+1)\n    ),\n\"\")))))","v":""},{"$f":"IF($B$222=\"\",\"\",IF($B$222=\"L\",\n    IF(ROW()-ROW($A$240)+1=VALUE($B$223),\n        IF(COLUMN()-COLUMN($A$240)+1=1,\n            IF($B$224=\"\",BOARD_GRID!$K$5,VALUE($B$224)),\n            INDEX(BOARD_GRID!$B$14:$H$20,VALUE($B$223),COLUMN()-COLUMN($A$240))\n        ),\n        INDEX(BOARD_GRID!$B$14:$H$20,ROW()-ROW($A$240)+1,COLUMN()-COLUMN($A$240)+1)\n    ),\nIF($B$222=\"R\",\n    IF(ROW()-ROW($A$240)+1=VALUE($B$223),\n        IF(COLUMN()-COLUMN($A$240)+1=7,\n            IF($B$224=\"\",BOARD_GRID!$K$5,VALUE($B$224)),\n            INDEX(BOARD_GRID!$B$14:$H$20,VALUE($B$223),COLUMN()-COLUMN($A$240)+2)\n        ),\n        INDEX(BOARD_GRID!$B$14:$H$20,ROW()-ROW($A$240)+1,COLUMN()-COLUMN($A$240)+1)\n    ),\nIF($B$222=\"U\",\n    IF(COLUMN()-COLUMN($A$240)+1=VALUE($B$223),\n        IF(ROW()-ROW($A$240)+1=1,\n            IF($B$224=\"\",BOARD_GRID!$K$5,VALUE($B$224)),\n            INDEX(BOARD_GRID!$B$14:$H$20,ROW()-ROW($A$240),VALUE($B$223))\n        ),\n        INDEX(BOARD_GRID!$B$14:$H$20,ROW()-ROW($A$240)+1,COLUMN()-COLUMN($A$240)+1)\n    ),\nIF($B$222=\"D\",\n    IF(COLUMN()-COLUMN($A$240)+1=VALUE($B$223),\n        IF(ROW()-ROW($A$240)+1=7,\n            IF($B$224=\"\",BOARD_GRID!$K$5,VALUE($B$224)),\n            INDEX(BOARD_GRID!$B$14:$H$20,ROW()-ROW($A$240)+2,VALUE($B$223))\n        ),\n        INDEX(BOARD_GRID!$B$14:$H$20,ROW()-ROW($A$240)+1,COLUMN()-COLUMN($A$240)+1)\n    ),\n\"\")))))","v":""}]
[{"$f":"IF($B$222=\"\",\"\",IF($B$222=\"L\",\n    IF(ROW()-ROW($A$240)+1=VALUE($B$223),\n        IF(COLUMN()-COLUMN($A$240)+1=1,\n            IF($B$224=\"\",BOARD_GRID!$K$5,VALUE($B$224)),\n            INDEX(BOARD_GRID!$B$14:$H$20,VALUE($B$223),COLUMN()-COLUMN($A$240))\n        ),\n        INDEX(BOARD_GRID!$B$14:$H$20,ROW()-ROW($A$240)+1,COLUMN()-COLUMN($A$240)+1)\n    ),\nIF($B$222=\"R\",\n    IF(ROW()-ROW($A$240)+1=VALUE($B$223),\n        IF(COLUMN()-COLUMN($A$240)+1=7,\n            IF($B$224=\"\",BOARD_GRID!$K$5,VALUE($B$224)),\n            INDEX(BOARD_GRID!$B$14:$H$20,VALUE($B$223),COLUMN()-COLUMN($A$240)+2)\n        ),\n        INDEX(BOARD_GRID!$B$14:$H$20,ROW()-ROW($A$240)+1,COLUMN()-COLUMN($A$240)+1)\n    ),\nIF($B$222=\"U\",\n    IF(COLUMN()-COLUMN($A$240)+1=VALUE($B$223),\n        IF(ROW()-ROW($A$240)+1=1,\n            IF($B$224=\"\",BOARD_GRID!$K$5,VALUE($B$224)),\n            INDEX(BOARD_GRID!$B$14:$H$20,ROW()-ROW($A$240),VALUE($B$223))\n        ),\n        INDEX(BOARD_GRID!$B$14:$H$20,ROW()-ROW($A$240)+1,COLUMN()-COLUMN($A$240)+1)\n    ),\nIF($B$222=\"D\",\n    IF(COLUMN()-COLUMN($A$240)+1=VALUE($B$223),\n        IF(ROW()-ROW($A$240)+1=7,\n            IF($B$224=\"\",BOARD_GRID!$K$5,VALUE($B$224)),\n            INDEX(BOARD_GRID!$B$14:$H$20,ROW()-ROW($A$240)+2,VALUE($B$223))\n        ),\n        INDEX(BOARD_GRID!$B$14:$H$20,ROW()-ROW($A$240)+1,COLUMN()-COLUMN($A$240)+1)\n    ),\n\"\")))))","v":""},{"$f":"IF($B$222=\"\",\"\",IF($B$222=\"L\",\n    IF(ROW()-ROW($A$240)+1=VALUE($B$223),\n        IF(COLUMN()-COLUMN($A$240)+1=1,\n            IF($B$224=\"\",BOARD_GRID!$K$5,VALUE($B$224)),\n            INDEX(BOARD_GRID!$B$14:$H$20,VALUE($B$223),COLUMN()-COLUMN($A$240))\n        ),\n        INDEX(BOARD_GRID!$B$14:$H$20,ROW()-ROW($A$240)+1,COLUMN()-COLUMN($A$240)+1)\n    ),\nIF($B$222=\"R\",\n    IF(ROW()-ROW($A$240)+1=VALUE($B$223),\n        IF(COLUMN()-COLUMN($A$240)+1=7,\n            IF($B$224=\"\",BOARD_GRID!$K$5,VALUE($B$224)),\n            INDEX(BOARD_GRID!$B$14:$H$20,VALUE($B$223),COLUMN()-COLUMN($A$240)+2)\n        ),\n        INDEX(BOARD_GRID!$B$14:$H$20,ROW()-ROW($A$240)+1,COLUMN()-COLUMN($A$240)+1)\n    ),\nIF($B$222=\"U\",\n    IF(COLUMN()-COLUMN($A$240)+1=VALUE($B$223),\n        IF(ROW()-ROW($A$240)+1=1,\n            IF($B$224=\"\",BOARD_GRID!$K$5,VALUE($B$224)),\n            INDEX(BOARD_GRID!$B$14:$H$20,ROW()-ROW($A$240),VALUE($B$223))\n        ),\n        INDEX(BOARD_GRID!$B$14:$H$20,ROW()-ROW($A$240)+1,COLUMN()-COLUMN($A$240)+1)\n    ),\nIF($B$222=\"D\",\n    IF(COLUMN()-COLUMN($A$240)+1=VALUE($B$223),\n        IF(ROW()-ROW($A$240)+1=7,\n            IF($B$224=\"\",BOARD_GRID!$K$5,VALUE($B$224)),\n            INDEX(BOARD_GRID!$B$14:$H$20,ROW()-ROW($A$240)+2,VALUE($B$223))\n        ),\n        INDEX(BOARD_GRID!$B$14:$H$20,ROW()-ROW($A$240)+1,COLUMN()-COLUMN($A$240)+1)\n    ),\n\"\")))))","v":""},{"$f":"IF($B$222=\"\",\"\",IF($B$222=\"L\",\n    IF(ROW()-ROW($A$240)+1=VALUE($B$223),\n        IF(COLUMN()-COLUMN($A$240)+1=1,\n            IF($B$224=\"\",BOARD_GRID!$K$5,VALUE($B$224)),\n            INDEX(BOARD_GRID!$B$14:$H$20,VALUE($B$223),COLUMN()-COLUMN($A$240))\n        ),\n        INDEX(BOARD_GRID!$B$14:$H$20,ROW()-ROW($A$240)+1,COLUMN()-COLUMN($A$240)+1)\n    ),\nIF($B$222=\"R\",\n    IF(ROW()-ROW($A$240)+1=VALUE($B$223),\n        IF(COLUMN()-COLUMN($A$240)+1=7,\n            IF($B$224=\"\",BOARD_GRID!$K$5,VALUE($B$224)),\n            INDEX(BOARD_GRID!$B$14:$H$20,VALUE($B$223),COLUMN()-COLUMN($A$240)+2)\n        ),\n        INDEX(BOARD_GRID!$B$14:$H$20,ROW()-ROW($A$240)+1,COLUMN()-COLUMN($A$240)+1)\n    ),\nIF($B$222=\"U\",\n    IF(COLUMN()-COLUMN($A$240)+1=VALUE($B$223),\n        IF(ROW()-ROW($A$240)+1=1,\n            IF($B$224=\"\",BOARD_GRID!$K$5,VALUE($B$224)),\n            INDEX(BOARD_GRID!$B$14:$H$20,ROW()-ROW($A$240),VALUE($B$223))\n        ),\n        INDEX(BOARD_GRID!$B$14:$H$20,ROW()-ROW($A$240)+1,COLUMN()-COLUMN($A$240)+1)\n    ),\nIF($B$222=\"D\",\n    IF(COLUMN()-COLUMN($A$240)+1=VALUE($B$223),\n        IF(ROW()-ROW($A$240)+1=7,\n            IF($B$224=\"\",BOARD_GRID!$K$5,VALUE($B$224)),\n            INDEX(BOARD_GRID!$B$14:$H$20,ROW()-ROW($A$240)+2,VALUE($B$223))\n        ),\n        INDEX(BOARD_GRID!$B$14:$H$20,ROW()-ROW($A$240)+1,COLUMN()-COLUMN($A$240)+1)\n    ),\n\"\")))))","v":""},{"$f":"IF($B$222=\"\",\"\",IF($B$222=\"L\",\n    IF(ROW()-ROW($A$240)+1=VALUE($B$223),\n        IF(COLUMN()-COLUMN($A$240)+1=1,\n            IF($B$224=\"\",BOARD_GRID!$K$5,VALUE($B$224)),\n            INDEX(BOARD_GRID!$B$14:$H$20,VALUE($B$223),COLUMN()-COLUMN($A$240))\n        ),\n        INDEX(BOARD_GRID!$B$14:$H$20,ROW()-ROW($A$240)+1,COLUMN()-COLUMN($A$240)+1)\n    ),\nIF($B$222=\"R\",\n    IF(ROW()-ROW($A$240)+1=VALUE($B$223),\n        IF(COLUMN()-COLUMN($A$240)+1=7,\n            IF($B$224=\"\",BOARD_GRID!$K$5,VALUE($B$224)),\n            INDEX(BOARD_GRID!$B$14:$H$20,VALUE($B$223),COLUMN()-COLUMN($A$240)+2)\n        ),\n        INDEX(BOARD_GRID!$B$14:$H$20,ROW()-ROW($A$240)+1,COLUMN()-COLUMN($A$240)+1)\n    ),\nIF($B$222=\"U\",\n    IF(COLUMN()-COLUMN($A$240)+1=VALUE($B$223),\n        IF(ROW()-ROW($A$240)+1=1,\n            IF($B$224=\"\",BOARD_GRID!$K$5,VALUE($B$224)),\n            INDEX(BOARD_GRID!$B$14:$H$20,ROW()-ROW($A$240),VALUE($B$223))\n        ),\n        INDEX(BOARD_GRID!$B$14:$H$20,ROW()-ROW($A$240)+1,COLUMN()-COLUMN($A$240)+1)\n    ),\nIF($B$222=\"D\",\n    IF(COLUMN()-COLUMN($A$240)+1=VALUE($B$223),\n        IF(ROW()-ROW($A$240)+1=7,\n            IF($B$224=\"\",BOARD_GRID!$K$5,VALUE($B$224)),\n            INDEX(BOARD_GRID!$B$14:$H$20,ROW()-ROW($A$240)+2,VALUE($B$223))\n        ),\n        INDEX(BOARD_GRID!$B$14:$H$20,ROW()-ROW($A$240)+1,COLUMN()-COLUMN($A$240)+1)\n    ),\n\"\")))))","v":""},{"$f":"IF($B$222=\"\",\"\",IF($B$222=\"L\",\n    IF(ROW()-ROW($A$240)+1=VALUE($B$223),\n        IF(COLUMN()-COLUMN($A$240)+1=1,\n            IF($B$224=\"\",BOARD_GRID!$K$5,VALUE($B$224)),\n            INDEX(BOARD_GRID!$B$14:$H$20,VALUE($B$223),COLUMN()-COLUMN($A$240))\n        ),\n        INDEX(BOARD_GRID!$B$14:$H$20,ROW()-ROW($A$240)+1,COLUMN()-COLUMN($A$240)+1)\n    ),\nIF($B$222=\"R\",\n    IF(ROW()-ROW($A$240)+1=VALUE($B$223),\n        IF(COLUMN()-COLUMN($A$240)+1=7,\n            IF($B$224=\"\",BOARD_GRID!$K$5,VALUE($B$224)),\n            INDEX(BOARD_GRID!$B$14:$H$20,VALUE($B$223),COLUMN()-COLUMN($A$240)+2)\n        ),\n        INDEX(BOARD_GRID!$B$14:$H$20,ROW()-ROW($A$240)+1,COLUMN()-COLUMN($A$240)+1)\n    ),\nIF($B$222=\"U\",\n    IF(COLUMN()-COLUMN($A$240)+1=VALUE($B$223),\n        IF(ROW()-ROW($A$240)+1=1,\n            IF($B$224=\"\",BOARD_GRID!$K$5,VALUE($B$224)),\n            INDEX(BOARD_GRID!$B$14:$H$20,ROW()-ROW($A$240),VALUE($B$223))\n        ),\n        INDEX(BOARD_GRID!$B$14:$H$20,ROW()-ROW($A$240)+1,COLUMN()-COLUMN($A$240)+1)\n    ),\nIF($B$222=\"D\",\n    IF(COLUMN()-COLUMN($A$240)+1=VALUE($B$223),\n        IF(ROW()-ROW($A$240)+1=7,\n            IF($B$224=\"\",BOARD_GRID!$K$5,VALUE($B$224)),\n            INDEX(BOARD_GRID!$B$14:$H$20,ROW()-ROW($A$240)+2,VALUE($B$223))\n        ),\n        INDEX(BOARD_GRID!$B$14:$H$20,ROW()-ROW($A$240)+1,COLUMN()-COLUMN($A$240)+1)\n    ),\n\"\")))))","v":""},{"$f":"IF($B$222=\"\",\"\",IF($B$222=\"L\",\n    IF(ROW()-ROW($A$240)+1=VALUE($B$223),\n        IF(COLUMN()-COLUMN($A$240)+1=1,\n            IF($B$224=\"\",BOARD_GRID!$K$5,VALUE($B$224)),\n            INDEX(BOARD_GRID!$B$14:$H$20,VALUE($B$223),COLUMN()-COLUMN($A$240))\n        ),\n        INDEX(BOARD_GRID!$B$14:$H$20,ROW()-ROW($A$240)+1,COLUMN()-COLUMN($A$240)+1)\n    ),\nIF($B$222=\"R\",\n    IF(ROW()-ROW($A$240)+1=VALUE($B$223),\n        IF(COLUMN()-COLUMN($A$240)+1=7,\n            IF($B$224=\"\",BOARD_GRID!$K$5,VALUE($B$224)),\n            INDEX(BOARD_GRID!$B$14:$H$20,VALUE($B$223),COLUMN()-COLUMN($A$240)+2)\n        ),\n        INDEX(BOARD_GRID!$B$14:$H$20,ROW()-ROW($A$240)+1,COLUMN()-COLUMN($A$240)+1)\n    ),\nIF($B$222=\"U\",\n    IF(COLUMN()-COLUMN($A$240)+1=VALUE($B$223),\n        IF(ROW()-ROW($A$240)+1=1,\n            IF($B$224=\"\",BOARD_GRID!$K$5,VALUE($B$224)),\n            INDEX(BOARD_GRID!$B$14:$H$20,ROW()-ROW($A$240),VALUE($B$223))\n        ),\n        INDEX(BOARD_GRID!$B$14:$H$20,ROW()-ROW($A$240)+1,COLUMN()-COLUMN($A$240)+1)\n    ),\nIF($B$222=\"D\",\n    IF(COLUMN()-COLUMN($A$240)+1=VALUE($B$223),\n        IF(ROW()-ROW($A$240)+1=7,\n            IF($B$224=\"\",BOARD_GRID!$K$5,VALUE($B$224)),\n            INDEX(BOARD_GRID!$B$14:$H$20,ROW()-ROW($A$240)+2,VALUE($B$223))\n        ),\n        INDEX(BOARD_GRID!$B$14:$H$20,ROW()-ROW($A$240)+1,COLUMN()-COLUMN($A$240)+1)\n    ),\n\"\")))))","v":""},{"$f":"IF($B$222=\"\",\"\",IF($B$222=\"L\",\n    IF(ROW()-ROW($A$240)+1=VALUE($B$223),\n        IF(COLUMN()-COLUMN($A$240)+1=1,\n            IF($B$224=\"\",BOARD_GRID!$K$5,VALUE($B$224)),\n            INDEX(BOARD_GRID!$B$14:$H$20,VALUE($B$223),COLUMN()-COLUMN($A$240))\n        ),\n        INDEX(BOARD_GRID!$B$14:$H$20,ROW()-ROW($A$240)+1,COLUMN()-COLUMN($A$240)+1)\n    ),\nIF($B$222=\"R\",\n    IF(ROW()-ROW($A$240)+1=VALUE($B$223),\n        IF(COLUMN()-COLUMN($A$240)+1=7,\n            IF($B$224=\"\",BOARD_GRID!$K$5,VALUE($B$224)),\n            INDEX(BOARD_GRID!$B$14:$H$20,VALUE($B$223),COLUMN()-COLUMN($A$240)+2)\n        ),\n        INDEX(BOARD_GRID!$B$14:$H$20,ROW()-ROW($A$240)+1,COLUMN()-COLUMN($A$240)+1)\n    ),\nIF($B$222=\"U\",\n    IF(COLUMN()-COLUMN($A$240)+1=VALUE($B$223),\n        IF(ROW()-ROW($A$240)+1=1,\n            IF($B$224=\"\",BOARD_GRID!$K$5,VALUE($B$224)),\n            INDEX(BOARD_GRID!$B$14:$H$20,ROW()-ROW($A$240),VALUE($B$223))\n        ),\n        INDEX(BOARD_GRID!$B$14:$H$20,ROW()-ROW($A$240)+1,COLUMN()-COLUMN($A$240)+1)\n    ),\nIF($B$222=\"D\",\n    IF(COLUMN()-COLUMN($A$240)+1=VALUE($B$223),\n        IF(ROW()-ROW($A$240)+1=7,\n            IF($B$224=\"\",BOARD_GRID!$K$5,VALUE($B$224)),\n            INDEX(BOARD_GRID!$B$14:$H$20,ROW()-ROW($A$240)+2,VALUE($B$223))\n        ),\n        INDEX(BOARD_GRID!$B$14:$H$20,ROW()-ROW($A$240)+1,COLUMN()-COLUMN($A$240)+1)\n    ),\n\"\")))))","v":""}]
[{"$f":"IF($B$222=\"\",\"\",IF($B$222=\"L\",\n    IF(ROW()-ROW($A$240)+1=VALUE($B$223),\n        IF(COLUMN()-COLUMN($A$240)+1=1,\n            IF($B$224=\"\",BOARD_GRID!$K$5,VALUE($B$224)),\n            INDEX(BOARD_GRID!$B$14:$H$20,VALUE($B$223),COLUMN()-COLUMN($A$240))\n        ),\n        INDEX(BOARD_GRID!$B$14:$H$20,ROW()-ROW($A$240)+1,COLUMN()-COLUMN($A$240)+1)\n    ),\nIF($B$222=\"R\",\n    IF(ROW()-ROW($A$240)+1=VALUE($B$223),\n        IF(COLUMN()-COLUMN($A$240)+1=7,\n            IF($B$224=\"\",BOARD_GRID!$K$5,VALUE($B$224)),\n            INDEX(BOARD_GRID!$B$14:$H$20,VALUE($B$223),COLUMN()-COLUMN($A$240)+2)\n        ),\n        INDEX(BOARD_GRID!$B$14:$H$20,ROW()-ROW($A$240)+1,COLUMN()-COLUMN($A$240)+1)\n    ),\nIF($B$222=\"U\",\n    IF(COLUMN()-COLUMN($A$240)+1=VALUE($B$223),\n        IF(ROW()-ROW($A$240)+1=1,\n            IF($B$224=\"\",BOARD_GRID!$K$5,VALUE($B$224)),\n            INDEX(BOARD_GRID!$B$14:$H$20,ROW()-ROW($A$240),VALUE($B$223))\n        ),\n        INDEX(BOARD_GRID!$B$14:$H$20,ROW()-ROW($A$240)+1,COLUMN()-COLUMN($A$240)+1)\n    ),\nIF($B$222=\"D\",\n    IF(COLUMN()-COLUMN($A$240)+1=VALUE($B$223),\n        IF(ROW()-ROW($A$240)+1=7,\n            IF($B$224=\"\",BOARD_GRID!$K$5,VALUE($B$224)),\n            INDEX(BOARD_GRID!$B$14:$H$20,ROW()-ROW($A$240)+2,VALUE($B$223))\n        ),\n        INDEX(BOARD_GRID!$B$14:$H$20,ROW()-ROW($A$240)+1,COLUMN()-COLUMN($A$240)+1)\n    ),\n\"\")))))","v":""},{"$f":"IF($B$222=\"\",\"\",IF($B$222=\"L\",\n    IF(ROW()-ROW($A$240)+1=VALUE($B$223),\n        IF(COLUMN()-COLUMN($A$240)+1=1,\n            IF($B$224=\"\",BOARD_GRID!$K$5,VALUE($B$224)),\n            INDEX(BOARD_GRID!$B$14:$H$20,VALUE($B$223),COLUMN()-COLUMN($A$240))\n        ),\n        INDEX(BOARD_GRID!$B$14:$H$20,ROW()-ROW($A$240)+1,COLUMN()-COLUMN($A$240)+1)\n    ),\nIF($B$222=\"R\",\n    IF(ROW()-ROW($A$240)+1=VALUE($B$223),\n        IF(COLUMN()-COLUMN($A$240)+1=7,\n            IF($B$224=\"\",BOARD_GRID!$K$5,VALUE($B$224)),\n            INDEX(BOARD_GRID!$B$14:$H$20,VALUE($B$223),COLUMN()-COLUMN($A$240)+2)\n        ),\n        INDEX(BOARD_GRID!$B$14:$H$20,ROW()-ROW($A$240)+1,COLUMN()-COLUMN($A$240)+1)\n    ),\nIF($B$222=\"U\",\n    IF(COLUMN()-COLUMN($A$240)+1=VALUE($B$223),\n        IF(ROW()-ROW($A$240)+1=1,\n            IF($B$224=\"\",BOARD_GRID!$K$5,VALUE($B$224)),\n            INDEX(BOARD_GRID!$B$14:$H$20,ROW()-ROW($A$240),VALUE($B$223))\n        ),\n        INDEX(BOARD_GRID!$B$14:$H$20,ROW()-ROW($A$240)+1,COLUMN()-COLUMN($A$240)+1)\n    ),\nIF($B$222=\"D\",\n    IF(COLUMN()-COLUMN($A$240)+1=VALUE($B$223),\n        IF(ROW()-ROW($A$240)+1=7,\n            IF($B$224=\"\",BOARD_GRID!$K$5,VALUE($B$224)),\n            INDEX(BOARD_GRID!$B$14:$H$20,ROW()-ROW($A$240)+2,VALUE($B$223))\n        ),\n        INDEX(BOARD_GRID!$B$14:$H$20,ROW()-ROW($A$240)+1,COLUMN()-COLUMN($A$240)+1)\n    ),\n\"\")))))","v":""},{"$f":"IF($B$222=\"\",\"\",IF($B$222=\"L\",\n    IF(ROW()-ROW($A$240)+1=VALUE($B$223),\n        IF(COLUMN()-COLUMN($A$240)+1=1,\n            IF($B$224=\"\",BOARD_GRID!$K$5,VALUE($B$224)),\n            INDEX(BOARD_GRID!$B$14:$H$20,VALUE($B$223),COLUMN()-COLUMN($A$240))\n        ),\n        INDEX(BOARD_GRID!$B$14:$H$20,ROW()-ROW($A$240)+1,COLUMN()-COLUMN($A$240)+1)\n    ),\nIF($B$222=\"R\",\n    IF(ROW()-ROW($A$240)+1=VALUE($B$223),\n        IF(COLUMN()-COLUMN($A$240)+1=7,\n            IF($B$224=\"\",BOARD_GRID!$K$5,VALUE($B$224)),\n            INDEX(BOARD_GRID!$B$14:$H$20,VALUE($B$223),COLUMN()-COLUMN($A$240)+2)\n        ),\n        INDEX(BOARD_GRID!$B$14:$H$20,ROW()-ROW($A$240)+1,COLUMN()-COLUMN($A$240)+1)\n    ),\nIF($B$222=\"U\",\n    IF(COLUMN()-COLUMN($A$240)+1=VALUE($B$223),\n        IF(ROW()-ROW($A$240)+1=1,\n            IF($B$224=\"\",BOARD_GRID!$K$5,VALUE($B$224)),\n            INDEX(BOARD_GRID!$B$14:$H$20,ROW()-ROW($A$240),VALUE($B$223))\n        ),\n        INDEX(BOARD_GRID!$B$14:$H$20,ROW()-ROW($A$240)+1,COLUMN()-COLUMN($A$240)+1)\n    ),\nIF($B$222=\"D\",\n    IF(COLUMN()-COLUMN($A$240)+1=VALUE($B$223),\n        IF(ROW()-ROW($A$240)+1=7,\n            IF($B$224=\"\",BOARD_GRID!$K$5,VALUE($B$224)),\n            INDEX(BOARD_GRID!$B$14:$H$20,ROW()-ROW($A$240)+2,VALUE($B$223))\n        ),\n        INDEX(BOARD_GRID!$B$14:$H$20,ROW()-ROW($A$240)+1,COLUMN()-COLUMN($A$240)+1)\n    ),\n\"\")))))","v":""},{"$f":"IF($B$222=\"\",\"\",IF($B$222=\"L\",\n    IF(ROW()-ROW($A$240)+1=VALUE($B$223),\n        IF(COLUMN()-COLUMN($A$240)+1=1,\n            IF($B$224=\"\",BOARD_GRID!$K$5,VALUE($B$224)),\n            INDEX(BOARD_GRID!$B$14:$H$20,VALUE($B$223),COLUMN()-COLUMN($A$240))\n        ),\n        INDEX(BOARD_GRID!$B$14:$H$20,ROW()-ROW($A$240)+1,COLUMN()-COLUMN($A$240)+1)\n    ),\nIF($B$222=\"R\",\n    IF(ROW()-ROW($A$240)+1=VALUE($B$223),\n        IF(COLUMN()-COLUMN($A$240)+1=7,\n            IF($B$224=\"\",BOARD_GRID!$K$5,VALUE($B$224)),\n            INDEX(BOARD_GRID!$B$14:$H$20,VALUE($B$223),COLUMN()-COLUMN($A$240)+2)\n        ),\n        INDEX(BOARD_GRID!$B$14:$H$20,ROW()-ROW($A$240)+1,COLUMN()-COLUMN($A$240)+1)\n    ),\nIF($B$222=\"U\",\n    IF(COLUMN()-COLUMN($A$240)+1=VALUE($B$223),\n        IF(ROW()-ROW($A$240)+1=1,\n            IF($B$224=\"\",BOARD_GRID!$K$5,VALUE($B$224)),\n            INDEX(BOARD_GRID!$B$14:$H$20,ROW()-ROW($A$240),VALUE($B$223))\n        ),\n        INDEX(BOARD_GRID!$B$14:$H$20,ROW()-ROW($A$240)+1,COLUMN()-COLUMN($A$240)+1)\n    ),\nIF($B$222=\"D\",\n    IF(COLUMN()-COLUMN($A$240)+1=VALUE($B$223),\n        IF(ROW()-ROW($A$240)+1=7,\n            IF($B$224=\"\",BOARD_GRID!$K$5,VALUE($B$224)),\n            INDEX(BOARD_GRID!$B$14:$H$20,ROW()-ROW($A$240)+2,VALUE($B$223))\n        ),\n        INDEX(BOARD_GRID!$B$14:$H$20,ROW()-ROW($A$240)+1,COLUMN()-COLUMN($A$240)+1)\n    ),\n\"\")))))","v":""},{"$f":"IF($B$222=\"\",\"\",IF($B$222=\"L\",\n    IF(ROW()-ROW($A$240)+1=VALUE($B$223),\n        IF(COLUMN()-COLUMN($A$240)+1=1,\n            IF($B$224=\"\",BOARD_GRID!$K$5,VALUE($B$224)),\n            INDEX(BOARD_GRID!$B$14:$H$20,VALUE($B$223),COLUMN()-COLUMN($A$240))\n        ),\n        INDEX(BOARD_GRID!$B$14:$H$20,ROW()-ROW($A$240)+1,COLUMN()-COLUMN($A$240)+1)\n    ),\nIF($B$222=\"R\",\n    IF(ROW()-ROW($A$240)+1=VALUE($B$223),\n        IF(COLUMN()-COLUMN($A$240)+1=7,\n            IF($B$224=\"\",BOARD_GRID!$K$5,VALUE($B$224)),\n            INDEX(BOARD_GRID!$B$14:$H$20,VALUE($B$223),COLUMN()-COLUMN($A$240)+2)\n        ),\n        INDEX(BOARD_GRID!$B$14:$H$20,ROW()-ROW($A$240)+1,COLUMN()-COLUMN($A$240)+1)\n    ),\nIF($B$222=\"U\",\n    IF(COLUMN()-COLUMN($A$240)+1=VALUE($B$223),\n        IF(ROW()-ROW($A$240)+1=1,\n            IF($B$224=\"\",BOARD_GRID!$K$5,VALUE($B$224)),\n            INDEX(BOARD_GRID!$B$14:$H$20,ROW()-ROW($A$240),VALUE($B$223))\n        ),\n        INDEX(BOARD_GRID!$B$14:$H$20,ROW()-ROW($A$240)+1,COLUMN()-COLUMN($A$240)+1)\n    ),\nIF($B$222=\"D\",\n    IF(COLUMN()-COLUMN($A$240)+1=VALUE($B$223),\n        IF(ROW()-ROW($A$240)+1=7,\n            IF($B$224=\"\",BOARD_GRID!$K$5,VALUE($B$224)),\n            INDEX(BOARD_GRID!$B$14:$H$20,ROW()-ROW($A$240)+2,VALUE($B$223))\n        ),\n        INDEX(BOARD_GRID!$B$14:$H$20,ROW()-ROW($A$240)+1,COLUMN()-COLUMN($A$240)+1)\n    ),\n\"\")))))","v":""},{"$f":"IF($B$222=\"\",\"\",IF($B$222=\"L\",\n    IF(ROW()-ROW($A$240)+1=VALUE($B$223),\n        IF(COLUMN()-COLUMN($A$240)+1=1,\n            IF($B$224=\"\",BOARD_GRID!$K$5,VALUE($B$224)),\n            INDEX(BOARD_GRID!$B$14:$H$20,VALUE($B$223),COLUMN()-COLUMN($A$240))\n        ),\n        INDEX(BOARD_GRID!$B$14:$H$20,ROW()-ROW($A$240)+1,COLUMN()-COLUMN($A$240)+1)\n    ),\nIF($B$222=\"R\",\n    IF(ROW()-ROW($A$240)+1=VALUE($B$223),\n        IF(COLUMN()-COLUMN($A$240)+1=7,\n            IF($B$224=\"\",BOARD_GRID!$K$5,VALUE($B$224)),\n            INDEX(BOARD_GRID!$B$14:$H$20,VALUE($B$223),COLUMN()-COLUMN($A$240)+2)\n        ),\n        INDEX(BOARD_GRID!$B$14:$H$20,ROW()-ROW($A$240)+1,COLUMN()-COLUMN($A$240)+1)\n    ),\nIF($B$222=\"U\",\n    IF(COLUMN()-COLUMN($A$240)+1=VALUE($B$223),\n        IF(ROW()-ROW($A$240)+1=1,\n            IF($B$224=\"\",BOARD_GRID!$K$5,VALUE($B$224)),\n            INDEX(BOARD_GRID!$B$14:$H$20,ROW()-ROW($A$240),VALUE($B$223))\n        ),\n        INDEX(BOARD_GRID!$B$14:$H$20,ROW()-ROW($A$240)+1,COLUMN()-COLUMN($A$240)+1)\n    ),\nIF($B$222=\"D\",\n    IF(COLUMN()-COLUMN($A$240)+1=VALUE($B$223),\n        IF(ROW()-ROW($A$240)+1=7,\n            IF($B$224=\"\",BOARD_GRID!$K$5,VALUE($B$224)),\n            INDEX(BOARD_GRID!$B$14:$H$20,ROW()-ROW($A$240)+2,VALUE($B$223))\n        ),\n        INDEX(BOARD_GRID!$B$14:$H$20,ROW()-ROW($A$240)+1,COLUMN()-COLUMN($A$240)+1)\n    ),\n\"\")))))","v":""},{"$f":"IF($B$222=\"\",\"\",IF($B$222=\"L\",\n    IF(ROW()-ROW($A$240)+1=VALUE($B$223),\n        IF(COLUMN()-COLUMN($A$240)+1=1,\n            IF($B$224=\"\",BOARD_GRID!$K$5,VALUE($B$224)),\n            INDEX(BOARD_GRID!$B$14:$H$20,VALUE($B$223),COLUMN()-COLUMN($A$240))\n        ),\n        INDEX(BOARD_GRID!$B$14:$H$20,ROW()-ROW($A$240)+1,COLUMN()-COLUMN($A$240)+1)\n    ),\nIF($B$222=\"R\",\n    IF(ROW()-ROW($A$240)+1=VALUE($B$223),\n        IF(COLUMN()-COLUMN($A$240)+1=7,\n            IF($B$224=\"\",BOARD_GRID!$K$5,VALUE($B$224)),\n            INDEX(BOARD_GRID!$B$14:$H$20,VALUE($B$223),COLUMN()-COLUMN($A$240)+2)\n        ),\n        INDEX(BOARD_GRID!$B$14:$H$20,ROW()-ROW($A$240)+1,COLUMN()-COLUMN($A$240)+1)\n    ),\nIF($B$222=\"U\",\n    IF(COLUMN()-COLUMN($A$240)+1=VALUE($B$223),\n        IF(ROW()-ROW($A$240)+1=1,\n            IF($B$224=\"\",BOARD_GRID!$K$5,VALUE($B$224)),\n            INDEX(BOARD_GRID!$B$14:$H$20,ROW()-ROW($A$240),VALUE($B$223))\n        ),\n        INDEX(BOARD_GRID!$B$14:$H$20,ROW()-ROW($A$240)+1,COLUMN()-COLUMN($A$240)+1)\n    ),\nIF($B$222=\"D\",\n    IF(COLUMN()-COLUMN($A$240)+1=VALUE($B$223),\n        IF(ROW()-ROW($A$240)+1=7,\n            IF($B$224=\"\",BOARD_GRID!$K$5,VALUE($B$224)),\n            INDEX(BOARD_GRID!$B$14:$H$20,ROW()-ROW($A$240)+2,VALUE($B$223))\n        ),\n        INDEX(BOARD_GRID!$B$14:$H$20,ROW()-ROW($A$240)+1,COLUMN()-COLUMN($A$240)+1)\n    ),\n\"\")))))","v":""}]
[{"$f":"IF($B$222=\"\",\"\",IF($B$222=\"L\",\n    IF(ROW()-ROW($A$240)+1=VALUE($B$223),\n        IF(COLUMN()-COLUMN($A$240)+1=1,\n            IF($B$224=\"\",BOARD_GRID!$K$5,VALUE($B$224)),\n            INDEX(BOARD_GRID!$B$14:$H$20,VALUE($B$223),COLUMN()-COLUMN($A$240))\n        ),\n        INDEX(BOARD_GRID!$B$14:$H$20,ROW()-ROW($A$240)+1,COLUMN()-COLUMN($A$240)+1)\n    ),\nIF($B$222=\"R\",\n    IF(ROW()-ROW($A$240)+1=VALUE($B$223),\n        IF(COLUMN()-COLUMN($A$240)+1=7,\n            IF($B$224=\"\",BOARD_GRID!$K$5,VALUE($B$224)),\n            INDEX(BOARD_GRID!$B$14:$H$20,VALUE($B$223),COLUMN()-COLUMN($A$240)+2)\n        ),\n        INDEX(BOARD_GRID!$B$14:$H$20,ROW()-ROW($A$240)+1,COLUMN()-COLUMN($A$240)+1)\n    ),\nIF($B$222=\"U\",\n    IF(COLUMN()-COLUMN($A$240)+1=VALUE($B$223),\n        IF(ROW()-ROW($A$240)+1=1,\n            IF($B$224=\"\",BOARD_GRID!$K$5,VALUE($B$224)),\n            INDEX(BOARD_GRID!$B$14:$H$20,ROW()-ROW($A$240),VALUE($B$223))\n        ),\n        INDEX(BOARD_GRID!$B$14:$H$20,ROW()-ROW($A$240)+1,COLUMN()-COLUMN($A$240)+1)\n    ),\nIF($B$222=\"D\",\n    IF(COLUMN()-COLUMN($A$240)+1=VALUE($B$223),\n        IF(ROW()-ROW($A$240)+1=7,\n            IF($B$224=\"\",BOARD_GRID!$K$5,VALUE($B$224)),\n            INDEX(BOARD_GRID!$B$14:$H$20,ROW()-ROW($A$240)+2,VALUE($B$223))\n        ),\n        INDEX(BOARD_GRID!$B$14:$H$20,ROW()-ROW($A$240)+1,COLUMN()-COLUMN($A$240)+1)\n    ),\n\"\")))))","v":""},{"$f":"IF($B$222=\"\",\"\",IF($B$222=\"L\",\n    IF(ROW()-ROW($A$240)+1=VALUE($B$223),\n        IF(COLUMN()-COLUMN($A$240)+1=1,\n            IF($B$224=\"\",BOARD_GRID!$K$5,VALUE($B$224)),\n            INDEX(BOARD_GRID!$B$14:$H$20,VALUE($B$223),COLUMN()-COLUMN($A$240))\n        ),\n        INDEX(BOARD_GRID!$B$14:$H$20,ROW()-ROW($A$240)+1,COLUMN()-COLUMN($A$240)+1)\n    ),\nIF($B$222=\"R\",\n    IF(ROW()-ROW($A$240)+1=VALUE($B$223),\n        IF(COLUMN()-COLUMN($A$240)+1=7,\n            IF($B$224=\"\",BOARD_GRID!$K$5,VALUE($B$224)),\n            INDEX(BOARD_GRID!$B$14:$H$20,VALUE($B$223),COLUMN()-COLUMN($A$240)+2)\n        ),\n        INDEX(BOARD_GRID!$B$14:$H$20,ROW()-ROW($A$240)+1,COLUMN()-COLUMN($A$240)+1)\n    ),\nIF($B$222=\"U\",\n    IF(COLUMN()-COLUMN($A$240)+1=VALUE($B$223),\n        IF(ROW()-ROW($A$240)+1=1,\n            IF($B$224=\"\",BOARD_GRID!$K$5,VALUE($B$224)),\n            INDEX(BOARD_GRID!$B$14:$H$20,ROW()-ROW($A$240),VALUE($B$223))\n        ),\n        INDEX(BOARD_GRID!$B$14:$H$20,ROW()-ROW($A$240)+1,COLUMN()-COLUMN($A$240)+1)\n    ),\nIF($B$222=\"D\",\n    IF(COLUMN()-COLUMN($A$240)+1=VALUE($B$223),\n        IF(ROW()-ROW($A$240)+1=7,\n            IF($B$224=\"\",BOARD_GRID!$K$5,VALUE($B$224)),\n            INDEX(BOARD_GRID!$B$14:$H$20,ROW()-ROW($A$240)+2,VALUE($B$223))\n        ),\n        INDEX(BOARD_GRID!$B$14:$H$20,ROW()-ROW($A$240)+1,COLUMN()-COLUMN($A$240)+1)\n    ),\n\"\")))))","v":""},{"$f":"IF($B$222=\"\",\"\",IF($B$222=\"L\",\n    IF(ROW()-ROW($A$240)+1=VALUE($B$223),\n        IF(COLUMN()-COLUMN($A$240)+1=1,\n            IF($B$224=\"\",BOARD_GRID!$K$5,VALUE($B$224)),\n            INDEX(BOARD_GRID!$B$14:$H$20,VALUE($B$223),COLUMN()-COLUMN($A$240))\n        ),\n        INDEX(BOARD_GRID!$B$14:$H$20,ROW()-ROW($A$240)+1,COLUMN()-COLUMN($A$240)+1)\n    ),\nIF($B$222=\"R\",\n    IF(ROW()-ROW($A$240)+1=VALUE($B$223),\n        IF(COLUMN()-COLUMN($A$240)+1=7,\n            IF($B$224=\"\",BOARD_GRID!$K$5,VALUE($B$224)),\n            INDEX(BOARD_GRID!$B$14:$H$20,VALUE($B$223),COLUMN()-COLUMN($A$240)+2)\n        ),\n        INDEX(BOARD_GRID!$B$14:$H$20,ROW()-ROW($A$240)+1,COLUMN()-COLUMN($A$240)+1)\n    ),\nIF($B$222=\"U\",\n    IF(COLUMN()-COLUMN($A$240)+1=VALUE($B$223),\n        IF(ROW()-ROW($A$240)+1=1,\n            IF($B$224=\"\",BOARD_GRID!$K$5,VALUE($B$224)),\n            INDEX(BOARD_GRID!$B$14:$H$20,ROW()-ROW($A$240),VALUE($B$223))\n        ),\n        INDEX(BOARD_GRID!$B$14:$H$20,ROW()-ROW($A$240)+1,COLUMN()-COLUMN($A$240)+1)\n    ),\nIF($B$222=\"D\",\n    IF(COLUMN()-COLUMN($A$240)+1=VALUE($B$223),\n        IF(ROW()-ROW($A$240)+1=7,\n            IF($B$224=\"\",BOARD_GRID!$K$5,VALUE($B$224)),\n            INDEX(BOARD_GRID!$B$14:$H$20,ROW()-ROW($A$240)+2,VALUE($B$223))\n        ),\n        INDEX(BOARD_GRID!$B$14:$H$20,ROW()-ROW($A$240)+1,COLUMN()-COLUMN($A$240)+1)\n    ),\n\"\")))))","v":""},{"$f":"IF($B$222=\"\",\"\",IF($B$222=\"L\",\n    IF(ROW()-ROW($A$240)+1=VALUE($B$223),\n        IF(COLUMN()-COLUMN($A$240)+1=1,\n            IF($B$224=\"\",BOARD_GRID!$K$5,VALUE($B$224)),\n            INDEX(BOARD_GRID!$B$14:$H$20,VALUE($B$223),COLUMN()-COLUMN($A$240))\n        ),\n        INDEX(BOARD_GRID!$B$14:$H$20,ROW()-ROW($A$240)+1,COLUMN()-COLUMN($A$240)+1)\n    ),\nIF($B$222=\"R\",\n    IF(ROW()-ROW($A$240)+1=VALUE($B$223),\n        IF(COLUMN()-COLUMN($A$240)+1=7,\n            IF($B$224=\"\",BOARD_GRID!$K$5,VALUE($B$224)),\n            INDEX(BOARD_GRID!$B$14:$H$20,VALUE($B$223),COLUMN()-COLUMN($A$240)+2)\n        ),\n        INDEX(BOARD_GRID!$B$14:$H$20,ROW()-ROW($A$240)+1,COLUMN()-COLUMN($A$240)+1)\n    ),\nIF($B$222=\"U\",\n    IF(COLUMN()-COLUMN($A$240)+1=VALUE($B$223),\n        IF(ROW()-ROW($A$240)+1=1,\n            IF($B$224=\"\",BOARD_GRID!$K$5,VALUE($B$224)),\n            INDEX(BOARD_GRID!$B$14:$H$20,ROW()-ROW($A$240),VALUE($B$223))\n        ),\n        INDEX(BOARD_GRID!$B$14:$H$20,ROW()-ROW($A$240)+1,COLUMN()-COLUMN($A$240)+1)\n    ),\nIF($B$222=\"D\",\n    IF(COLUMN()-COLUMN($A$240)+1=VALUE($B$223),\n        IF(ROW()-ROW($A$240)+1=7,\n            IF($B$224=\"\",BOARD_GRID!$K$5,VALUE($B$224)),\n            INDEX(BOARD_GRID!$B$14:$H$20,ROW()-ROW($A$240)+2,VALUE($B$223))\n        ),\n        INDEX(BOARD_GRID!$B$14:$H$20,ROW()-ROW($A$240)+1,COLUMN()-COLUMN($A$240)+1)\n    ),\n\"\")))))","v":""},{"$f":"IF($B$222=\"\",\"\",IF($B$222=\"L\",\n    IF(ROW()-ROW($A$240)+1=VALUE($B$223),\n        IF(COLUMN()-COLUMN($A$240)+1=1,\n            IF($B$224=\"\",BOARD_GRID!$K$5,VALUE($B$224)),\n            INDEX(BOARD_GRID!$B$14:$H$20,VALUE($B$223),COLUMN()-COLUMN($A$240))\n        ),\n        INDEX(BOARD_GRID!$B$14:$H$20,ROW()-ROW($A$240)+1,COLUMN()-COLUMN($A$240)+1)\n    ),\nIF($B$222=\"R\",\n    IF(ROW()-ROW($A$240)+1=VALUE($B$223),\n        IF(COLUMN()-COLUMN($A$240)+1=7,\n            IF($B$224=\"\",BOARD_GRID!$K$5,VALUE($B$224)),\n            INDEX(BOARD_GRID!$B$14:$H$20,VALUE($B$223),COLUMN()-COLUMN($A$240)+2)\n        ),\n        INDEX(BOARD_GRID!$B$14:$H$20,ROW()-ROW($A$240)+1,COLUMN()-COLUMN($A$240)+1)\n    ),\nIF($B$222=\"U\",\n    IF(COLUMN()-COLUMN($A$240)+1=VALUE($B$223),\n        IF(ROW()-ROW($A$240)+1=1,\n            IF($B$224=\"\",BOARD_GRID!$K$5,VALUE($B$224)),\n            INDEX(BOARD_GRID!$B$14:$H$20,ROW()-ROW($A$240),VALUE($B$223))\n        ),\n        INDEX(BOARD_GRID!$B$14:$H$20,ROW()-ROW($A$240)+1,COLUMN()-COLUMN($A$240)+1)\n    ),\nIF($B$222=\"D\",\n    IF(COLUMN()-COLUMN($A$240)+1=VALUE($B$223),\n        IF(ROW()-ROW($A$240)+1=7,\n            IF($B$224=\"\",BOARD_GRID!$K$5,VALUE($B$224)),\n            INDEX(BOARD_GRID!$B$14:$H$20,ROW()-ROW($A$240)+2,VALUE($B$223))\n        ),\n        INDEX(BOARD_GRID!$B$14:$H$20,ROW()-ROW($A$240)+1,COLUMN()-COLUMN($A$240)+1)\n    ),\n\"\")))))","v":""},{"$f":"IF($B$222=\"\",\"\",IF($B$222=\"L\",\n    IF(ROW()-ROW($A$240)+1=VALUE($B$223),\n        IF(COLUMN()-COLUMN($A$240)+1=1,\n            IF($B$224=\"\",BOARD_GRID!$K$5,VALUE($B$224)),\n            INDEX(BOARD_GRID!$B$14:$H$20,VALUE($B$223),COLUMN()-COLUMN($A$240))\n        ),\n        INDEX(BOARD_GRID!$B$14:$H$20,ROW()-ROW($A$240)+1,COLUMN()-COLUMN($A$240)+1)\n    ),\nIF($B$222=\"R\",\n    IF(ROW()-ROW($A$240)+1=VALUE($B$223),\n        IF(COLUMN()-COLUMN($A$240)+1=7,\n            IF($B$224=\"\",BOARD_GRID!$K$5,VALUE($B$224)),\n            INDEX(BOARD_GRID!$B$14:$H$20,VALUE($B$223),COLUMN()-COLUMN($A$240)+2)\n        ),\n        INDEX(BOARD_GRID!$B$14:$H$20,ROW()-ROW($A$240)+1,COLUMN()-COLUMN($A$240)+1)\n    ),\nIF($B$222=\"U\",\n    IF(COLUMN()-COLUMN($A$240)+1=VALUE($B$223),\n        IF(ROW()-ROW($A$240)+1=1,\n            IF($B$224=\"\",BOARD_GRID!$K$5,VALUE($B$224)),\n            INDEX(BOARD_GRID!$B$14:$H$20,ROW()-ROW($A$240),VALUE($B$223))\n        ),\n        INDEX(BOARD_GRID!$B$14:$H$20,ROW()-ROW($A$240)+1,COLUMN()-COLUMN($A$240)+1)\n    ),\nIF($B$222=\"D\",\n    IF(COLUMN()-COLUMN($A$240)+1=VALUE($B$223),\n        IF(ROW()-ROW($A$240)+1=7,\n            IF($B$224=\"\",BOARD_GRID!$K$5,VALUE($B$224)),\n            INDEX(BOARD_GRID!$B$14:$H$20,ROW()-ROW($A$240)+2,VALUE($B$223))\n        ),\n        INDEX(BOARD_GRID!$B$14:$H$20,ROW()-ROW($A$240)+1,COLUMN()-COLUMN($A$240)+1)\n    ),\n\"\")))))","v":""},{"$f":"IF($B$222=\"\",\"\",IF($B$222=\"L\",\n    IF(ROW()-ROW($A$240)+1=VALUE($B$223),\n        IF(COLUMN()-COLUMN($A$240)+1=1,\n            IF($B$224=\"\",BOARD_GRID!$K$5,VALUE($B$224)),\n            INDEX(BOARD_GRID!$B$14:$H$20,VALUE($B$223),COLUMN()-COLUMN($A$240))\n        ),\n        INDEX(BOARD_GRID!$B$14:$H$20,ROW()-ROW($A$240)+1,COLUMN()-COLUMN($A$240)+1)\n    ),\nIF($B$222=\"R\",\n    IF(ROW()-ROW($A$240)+1=VALUE($B$223),\n        IF(COLUMN()-COLUMN($A$240)+1=7,\n            IF($B$224=\"\",BOARD_GRID!$K$5,VALUE($B$224)),\n            INDEX(BOARD_GRID!$B$14:$H$20,VALUE($B$223),COLUMN()-COLUMN($A$240)+2)\n        ),\n        INDEX(BOARD_GRID!$B$14:$H$20,ROW()-ROW($A$240)+1,COLUMN()-COLUMN($A$240)+1)\n    ),\nIF($B$222=\"U\",\n    IF(COLUMN()-COLUMN($A$240)+1=VALUE($B$223),\n        IF(ROW()-ROW($A$240)+1=1,\n            IF($B$224=\"\",BOARD_GRID!$K$5,VALUE($B$224)),\n            INDEX(BOARD_GRID!$B$14:$H$20,ROW()-ROW($A$240),VALUE($B$223))\n        ),\n        INDEX(BOARD_GRID!$B$14:$H$20,ROW()-ROW($A$240)+1,COLUMN()-COLUMN($A$240)+1)\n    ),\nIF($B$222=\"D\",\n    IF(COLUMN()-COLUMN($A$240)+1=VALUE($B$223),\n        IF(ROW()-ROW($A$240)+1=7,\n            IF($B$224=\"\",BOARD_GRID!$K$5,VALUE($B$224)),\n            INDEX(BOARD_GRID!$B$14:$H$20,ROW()-ROW($A$240)+2,VALUE($B$223))\n        ),\n        INDEX(BOARD_GRID!$B$14:$H$20,ROW()-ROW($A$240)+1,COLUMN()-COLUMN($A$240)+1)\n    ),\n\"\")))))","v":""}]
[]
[]
[]
[]
[]
[]
[]
[]
[]
["PHASE","MOVE"]
[]
["Active player","P2"]
[]
[null,null,null,null,null,null,null,null,7,3]
[null,null,null,null,null,null,null,null,7,4]
[null,null,null,null,null,null,null,null,7,5]
[null,null,null,null,null,null,null,null,7,6]
[null,null,null,null,null,null,null,null,7,7]
[]
[null,null,1,1,1,1,1]
[]
["TARGET"]
["Row"]
["Col"]

{"sheet":"GV2_LOG","index":12,"n_rows":17,"n_cols":9,"rows_kept":17,"cut":false,"hidden":false,"merged":[]}
["BoardPos(0based)","rr/cc(1based)","TileID(raw)","TileKey","Rot","TilesRow","ImgCell","FoundPic","Status"]
["(0,0)","2025-01-01","F01","F01",90,2,"I2","YES","OK"]
["(0,2)","2025-01-03","F05","F05",180,6,"I6","YES","OK"]
["(0,4)","2025-01-05","F06","F06",180,7,"I7","YES","OK"]
["(0,6)","2025-01-07","F02","F02",180,3,"I3","YES","OK"]
["(2,0)","2025-03-01","F07","F07",90,8,"I8","YES","OK"]
["(2,2)","2025-03-03","F08","F08",90,9,"I9","YES","OK"]
["(2,4)","2025-03-05","F09","F09",180,10,"I10","YES","OK"]
["(2,6)","2025-03-07","F10","F10",270,11,"I11","YES","OK"]
["(4,0)","2025-05-01","F11","F11",90,12,"I12","YES","OK"]
["(4,2)","2025-05-03","F12","F12",0,13,"I13","YES","OK"]
["(4,4)","2025-05-05","F13","F13",270,14,"I14","YES","OK"]
["(4,6)","2025-05-07","F14","F14",270,15,"I15","YES","OK"]
["(6,0)","2025-07-01","F04","F04",0,5,"I5","YES","OK"]
["(6,2)","2025-07-03","F15","F15",0,16,"I16","YES","OK"]
["(6,4)","2025-07-05","F16","F16",0,17,"I17","YES","OK"]
["(6,6)","2025-07-07","F03","F03",270,4,"I4","YES","OK"]