{"text_format":"1","workbook":"xlsx","n_sheets":11,"sheets":["Leírás","Kiinduló adatok","Adatbázis","Kimutatás darab","Kimutatás   érték","Munka2","sorszám-inverz","COCO","inverz","inverz1000000","direkt1000000"],"not_rendered":{"charts":0,"images":1,"macros":0,"external_links":0,"defined_names":1,"comments":0,"pivot_tables":2},"unopened":[],"bounds":{"document_bytes":16777216,"sheet_cells":100000,"rows_first":2000,"rows_last":500,"rows_between":2000,"halvings":0,"cell_chars":16384,"cell_head_chars":4096},"cells_cut":0,"cells_raw":0,"read":"whole","date_system":"1900"}

{"sheet":"Leírás","index":0,"n_rows":14,"n_cols":1,"rows_kept":14,"cut":false,"hidden":false,"merged":[]}
["Véletlenszerű mintavételes kérdőív alapján"]
["külföldi munkavégzés szempontjából"]
["az ideális jelölt kiválasztása"]
[]
[]
[]
["Tartalom:"]
["Kiinduló adatok"]
["Adatbázis"]
["Kimutatás darab"]
["Kimutatás   érték"]
["sorszám-inverz"]
["COCO"]
["inverz"]

{"sheet":"Kiinduló adatok","index":1,"n_rows":112,"n_cols":20,"rows_kept":112,"cut":false,"hidden":false,"merged":[]}
[null,"Attributum"]
["Darab/          Mértékegység","alkalmazkodás","nyitottság","döntésképesség","rátermettség","kezdeményező                          készség","becsületesség","hűség","önállóság","konfliktus           kezelés","segítőkészség","pontosság","csapatjáték","karrier             fejlesztés","képzés","családi       élet","párkapcsolat","vallás","összesen"]
["Objektum","pont","pont","pont","pont","pont","pont","pont","pont","pont","pont","pont","pont","pont","pont","pont","pont","pont"]
["tesztalany 1",4,5,4,5,4,5,5,4,4,5,5,5,4,5,5,4,5,{"$f":"SUM(B4:R4)","v":78}]
["tesztalany 2",5,5,5,5,3,5,5,5,4,5,5,5,2,1,5,2,0,{"$f":"SUM(B5:R5)","v":67}]
["tesztalany 3",4,4,4,3,3,4,4,5,4,4,3,4,4,2,3,1,5,61]
["tesztalany 4",4,5,3,4,4,5,3,4,4,5,5,5,3,5,5,3,5,72]
["tesztalany 5",2,1,5,4,4,3,4,3,3,4,3,4,5,0,0,0,0,45]
["tesztalany 6",4,5,5,4,4,5,5,4,4,5,3,4,0,1,5,0,0,58]
["tesztalany 7",3,4,4,4,3,4,5,5,4,5,4,4,5,2,3,4,1,64]
["tesztalany 8",4,4,2,3,4,5,5,4,2,5,4,5,3,3,3,3,3,62]
["tesztalany 9",5,5,5,5,5,5,5,5,5,5,5,5,0,5,0,0,0,65]
["tesztalany 10",5,5,5,4,5,5,5,5,3,5,5,4,0,1,5,5,5,72]
["tesztalany 11",4,2,1,3,3,5,5,4,5,5,5,4,3,2,5,4,1,61]
["tesztalany 12",5,5,5,3,3,5,5,5,5,5,5,5,3,3,5,5,0,72]
["tesztalany 13",4,5,4,3,3,5,5,5,4,5,4,4,2,3,5,4,1,66]
["tesztalany 14",4,4,5,3,5,5,5,3,5,5,4,4,0,3,5,5,3,68]
["tesztalany 15",4,4,4,3,3,4,4,5,3,4,3,4,5,1,4,2,3,60]
["tesztalany 16",4,5,5,3,5,5,5,5,3,5,5,5,0,0,5,5,0,65]
["tesztalany 17",3,5,4,3,3,5,5,5,3,4,5,3,4,4,5,5,5,71]
["tesztalany 18",4,4,3,2,3,4,5,4,4,4,3,3,4,1,5,5,2,60]
["tesztalany 19",3,3,4,2,2,2,4,3,2,4,3,3,2,0,4,4,4,49]
["tesztalany 20",5,5,4,3,5,5,4,4,5,5,5,5,2,3,5,4,1,70]
["tesztalany 21",4,5,1,3,5,5,5,5,3,3,5,5,2,2,5,5,5,68]
["tesztalany 22",5,5,4,3,3,4,5,5,4,3,3,3,0,0,0,5,0,52]
["tesztalany 23",3,4,4,3,4,5,4,4,3,4,4,3,2,4,5,3,1,60]
["tesztalany 24",3,4,4,2,4,5,4,3,3,5,2,4,4,4,4,4,0,59]
["tesztalany 25",3,4,4,4,4,5,5,4,3,5,5,4,1,2,4,3,0,60]
["tesztalany 26",3,5,5,4,5,5,3,3,4,5,4,5,4,4,5,5,0,69]
["tesztalany 27",3,3,3,3,5,5,5,3,5,4,4,4,0,0,5,5,3,60]
["tesztalany 28",4,5,3,3,4,5,5,4,3,5,4,4,1,3,4,2,5,64]
["tesztalany 29",3,3,3,2,4,5,5,3,2,4,4,4,2,2,5,3,3,57]
["tesztalany 30",5,5,4,5,5,5,5,5,5,5,5,5,5,5,5,5,5,84]
["tesztalany 31",4,4,5,3,4,5,5,4,3,5,4,4,0,2,5,5,0,62]
["tesztalany 32",4,4,5,4,3,5,5,4,5,5,5,4,2,5,4,1,3,68]
["tesztalany 33",4,3,4,4,4,4,4,4,3,4,3,4,1,2,3,4,0,55]
["tesztalany 34",4,4,5,4,4,4,5,5,4,4,4,4,2,1,4,3,0,61]
["tesztalany 35",3,4,5,4,5,5,5,4,4,5,4,5,1,4,5,3,0,66]
["tesztalany 36",4,5,4,4,4,5,5,4,4,4,3,4,2,3,5,4,0,64]
["tesztalany 37",5,5,4,5,5,5,5,5,5,5,5,5,5,5,5,5,5,84]
["tesztalany 38",3,5,5,3,5,5,4,5,5,5,4,4,4,4,5,0,5,71]
["tesztalany 39",3,5,4,3,3,5,5,5,4,5,5,4,0,3,5,5,2,66]
["tesztalany 40",5,5,4,4,4,4,5,5,5,3,3,5,4,2,5,4,0,67]
["tesztalany 41",2,4,2,3,4,5,4,4,3,4,5,5,3,2,5,4,0,59]
["tesztalany 42",5,5,2,4,4,4,3,5,3,5,3,5,5,5,4,4,0,66]
["tesztalany 43",5,5,5,5,5,5,5,5,5,5,4,5,4,5,5,5,3,81]
["tesztalany 44",4,5,5,4,4,5,5,4,4,5,4,4,4,4,5,4,4,74]
["tesztalany 45",4,3,5,4,2,5,5,5,3,5,4,5,4,5,0,0,0,59]
["tesztalany 46",5,5,4,3,3,5,4,5,4,4,3,4,3,5,3,3,3,66]
["tesztalany 47",4,4,4,4,3,4,4,4,3,4,4,3,3,3,4,4,3,62]
["tesztalany 48",4,4,3,3,3,4,5,4,5,3,4,4,5,4,4,4,2,65]
["tesztalany 49",3,5,4,3,3,5,5,4,3,5,4,5,2,3,5,4,1,64]
["tesztalany 50",3,5,5,3,5,4,5,5,4,4,4,3,3,2,5,4,1,65]
[]
[null,null,null,null,null,null,null,null,null,null,null,null,null,null,null,null,null,null,null,{"$f":"MAX(S4:S53)","v":84}]
["irány",0,0,0,0,0,0,1,0,0,0,0,1,0,0,1,1,1]
["súly",5,4,5,5,4,4,4,5,3,4,4,3,5,4,3,2,1]
[]
[]
["súlyok",{"$f":"B2","v":"alkalmazkodás"},{"$f":"C2","v":"nyitottság"},"döntésképesség","rátermettség","kezdeményező                          készség","becsületesség","hűség","önállóság","konfliktus           kezelés","segítőkészség","pontosság","csapatjáték","karrier             fejlesztés","képzés","családi       élet","párkapcsolat","vallás"]
[{"$f":"A4","v":"tesztalany 1"},{"$f":"B$57*B4","v":20},20,20,25,16,20,20,20,12,20,20,15,20,20,15,8,5,{"$f":"SUM(B61:R61)","v":296}]
[{"$f":"A5","v":"tesztalany 2"},{"$f":"B$57*B5","v":25},20,25,25,12,20,20,25,12,20,20,15,10,4,15,4,0,{"$f":"SUM(B62:R62)","v":272}]
["tesztalany 3",{"$f":"B$57*B6","v":20},16,20,15,12,16,16,25,12,16,12,12,20,8,9,2,5,236]
["tesztalany 4",{"$f":"B$57*B7","v":20},20,15,20,16,20,12,20,12,20,20,15,15,20,15,6,5,271]
["tesztalany 5",{"$f":"B$57*B8","v":10},4,25,20,16,12,16,15,9,16,12,12,25,0,0,0,0,192]
["tesztalany 6",{"$f":"B$57*B9","v":20},20,25,20,16,20,20,20,12,20,12,12,0,4,15,0,0,236]
["tesztalany 7",{"$f":"B$57*B10","v":15},16,20,20,12,16,20,25,12,20,16,12,25,8,9,8,1,255]
["tesztalany 8",{"$f":"B$57*B11","v":20},16,10,15,16,20,20,20,6,20,16,15,15,12,9,6,3,239]
["tesztalany 9",{"$f":"B$57*B12","v":25},20,25,25,20,20,20,25,15,20,20,15,0,20,0,0,0,270]
["tesztalany 10",{"$f":"B$57*B13","v":25},20,25,20,20,20,20,25,9,20,20,12,0,4,15,10,5,270]
["tesztalany 11",{"$f":"B$57*B14","v":20},8,5,15,12,20,20,20,15,20,20,12,15,8,15,8,1,234]
["tesztalany 12",{"$f":"B$57*B15","v":25},20,25,15,12,20,20,25,15,20,20,15,15,12,15,10,0,284]
["tesztalany 13",{"$f":"B$57*B16","v":20},20,20,15,12,20,20,25,12,20,16,12,10,12,15,8,1,258]
["tesztalany 14",{"$f":"B$57*B17","v":20},16,25,15,20,20,20,15,15,20,16,12,0,12,15,10,3,254]
["tesztalany 15",{"$f":"B$57*B18","v":20},16,20,15,12,16,16,25,9,16,12,12,25,4,12,4,3,237]
["tesztalany 16",{"$f":"B$57*B19","v":20},20,25,15,20,20,20,25,9,20,20,15,0,0,15,10,0,254]
["tesztalany 17",{"$f":"B$57*B20","v":15},20,20,15,12,20,20,25,9,16,20,9,20,16,15,10,5,267]
["tesztalany 18",{"$f":"B$57*B21","v":20},16,15,10,12,16,20,20,12,16,12,9,20,4,15,10,2,229]
["tesztalany 19",{"$f":"B$57*B22","v":15},12,20,10,8,8,16,15,6,16,12,9,10,0,12,8,4,181]
["tesztalany 20",{"$f":"B$57*B23","v":25},20,20,15,20,20,16,20,15,20,20,15,10,12,15,8,1,272]
["tesztalany 21",{"$f":"B$57*B24","v":20},20,5,15,20,20,20,25,9,12,20,15,10,8,15,10,5,249]
["tesztalany 22",{"$f":"B$57*B25","v":25},20,20,15,12,16,20,25,12,12,12,9,0,0,0,10,0,208]
["tesztalany 23",{"$f":"B$57*B26","v":15},16,20,15,16,20,16,20,9,16,16,9,10,16,15,6,1,236]
["tesztalany 24",{"$f":"B$57*B27","v":15},16,20,10,16,20,16,15,9,20,8,12,20,16,12,8,0,233]
["tesztalany 25",{"$f":"B$57*B28","v":15},16,20,20,16,20,20,20,9,20,20,12,5,8,12,6,0,239]
["tesztalany 26",{"$f":"B$57*B29","v":15},20,25,20,20,20,12,15,12,20,16,15,20,16,15,10,0,271]
["tesztalany 27",{"$f":"B$57*B30","v":15},12,15,15,20,20,20,15,15,16,16,12,0,0,15,10,3,219]
["tesztalany 28",{"$f":"B$57*B31","v":20},20,15,15,16,20,20,20,9,20,16,12,5,12,12,4,5,241]
["tesztalany 29",{"$f":"B$57*B32","v":15},12,15,10,16,20,20,15,6,16,16,12,10,8,15,6,3,215]
["tesztalany 30",{"$f":"B$57*B33","v":25},20,20,25,20,20,20,25,15,20,20,15,25,20,15,10,5,320]
["tesztalany 31",{"$f":"B$57*B34","v":20},16,25,15,16,20,20,20,9,20,16,12,0,8,15,10,0,242]
["tesztalany 32",{"$f":"B$57*B35","v":20},16,25,20,12,20,20,20,15,20,20,12,10,20,12,2,3,267]
["tesztalany 33",{"$f":"B$57*B36","v":20},12,20,20,16,16,16,20,9,16,12,12,5,8,9,8,0,219]
["tesztalany 34",{"$f":"B$57*B37","v":20},16,25,20,16,16,20,25,12,16,16,12,10,4,12,6,0,246]
["tesztalany 35",{"$f":"B$57*B38","v":15},16,25,20,20,20,20,20,12,20,16,15,5,16,15,6,0,261]
["tesztalany 36",{"$f":"B$57*B39","v":20},20,20,20,16,20,20,20,12,16,12,12,10,12,15,8,0,253]
["tesztalany 37",{"$f":"B$57*B40","v":25},20,20,25,20,20,20,25,15,20,20,15,25,20,15,10,5,320]
["tesztalany 38",{"$f":"B$57*B41","v":15},20,25,15,20,20,16,25,15,20,16,12,20,16,15,0,5,275]
["tesztalany 39",{"$f":"B$57*B42","v":15},20,20,15,12,20,20,25,12,20,20,12,0,12,15,10,2,250]
["tesztalany 40",{"$f":"B$57*B43","v":25},20,20,20,16,16,20,25,15,12,12,15,20,8,15,8,0,267]
["tesztalany 41",{"$f":"B$57*B44","v":10},16,10,15,16,20,16,20,9,16,20,15,15,8,15,8,0,229]
["tesztalany 42",{"$f":"B$57*B45","v":25},20,10,20,16,16,12,25,9,20,12,15,25,20,12,8,0,265]
["tesztalany 43",{"$f":"B$57*B46","v":25},20,25,25,20,20,20,25,15,20,16,15,20,20,15,10,3,314]
["tesztalany 44",{"$f":"B$57*B47","v":20},20,25,20,16,20,20,20,12,20,16,12,20,16,15,8,4,284]
["tesztalany 45",{"$f":"B$57*B48","v":20},12,25,20,8,20,20,25,9,20,16,15,20,20,0,0,0,250]
["tesztalany 46",{"$f":"B$57*B49","v":25},20,20,15,12,20,16,25,12,16,12,12,15,20,9,6,3,258]
["tesztalany 47",{"$f":"B$57*B50","v":20},16,20,20,12,16,16,20,9,16,16,9,15,12,12,8,3,240]
["tesztalany 48",{"$f":"B$57*B51","v":20},16,15,15,12,16,20,20,15,12,16,12,25,16,12,8,2,252]
["tesztalany 49",{"$f":"B$57*B52","v":15},20,20,15,12,20,20,20,9,20,16,15,10,12,15,8,1,248]
["tesztalany 50",{"$f":"B$57*B53","v":15},20,25,15,20,16,20,25,12,16,16,9,15,8,15,8,1,256]
[]
[null,null,null,null,null,null,null,null,null,null,null,null,null,null,null,null,null,null,null,{"$f":"MAX(S61:S110)","v":320}]

{"sheet":"Adatbázis","index":2,"n_rows":851,"n_cols":8,"rows_kept":851,"cut":false,"hidden":false,"merged":[]}
["Sorszám","Objektum","Attribútum","Érték","Mértékegység","Forrás","Dátum","Rögzítette"]
[1,"tesztalany 1","alkalmazkodás",{"$f":"'Kiinduló adatok'!B4","v":4},"pont","kérdőív","2011-11-23","S.Á."]
[2,"tesztalany 2","alkalmazkodás",{"$f":"'Kiinduló adatok'!B5","v":5},"pont","kérdőív","2011-11-23","S.Á."]
[3,"tesztalany 3","alkalmazkodás",{"$f":"'Kiinduló adatok'!B6","v":4},"pont","kérdőív","2011-11-23","S.Á."]
[4,"tesztalany 4","alkalmazkodás",{"$f":"'Kiinduló adatok'!B7","v":4},"pont","kérdőív","2011-11-23","S.Á."]
[5,"tesztalany 5","alkalmazkodás",{"$f":"'Kiinduló adatok'!B8","v":2},"pont","kérdőív","2011-11-23","S.Á."]
[6,"tesztalany 6","alkalmazkodás",{"$f":"'Kiinduló adatok'!B9","v":4},"pont","kérdőív","2011-11-23","S.Á."]
[7,"tesztalany 7","alkalmazkodás",{"$f":"'Kiinduló adatok'!B10","v":3},"pont","kérdőív","2011-11-23","S.Á."]
[8,"tesztalany 8","alkalmazkodás",{"$f":"'Kiinduló adatok'!B11","v":4},"pont","kérdőív","2011-11-23","S.Á."]
[9,"tesztalany 9","alkalmazkodás",{"$f":"'Kiinduló adatok'!B12","v":5},"pont","kérdőív","2011-11-23","S.Á."]
[10,"tesztalany 10","alkalmazkodás",{"$f":"'Kiinduló adatok'!B13","v":5},"pont","kérdőív","2011-11-23","S.Á."]
[11,"tesztalany 11","alkalmazkodás",{"$f":"'Kiinduló adatok'!B14","v":4},"pont","kérdőív","2011-11-23","S.Á."]
[12,"tesztalany 12","alkalmazkodás",{"$f":"'Kiinduló adatok'!B15","v":5},"pont","kérdőív","2011-11-23","S.Á."]
[13,"tesztalany 13","alkalmazkodás",{"$f":"'Kiinduló adatok'!B16","v":4},"pont","kérdőív","2011-11-23","S.Á."]
[14,"tesztalany 14","alkalmazkodás",{"$f":"'Kiinduló adatok'!B17","v":4},"pont","kérdőív","2011-11-23","S.Á."]
[15,"tesztalany 15","alkalmazkodás",{"$f":"'Kiinduló adatok'!B18","v":4},"pont","kérdőív","2011-11-23","S.Á."]
[16,"tesztalany 16","alkalmazkodás",{"$f":"'Kiinduló adatok'!B19","v":4},"pont","kérdőív","2011-11-23","S.Á."]
[17,"tesztalany 17","alkalmazkodás",{"$f":"'Kiinduló adatok'!B20","v":3},"pont","kérdőív","2011-11-23","S.Á."]
[18,"tesztalany 18","alkalmazkodás",{"$f":"'Kiinduló adatok'!B21","v":4},"pont","kérdőív","2011-11-23","S.Á."]
[19,"tesztalany 19","alkalmazkodás",{"$f":"'Kiinduló adatok'!B22","v":3},"pont","kérdőív","2011-11-23","S.Á."]
[20,"tesztalany 20","alkalmazkodás",{"$f":"'Kiinduló adatok'!B23","v":5},"pont","kérdőív","2011-11-23","S.Á."]
[21,"tesztalany 21","alkalmazkodás",{"$f":"'Kiinduló adatok'!B24","v":4},"pont","kérdőív","2011-11-23","S.Á."]
[22,"tesztalany 22","alkalmazkodás",{"$f":"'Kiinduló adatok'!B25","v":5},"pont","kérdőív","2011-11-23","S.Á."]
[23,"tesztalany 23","alkalmazkodás",{"$f":"'Kiinduló adatok'!B26","v":3},"pont","kérdőív","2011-11-23","S.Á."]
[24,"tesztalany 24","alkalmazkodás",{"$f":"'Kiinduló adatok'!B27","v":3},"pont","kérdőív","2011-11-23","S.Á."]
[25,"tesztalany 25","alkalmazkodás",{"$f":"'Kiinduló adatok'!B28","v":3},"pont","kérdőív","2011-11-23","S.Á."]
[26,"tesztalany 26","alkalmazkodás",{"$f":"'Kiinduló adatok'!B29","v":3},"pont","kérdőív","2011-11-23","S.Á."]
[27,"tesztalany 27","alkalmazkodás",{"$f":"'Kiinduló adatok'!B30","v":3},"pont","kérdőív","2011-11-23","S.Á."]
[28,"tesztalany 28","alkalmazkodás",{"$f":"'Kiinduló adatok'!B31","v":4},"pont","kérdőív","2011-11-23","S.Á."]
[29,"tesztalany 29","alkalmazkodás",{"$f":"'Kiinduló adatok'!B32","v":3},"pont","kérdőív","2011-11-23","S.Á."]
[30,"tesztalany 30","alkalmazkodás",{"$f":"'Kiinduló adatok'!B33","v":5},"pont","kérdőív","2011-11-23","S.Á."]
[31,"tesztalany 31","alkalmazkodás",{"$f":"'Kiinduló adatok'!B34","v":4},"pont","kérdőív","2011-11-23","S.Á."]
[32,"tesztalany 32","alkalmazkodás",{"$f":"'Kiinduló adatok'!B35","v":4},"pont","kérdőív","2011-11-23","S.Á."]
[33,"tesztalany 33","alkalmazkodás",{"$f":"'Kiinduló adatok'!B36","v":4},"pont","kérdőív","2011-11-23","S.Á."]
[34,"tesztalany 34","alkalmazkodás",{"$f":"'Kiinduló adatok'!B37","v":4},"pont","kérdőív","2011-11-23","S.Á."]
[35,"tesztalany 35","alkalmazkodás",{"$f":"'Kiinduló adatok'!B38","v":3},"pont","kérdőív","2011-11-23","S.Á."]
[36,"tesztalany 36","alkalmazkodás",{"$f":"'Kiinduló adatok'!B39","v":4},"pont","kérdőív","2011-11-23","S.Á."]
[37,"tesztalany 37","alkalmazkodás",{"$f":"'Kiinduló adatok'!B40","v":5},"pont","kérdőív","2011-11-23","S.Á."]
[38,"tesztalany 38","alkalmazkodás",{"$f":"'Kiinduló adatok'!B41","v":3},"pont","kérdőív","2011-11-23","S.Á."]
[39,"tesztalany 39","alkalmazkodás",{"$f":"'Kiinduló adatok'!B42","v":3},"pont","kérdőív","2011-11-23","S.Á."]
[40,"tesztalany 40","alkalmazkodás",{"$f":"'Kiinduló adatok'!B43","v":5},"pont","kérdőív","2011-11-23","S.Á."]
[41,"tesztalany 41","alkalmazkodás",{"$f":"'Kiinduló adatok'!B44","v":2},"pont","kérdőív","2011-11-23","S.Á."]
[42,"tesztalany 42","alkalmazkodás",{"$f":"'Kiinduló adatok'!B45","v":5},"pont","kérdőív","2011-11-23","S.Á."]
[43,"tesztalany 43","alkalmazkodás",{"$f":"'Kiinduló adatok'!B46","v":5},"pont","kérdőív","2011-11-23","S.Á."]
[44,"tesztalany 44","alkalmazkodás",{"$f":"'Kiinduló adatok'!B47","v":4},"pont","kérdőív","2011-11-23","S.Á."]
[45,"tesztalany 45","alkalmazkodás",{"$f":"'Kiinduló adatok'!B48","v":4},"pont","kérdőív","2011-11-23","S.Á."]
[46,"tesztalany 46","alkalmazkodás",{"$f":"'Kiinduló adatok'!B49","v":5},"pont","kérdőív","2011-11-23","S.Á."]
[47,"tesztalany 47","alkalmazkodás",{"$f":"'Kiinduló adatok'!B50","v":4},"pont","kérdőív","2011-11-23","S.Á."]
[48,"tesztalany 48","alkalmazkodás",{"$f":"'Kiinduló adatok'!B51","v":4},"pont","kérdőív","2011-11-23","S.Á."]
[49,"tesztalany 49","alkalmazkodás",{"$f":"'Kiinduló adatok'!B52","v":3},"pont","kérdőív","2011-11-23","S.Á."]
[50,"tesztalany 50","alkalmazkodás",{"$f":"'Kiinduló adatok'!B53","v":3},"pont","kérdőív","2011-11-23","S.Á."]
[51,"tesztalany 1","nyitottság",{"$f":"'Kiinduló adatok'!C4","v":5},"pont","kérdőív","2011-11-23","S.Á."]
[52,"tesztalany 2","nyitottság",{"$f":"'Kiinduló adatok'!C5","v":5},"pont","kérdőív","2011-11-23","S.Á."]
[53,"tesztalany 3","nyitottság",{"$f":"'Kiinduló adatok'!C6","v":4},"pont","kérdőív","2011-11-23","S.Á."]
[54,"tesztalany 4","nyitottság",{"$f":"'Kiinduló adatok'!C7","v":5},"pont","kérdőív","2011-11-23","S.Á."]
[55,"tesztalany 5","nyitottság",{"$f":"'Kiinduló adatok'!C8","v":1},"pont","kérdőív","2011-11-23","S.Á."]
[56,"tesztalany 6","nyitottság",{"$f":"'Kiinduló adatok'!C9","v":5},"pont","kérdőív","2011-11-23","S.Á."]
[57,"tesztalany 7","nyitottság",{"$f":"'Kiinduló adatok'!C10","v":4},"pont","kérdőív","2011-11-23","S.Á."]
[58,"tesztalany 8","nyitottság",{"$f":"'Kiinduló adatok'!C11","v":4},"pont","kérdőív","2011-11-23","S.Á."]
[59,"tesztalany 9","nyitottság",{"$f":"'Kiinduló adatok'!C12","v":5},"pont","kérdőív","2011-11-23","S.Á."]
[60,"tesztalany 10","nyitottság",{"$f":"'Kiinduló adatok'!C13","v":5},"pont","kérdőív","2011-11-23","S.Á."]
[61,"tesztalany 11","nyitottság",{"$f":"'Kiinduló adatok'!C14","v":2},"pont","kérdőív","2011-11-23","S.Á."]
[62,"tesztalany 12","nyitottság",{"$f":"'Kiinduló adatok'!C15","v":5},"pont","kérdőív","2011-11-23","S.Á."]
[63,"tesztalany 13","nyitottság",{"$f":"'Kiinduló adatok'!C16","v":5},"pont","kérdőív","2011-11-23","S.Á."]
[64,"tesztalany 14","nyitottság",{"$f":"'Kiinduló adatok'!C17","v":4},"pont","kérdőív","2011-11-23","S.Á."]
[65,"tesztalany 15","nyitottság",{"$f":"'Kiinduló adatok'!C18","v":4},"pont","kérdőív","2011-11-23","S.Á."]
[66,"tesztalany 16","nyitottság",{"$f":"'Kiinduló adatok'!C19","v":5},"pont","kérdőív","2011-11-23","S.Á."]
[67,"tesztalany 17","nyitottság",{"$f":"'Kiinduló adatok'!C20","v":5},"pont","kérdőív","2011-11-23","S.Á."]
[68,"tesztalany 18","nyitottság",{"$f":"'Kiinduló adatok'!C21","v":4},"pont","kérdőív","2011-11-23","S.Á."]
[69,"tesztalany 19","nyitottság",{"$f":"'Kiinduló adatok'!C22","v":3},"pont","kérdőív","2011-11-23","S.Á."]
[70,"tesztalany 20","nyitottság",{"$f":"'Kiinduló adatok'!C23","v":5},"pont","kérdőív","2011-11-23","S.Á."]
[71,"tesztalany 21","nyitottság",{"$f":"'Kiinduló adatok'!C24","v":5},"pont","kérdőív","2011-11-23","S.Á."]
[72,"tesztalany 22","nyitottság",{"$f":"'Kiinduló adatok'!C25","v":5},"pont","kérdőív","2011-11-23","S.Á."]
[73,"tesztalany 23","nyitottság",{"$f":"'Kiinduló adatok'!C26","v":4},"pont","kérdőív","2011-11-23","S.Á."]
[74,"tesztalany 24","nyitottság",{"$f":"'Kiinduló adatok'!C27","v":4},"pont","kérdőív","2011-11-23","S.Á."]
[75,"tesztalany 25","nyitottság",{"$f":"'Kiinduló adatok'!C28","v":4},"pont","kérdőív","2011-11-23","S.Á."]
[76,"tesztalany 26","nyitottság",{"$f":"'Kiinduló adatok'!C29","v":5},"pont","kérdőív","2011-11-23","S.Á."]
[77,"tesztalany 27","nyitottság",{"$f":"'Kiinduló adatok'!C30","v":3},"pont","kérdőív","2011-11-23","S.Á."]
[78,"tesztalany 28","nyitottság",{"$f":"'Kiinduló adatok'!C31","v":5},"pont","kérdőív","2011-11-23","S.Á."]
[79,"tesztalany 29","nyitottság",{"$f":"'Kiinduló adatok'!C32","v":3},"pont","kérdőív","2011-11-23","S.Á."]
[80,"tesztalany 30","nyitottság",{"$f":"'Kiinduló adatok'!C33","v":5},"pont","kérdőív","2011-11-23","S.Á."]
[81,"tesztalany 31","nyitottság",{"$f":"'Kiinduló adatok'!C34","v":4},"pont","kérdőív","2011-11-23","S.Á."]
[82,"tesztalany 32","nyitottság",{"$f":"'Kiinduló adatok'!C35","v":4},"pont","kérdőív","2011-11-23","S.Á."]
[83,"tesztalany 33","nyitottság",{"$f":"'Kiinduló adatok'!C36","v":3},"pont","kérdőív","2011-11-23","S.Á."]
[84,"tesztalany 34","nyitottság",{"$f":"'Kiinduló adatok'!C37","v":4},"pont","kérdőív","2011-11-23","S.Á."]
[85,"tesztalany 35","nyitottság",{"$f":"'Kiinduló adatok'!C38","v":4},"pont","kérdőív","2011-11-23","S.Á."]
[86,"tesztalany 36","nyitottság",{"$f":"'Kiinduló adatok'!C39","v":5},"pont","kérdőív","2011-11-23","S.Á."]
[87,"tesztalany 37","nyitottság",{"$f":"'Kiinduló adatok'!C40","v":5},"pont","kérdőív","2011-11-23","S.Á."]
[88,"tesztalany 38","nyitottság",{"$f":"'Kiinduló adatok'!C41","v":5},"pont","kérdőív","2011-11-23","S.Á."]
[89,"tesztalany 39","nyitottság",{"$f":"'Kiinduló adatok'!C42","v":5},"pont","kérdőív","2011-11-23","S.Á."]
[90,"tesztalany 40","nyitottság",{"$f":"'Kiinduló adatok'!C43","v":5},"pont","kérdőív","2011-11-23","S.Á."]
[91,"tesztalany 41","nyitottság",{"$f":"'Kiinduló adatok'!C44","v":4},"pont","kérdőív","2011-11-23","S.Á."]
[92,"tesztalany 42","nyitottság",{"$f":"'Kiinduló adatok'!C45","v":5},"pont","kérdőív","2011-11-23","S.Á."]
[93,"tesztalany 43","nyitottság",{"$f":"'Kiinduló adatok'!C46","v":5},"pont","kérdőív","2011-11-23","S.Á."]
[94,"tesztalany 44","nyitottság",{"$f":"'Kiinduló adatok'!C47","v":5},"pont","kérdőív","2011-11-23","S.Á."]
[95,"tesztalany 45","nyitottság",{"$f":"'Kiinduló adatok'!C48","v":3},"pont","kérdőív","2011-11-23","S.Á."]
[96,"tesztalany 46","nyitottság",{"$f":"'Kiinduló adatok'!C49","v":5},"pont","kérdőív","2011-11-23","S.Á."]
[97,"tesztalany 47","nyitottság",{"$f":"'Kiinduló adatok'!C50","v":4},"pont","kérdőív","2011-11-23","S.Á."]
[98,"tesztalany 48","nyitottság",{"$f":"'Kiinduló adatok'!C51","v":4},"pont","kérdőív","2011-11-23","S.Á."]
[99,"tesztalany 49","nyitottság",{"$f":"'Kiinduló adatok'!C52","v":5},"pont","kérdőív","2011-11-23","S.Á."]
[100,"tesztalany 50","nyitottság",{"$f":"'Kiinduló adatok'!C53","v":5},"pont","kérdőív","2011-11-23","S.Á."]
[101,"tesztalany 1","döntésképesség",{"$f":"'Kiinduló adatok'!D4","v":4},"pont","kérdőív","2011-11-23","S.Á."]
[102,"tesztalany 2","döntésképesség",{"$f":"'Kiinduló adatok'!D5","v":5},"pont","kérdőív","2011-11-23","S.Á."]
[103,"tesztalany 3","döntésképesség",{"$f":"'Kiinduló adatok'!D6","v":4},"pont","kérdőív","2011-11-23","S.Á."]
[104,"tesztalany 4","döntésképesség",{"$f":"'Kiinduló adatok'!D7","v":3},"pont","kérdőív","2011-11-23","S.Á."]
[105,"tesztalany 5","döntésképesség",{"$f":"'Kiinduló adatok'!D8","v":5},"pont","kérdőív","2011-11-23","S.Á."]
[106,"tesztalany 6","döntésképesség",{"$f":"'Kiinduló adatok'!D9","v":5},"pont","kérdőív","2011-11-23","S.Á."]
[107,"tesztalany 7","döntésképesség",{"$f":"'Kiinduló adatok'!D10","v":4},"pont","kérdőív","2011-11-23","S.Á."]
[108,"tesztalany 8","döntésképesség",{"$f":"'Kiinduló adatok'!D11","v":2},"pont","kérdőív","2011-11-23","S.Á."]
[109,"tesztalany 9","döntésképesség",{"$f":"'Kiinduló adatok'!D12","v":5},"pont","kérdőív","2011-11-23","S.Á."]
[110,"tesztalany 10","döntésképesség",{"$f":"'Kiinduló adatok'!D13","v":5},"pont","kérdőív","2011-11-23","S.Á."]
[111,"tesztalany 11","döntésképesség",{"$f":"'Kiinduló adatok'!D14","v":1},"pont","kérdőív","2011-11-23","S.Á."]
[112,"tesztalany 12","döntésképesség",{"$f":"'Kiinduló adatok'!D15","v":5},"pont","kérdőív","2011-11-23","S.Á."]
[113,"tesztalany 13","döntésképesség",{"$f":"'Kiinduló adatok'!D16","v":4},"pont","kérdőív","2011-11-23","S.Á."]
[114,"tesztalany 14","döntésképesség",{"$f":"'Kiinduló adatok'!D17","v":5},"pont","kérdőív","2011-11-23","S.Á."]
[115,"tesztalany 15","döntésképesség",{"$f":"'Kiinduló adatok'!D18","v":4},"pont","kérdőív","2011-11-23","S.Á."]
[116,"tesztalany 16","döntésképesség",{"$f":"'Kiinduló adatok'!D19","v":5},"pont","kérdőív","2011-11-23","S.Á."]
[117,"tesztalany 17","döntésképesség",{"$f":"'Kiinduló adatok'!D20","v":4},"pont","kérdőív","2011-11-23","S.Á."]
[118,"tesztalany 18","döntésképesség",{"$f":"'Kiinduló adatok'!D21","v":3},"pont","kérdőív","2011-11-23","S.Á."]
[119,"tesztalany 19","döntésképesség",{"$f":"'Kiinduló adatok'!D22","v":4},"pont","kérdőív","2011-11-23","S.Á."]
[120,"tesztalany 20","döntésképesség",{"$f":"'Kiinduló adatok'!D23","v":4},"pont","kérdőív","2011-11-23","S.Á."]
[121,"tesztalany 21","döntésképesség",{"$f":"'Kiinduló adatok'!D24","v":1},"pont","kérdőív","2011-11-23","S.Á."]
[122,"tesztalany 22","döntésképesség",{"$f":"'Kiinduló adatok'!D25","v":4},"pont","kérdőív","2011-11-23","S.Á."]
[123,"tesztalany 23","döntésképesség",{"$f":"'Kiinduló adatok'!D26","v":4},"pont","kérdőív","2011-11-23","S.Á."]
[124,"tesztalany 24","döntésképesség",{"$f":"'Kiinduló adatok'!D27","v":4},"pont","kérdőív","2011-11-23","S.Á."]
[125,"tesztalany 25","döntésképesség",{"$f":"'Kiinduló adatok'!D28","v":4},"pont","kérdőív","2011-11-23","S.Á."]
[126,"tesztalany 26","döntésképesség",{"$f":"'Kiinduló adatok'!D29","v":5},"pont","kérdőív","2011-11-23","S.Á."]
[127,"tesztalany 27","döntésképesség",{"$f":"'Kiinduló adatok'!D30","v":3},"pont","kérdőív","2011-11-23","S.Á."]
[128,"tesztalany 28","döntésképesség",{"$f":"'Kiinduló adatok'!D31","v":3},"pont","kérdőív","2011-11-23","S.Á."]
[129,"tesztalany 29","döntésképesség",{"$f":"'Kiinduló adatok'!D32","v":3},"pont","kérdőív","2011-11-23","S.Á."]
[130,"tesztalany 30","döntésképesség",{"$f":"'Kiinduló adatok'!D33","v":4},"pont","kérdőív","2011-11-23","S.Á."]
[131,"tesztalany 31","döntésképesség",{"$f":"'Kiinduló adatok'!D34","v":5},"pont","kérdőív","2011-11-23","S.Á."]
[132,"tesztalany 32","döntésképesség",{"$f":"'Kiinduló adatok'!D35","v":5},"pont","kérdőív","2011-11-23","S.Á."]
[133,"tesztalany 33","döntésképesség",{"$f":"'Kiinduló adatok'!D36","v":4},"pont","kérdőív","2011-11-23","S.Á."]
[134,"tesztalany 34","döntésképesség",{"$f":"'Kiinduló adatok'!D37","v":5},"pont","kérdőív","2011-11-23","S.Á."]
[135,"tesztalany 35","döntésképesség",{"$f":"'Kiinduló adatok'!D38","v":5},"pont","kérdőív","2011-11-23","S.Á."]
[136,"tesztalany 36","döntésképesség",{"$f":"'Kiinduló adatok'!D39","v":4},"pont","kérdőív","2011-11-23","S.Á."]
[137,"tesztalany 37","döntésképesség",{"$f":"'Kiinduló adatok'!D40","v":4},"pont","kérdőív","2011-11-23","S.Á."]
[138,"tesztalany 38","döntésképesség",{"$f":"'Kiinduló adatok'!D41","v":5},"pont","kérdőív","2011-11-23","S.Á."]
[139,"tesztalany 39","döntésképesség",{"$f":"'Kiinduló adatok'!D42","v":4},"pont","kérdőív","2011-11-23","S.Á."]
[140,"tesztalany 40","döntésképesség",{"$f":"'Kiinduló adatok'!D43","v":4},"pont","kérdőív","2011-11-23","S.Á."]
[141,"tesztalany 41","döntésképesség",{"$f":"'Kiinduló adatok'!D44","v":2},"pont","kérdőív","2011-11-23","S.Á."]
[142,"tesztalany 42","döntésképesség",{"$f":"'Kiinduló adatok'!D45","v":2},"pont","kérdőív","2011-11-23","S.Á."]
[143,"tesztalany 43","döntésképesség",{"$f":"'Kiinduló adatok'!D46","v":5},"pont","kérdőív","2011-11-23","S.Á."]
[144,"tesztalany 44","döntésképesség",{"$f":"'Kiinduló adatok'!D47","v":5},"pont","kérdőív","2011-11-23","S.Á."]
[145,"tesztalany 45","döntésképesség",{"$f":"'Kiinduló adatok'!D48","v":5},"pont","kérdőív","2011-11-23","S.Á."]
[146,"tesztalany 46","döntésképesség",{"$f":"'Kiinduló adatok'!D49","v":4},"pont","kérdőív","2011-11-23","S.Á."]
[147,"tesztalany 47","döntésképesség",{"$f":"'Kiinduló adatok'!D50","v":4},"pont","kérdőív","2011-11-23","S.Á."]
[148,"tesztalany 48","döntésképesség",{"$f":"'Kiinduló adatok'!D51","v":3},"pont","kérdőív","2011-11-23","S.Á."]
[149,"tesztalany 49","döntésképesség",{"$f":"'Kiinduló adatok'!D52","v":4},"pont","kérdőív","2011-11-23","S.Á."]
[150,"tesztalany 50","döntésképesség",{"$f":"'Kiinduló adatok'!D53","v":5},"pont","kérdőív","2011-11-23","S.Á."]
[151,"tesztalany 1","rátermettség",{"$f":"'Kiinduló adatok'!E4","v":5},"pont","kérdőív","2011-11-23","S.Á."]
[152,"tesztalany 2","rátermettség",{"$f":"'Kiinduló adatok'!E5","v":5},"pont","kérdőív","2011-11-23","S.Á."]
[153,"tesztalany 3","rátermettség",{"$f":"'Kiinduló adatok'!E6","v":3},"pont","kérdőív","2011-11-23","S.Á."]
[154,"tesztalany 4","rátermettség",{"$f":"'Kiinduló adatok'!E7","v":4},"pont","kérdőív","2011-11-23","S.Á."]
[155,"tesztalany 5","rátermettség",{"$f":"'Kiinduló adatok'!E8","v":4},"pont","kérdőív","2011-11-23","S.Á."]
[156,"tesztalany 6","rátermettség",{"$f":"'Kiinduló adatok'!E9","v":4},"pont","kérdőív","2011-11-23","S.Á."]
[157,"tesztalany 7","rátermettség",{"$f":"'Kiinduló adatok'!E10","v":4},"pont","kérdőív","2011-11-23","S.Á."]
[158,"tesztalany 8","rátermettség",{"$f":"'Kiinduló adatok'!E11","v":3},"pont","kérdőív","2011-11-23","S.Á."]
[159,"tesztalany 9","rátermettség",{"$f":"'Kiinduló adatok'!E12","v":5},"pont","kérdőív","2011-11-23","S.Á."]
[160,"tesztalany 10","rátermettség",{"$f":"'Kiinduló adatok'!E13","v":4},"pont","kérdőív","2011-11-23","S.Á."]
[161,"tesztalany 11","rátermettség",{"$f":"'Kiinduló adatok'!E14","v":3},"pont","kérdőív","2011-11-23","S.Á."]
[162,"tesztalany 12","rátermettség",{"$f":"'Kiinduló adatok'!E15","v":3},"pont","kérdőív","2011-11-23","S.Á."]
[163,"tesztalany 13","rátermettség",{"$f":"'Kiinduló adatok'!E16","v":3},"pont","kérdőív","2011-11-23","S.Á."]
[164,"tesztalany 14","rátermettség",{"$f":"'Kiinduló adatok'!E17","v":3},"pont","kérdőív","2011-11-23","S.Á."]
[165,"tesztalany 15","rátermettség",{"$f":"'Kiinduló adatok'!E18","v":3},"pont","kérdőív","2011-11-23","S.Á."]
[166,"tesztalany 16","rátermettség",{"$f":"'Kiinduló adatok'!E19","v":3},"pont","kérdőív","2011-11-23","S.Á."]
[167,"tesztalany 17","rátermettség",{"$f":"'Kiinduló adatok'!E20","v":3},"pont","kérdőív","2011-11-23","S.Á."]
[168,"tesztalany 18","rátermettség",{"$f":"'Kiinduló adatok'!E21","v":2},"pont","kérdőív","2011-11-23","S.Á."]
[169,"tesztalany 19","rátermettség",{"$f":"'Kiinduló adatok'!E22","v":2},"pont","kérdőív","2011-11-23","S.Á."]
[170,"tesztalany 20","rátermettség",{"$f":"'Kiinduló adatok'!E23","v":3},"pont","kérdőív","2011-11-23","S.Á."]
[171,"tesztalany 21","rátermettség",{"$f":"'Kiinduló adatok'!E24","v":3},"pont","kérdőív","2011-11-23","S.Á."]
[172,"tesztalany 22","rátermettség",{"$f":"'Kiinduló adatok'!E25","v":3},"pont","kérdőív","2011-11-23","S.Á."]
[173,"tesztalany 23","rátermettség",{"$f":"'Kiinduló adatok'!E26","v":3},"pont","kérdőív","2011-11-23","S.Á."]
[174,"tesztalany 24","rátermettség",{"$f":"'Kiinduló adatok'!E27","v":2},"pont","kérdőív","2011-11-23","S.Á."]
[175,"tesztalany 25","rátermettség",{"$f":"'Kiinduló adatok'!E28","v":4},"pont","kérdőív","2011-11-23","S.Á."]
[176,"tesztalany 26","rátermettség",{"$f":"'Kiinduló adatok'!E29","v":4},"pont","kérdőív","2011-11-23","S.Á."]
[177,"tesztalany 27","rátermettség",{"$f":"'Kiinduló adatok'!E30","v":3},"pont","kérdőív","2011-11-23","S.Á."]
[178,"tesztalany 28","rátermettség",{"$f":"'Kiinduló adatok'!E31","v":3},"pont","kérdőív","2011-11-23","S.Á."]
[179,"tesztalany 29","rátermettség",{"$f":"'Kiinduló adatok'!E32","v":2},"pont","kérdőív","2011-11-23","S.Á."]
[180,"tesztalany 30","rátermettség",{"$f":"'Kiinduló adatok'!E33","v":5},"pont","kérdőív","2011-11-23","S.Á."]
[181,"tesztalany 31","rátermettség",{"$f":"'Kiinduló adatok'!E34","v":3},"pont","kérdőív","2011-11-23","S.Á."]
[182,"tesztalany 32","rátermettség",{"$f":"'Kiinduló adatok'!E35","v":4},"pont","kérdőív","2011-11-23","S.Á."]
[183,"tesztalany 33","rátermettség",{"$f":"'Kiinduló adatok'!E36","v":4},"pont","kérdőív","2011-11-23","S.Á."]
[184,"tesztalany 34","rátermettség",{"$f":"'Kiinduló adatok'!E37","v":4},"pont","kérdőív","2011-11-23","S.Á."]
[185,"tesztalany 35","rátermettség",{"$f":"'Kiinduló adatok'!E38","v":4},"pont","kérdőív","2011-11-23","S.Á."]
[186,"tesztalany 36","rátermettség",{"$f":"'Kiinduló adatok'!E39","v":4},"pont","kérdőív","2011-11-23","S.Á."]
[187,"tesztalany 37","rátermettség",{"$f":"'Kiinduló adatok'!E40","v":5},"pont","kérdőív","2011-11-23","S.Á."]
[188,"tesztalany 38","rátermettség",{"$f":"'Kiinduló adatok'!E41","v":3},"pont","kérdőív","2011-11-23","S.Á."]
[189,"tesztalany 39","rátermettség",{"$f":"'Kiinduló adatok'!E42","v":3},"pont","kérdőív","2011-11-23","S.Á."]
[190,"tesztalany 40","rátermettség",{"$f":"'Kiinduló adatok'!E43","v":4},"pont","kérdőív","2011-11-23","S.Á."]
[191,"tesztalany 41","rátermettség",{"$f":"'Kiinduló adatok'!E44","v":3},"pont","kérdőív","2011-11-23","S.Á."]
[192,"tesztalany 42","rátermettség",{"$f":"'Kiinduló adatok'!E45","v":4},"pont","kérdőív","2011-11-23","S.Á."]
[193,"tesztalany 43","rátermettség",{"$f":"'Kiinduló adatok'!E46","v":5},"pont","kérdőív","2011-11-23","S.Á."]
[194,"tesztalany 44","rátermettség",{"$f":"'Kiinduló adatok'!E47","v":4},"pont","kérdőív","2011-11-23","S.Á."]
[195,"tesztalany 45","rátermettség",{"$f":"'Kiinduló adatok'!E48","v":4},"pont","kérdőív","2011-11-23","S.Á."]
[196,"tesztalany 46","rátermettség",{"$f":"'Kiinduló adatok'!E49","v":3},"pont","kérdőív","2011-11-23","S.Á."]
[197,"tesztalany 47","rátermettség",{"$f":"'Kiinduló adatok'!E50","v":4},"pont","kérdőív","2011-11-23","S.Á."]
[198,"tesztalany 48","rátermettség",{"$f":"'Kiinduló adatok'!E51","v":3},"pont","kérdőív","2011-11-23","S.Á."]
[199,"tesztalany 49","rátermettség",{"$f":"'Kiinduló adatok'!E52","v":3},"pont","kérdőív","2011-11-23","S.Á."]
[200,"tesztalany 50","rátermettség",{"$f":"'Kiinduló adatok'!E53","v":3},"pont","kérdőív","2011-11-23","S.Á."]
[201,"tesztalany 1","kezdeményezőkészség",{"$f":"'Kiinduló adatok'!F4","v":4},"pont","kérdőív","2011-11-23","S.Á."]
[202,"tesztalany 2","kezdeményezőkészség",{"$f":"'Kiinduló adatok'!F5","v":3},"pont","kérdőív","2011-11-23","S.Á."]
[203,"tesztalany 3","kezdeményezőkészség",{"$f":"'Kiinduló adatok'!F6","v":3},"pont","kérdőív","2011-11-23","S.Á."]
[204,"tesztalany 4","kezdeményezőkészség",{"$f":"'Kiinduló adatok'!F7","v":4},"pont","kérdőív","2011-11-23","S.Á."]
[205,"tesztalany 5","kezdeményezőkészség",{"$f":"'Kiinduló adatok'!F8","v":4},"pont","kérdőív","2011-11-23","S.Á."]
[206,"tesztalany 6","kezdeményezőkészség",{"$f":"'Kiinduló adatok'!F9","v":4},"pont","kérdőív","2011-11-23","S.Á."]
[207,"tesztalany 7","kezdeményezőkészség",{"$f":"'Kiinduló adatok'!F10","v":3},"pont","kérdőív","2011-11-23","S.Á."]
[208,"tesztalany 8","kezdeményezőkészség",{"$f":"'Kiinduló adatok'!F11","v":4},"pont","kérdőív","2011-11-23","S.Á."]
[209,"tesztalany 9","kezdeményezőkészség",{"$f":"'Kiinduló adatok'!F12","v":5},"pont","kérdőív","2011-11-23","S.Á."]
[210,"tesztalany 10","kezdeményezőkészség",{"$f":"'Kiinduló adatok'!F13","v":5},"pont","kérdőív","2011-11-23","S.Á."]
[211,"tesztalany 11","kezdeményezőkészség",{"$f":"'Kiinduló adatok'!F14","v":3},"pont","kérdőív","2011-11-23","S.Á."]
[212,"tesztalany 12","kezdeményezőkészség",{"$f":"'Kiinduló adatok'!F15","v":3},"pont","kérdőív","2011-11-23","S.Á."]
[213,"tesztalany 13","kezdeményezőkészség",{"$f":"'Kiinduló adatok'!F16","v":3},"pont","kérdőív","2011-11-23","S.Á."]
[214,"tesztalany 14","kezdeményezőkészség",{"$f":"'Kiinduló adatok'!F17","v":5},"pont","kérdőív","2011-11-23","S.Á."]
[215,"tesztalany 15","kezdeményezőkészség",{"$f":"'Kiinduló adatok'!F18","v":3},"pont","kérdőív","2011-11-23","S.Á."]
[216,"tesztalany 16","kezdeményezőkészség",{"$f":"'Kiinduló adatok'!F19","v":5},"pont","kérdőív","2011-11-23","S.Á."]
[217,"tesztalany 17","kezdeményezőkészség",{"$f":"'Kiinduló adatok'!F20","v":3},"pont","kérdőív","2011-11-23","S.Á."]
[218,"tesztalany 18","kezdeményezőkészség",{"$f":"'Kiinduló adatok'!F21","v":3},"pont","kérdőív","2011-11-23","S.Á."]
[219,"tesztalany 19","kezdeményezőkészség",{"$f":"'Kiinduló adatok'!F22","v":2},"pont","kérdőív","2011-11-23","S.Á."]
[220,"tesztalany 20","kezdeményezőkészség",{"$f":"'Kiinduló adatok'!F23","v":5},"pont","kérdőív","2011-11-23","S.Á."]
[221,"tesztalany 21","kezdeményezőkészség",{"$f":"'Kiinduló adatok'!F24","v":5},"pont","kérdőív","2011-11-23","S.Á."]
[222,"tesztalany 22","kezdeményezőkészség",{"$f":"'Kiinduló adatok'!F25","v":3},"pont","kérdőív","2011-11-23","S.Á."]
[223,"tesztalany 23","kezdeményezőkészség",{"$f":"'Kiinduló adatok'!F26","v":4},"pont","kérdőív","2011-11-23","S.Á."]
[224,"tesztalany 24","kezdeményezőkészség",{"$f":"'Kiinduló adatok'!F27","v":4},"pont","kérdőív","2011-11-23","S.Á."]
[225,"tesztalany 25","kezdeményezőkészség",{"$f":"'Kiinduló adatok'!F28","v":4},"pont","kérdőív","2011-11-23","S.Á."]
[226,"tesztalany 26","kezdeményezőkészség",{"$f":"'Kiinduló adatok'!F29","v":5},"pont","kérdőív","2011-11-23","S.Á."]
[227,"tesztalany 27","kezdeményezőkészség",{"$f":"'Kiinduló adatok'!F30","v":5},"pont","kérdőív","2011-11-23","S.Á."]
[228,"tesztalany 28","kezdeményezőkészség",{"$f":"'Kiinduló adatok'!F31","v":4},"pont","kérdőív","2011-11-23","S.Á."]
[229,"tesztalany 29","kezdeményezőkészség",{"$f":"'Kiinduló adatok'!F32","v":4},"pont","kérdőív","2011-11-23","S.Á."]
[230,"tesztalany 30","kezdeményezőkészség",{"$f":"'Kiinduló adatok'!F33","v":5},"pont","kérdőív","2011-11-23","S.Á."]
[231,"tesztalany 31","kezdeményezőkészség",{"$f":"'Kiinduló adatok'!F34","v":4},"pont","kérdőív","2011-11-23","S.Á."]
[232,"tesztalany 32","kezdeményezőkészség",{"$f":"'Kiinduló adatok'!F35","v":3},"pont","kérdőív","2011-11-23","S.Á."]
[233,"tesztalany 33","kezdeményezőkészség",{"$f":"'Kiinduló adatok'!F36","v":4},"pont","kérdőív","2011-11-23","S.Á."]
[234,"tesztalany 34","kezdeményezőkészség",{"$f":"'Kiinduló adatok'!F37","v":4},"pont","kérdőív","2011-11-23","S.Á."]
[235,"tesztalany 35","kezdeményezőkészség",{"$f":"'Kiinduló adatok'!F38","v":5},"pont","kérdőív","2011-11-23","S.Á."]
[236,"tesztalany 36","kezdeményezőkészség",{"$f":"'Kiinduló adatok'!F39","v":4},"pont","kérdőív","2011-11-23","S.Á."]
[237,"tesztalany 37","kezdeményezőkészség",{"$f":"'Kiinduló adatok'!F40","v":5},"pont","kérdőív","2011-11-23","S.Á."]
[238,"tesztalany 38","kezdeményezőkészség",{"$f":"'Kiinduló adatok'!F41","v":5},"pont","kérdőív","2011-11-23","S.Á."]
[239,"tesztalany 39","kezdeményezőkészség",{"$f":"'Kiinduló adatok'!F42","v":3},"pont","kérdőív","2011-11-23","S.Á."]
[240,"tesztalany 40","kezdeményezőkészség",{"$f":"'Kiinduló adatok'!F43","v":4},"pont","kérdőív","2011-11-23","S.Á."]
[241,"tesztalany 41","kezdeményezőkészség",{"$f":"'Kiinduló adatok'!F44","v":4},"pont","kérdőív","2011-11-23","S.Á."]
[242,"tesztalany 42","kezdeményezőkészség",{"$f":"'Kiinduló adatok'!F45","v":4},"pont","kérdőív","2011-11-23","S.Á."]
[243,"tesztalany 43","kezdeményezőkészség",{"$f":"'Kiinduló adatok'!F46","v":5},"pont","kérdőív","2011-11-23","S.Á."]
[244,"tesztalany 44","kezdeményezőkészség",{"$f":"'Kiinduló adatok'!F47","v":4},"pont","kérdőív","2011-11-23","S.Á."]
[245,"tesztalany 45","kezdeményezőkészség",{"$f":"'Kiinduló adatok'!F48","v":2},"pont","kérdőív","2011-11-23","S.Á."]
[246,"tesztalany 46","kezdeményezőkészség",{"$f":"'Kiinduló adatok'!F49","v":3},"pont","kérdőív","2011-11-23","S.Á."]
[247,"tesztalany 47","kezdeményezőkészség",{"$f":"'Kiinduló adatok'!F50","v":3},"pont","kérdőív","2011-11-23","S.Á."]
[248,"tesztalany 48","kezdeményezőkészség",{"$f":"'Kiinduló adatok'!F51","v":3},"pont","kérdőív","2011-11-23","S.Á."]
[249,"tesztalany 49","kezdeményezőkészség",{"$f":"'Kiinduló adatok'!F52","v":3},"pont","kérdőív","2011-11-23","S.Á."]
[250,"tesztalany 50","kezdeményezőkészség",{"$f":"'Kiinduló adatok'!F53","v":5},"pont","kérdőív","2011-11-23","S.Á."]
[251,"tesztalany 1","becsületesség",{"$f":"'Kiinduló adatok'!G4","v":5},"pont","kérdőív","2011-11-23","S.Á."]
[252,"tesztalany 2","becsületesség",{"$f":"'Kiinduló adatok'!G5","v":5},"pont","kérdőív","2008-11-23","S.Á."]
[253,"tesztalany 3","becsületesség",{"$f":"'Kiinduló adatok'!G6","v":4},"pont","kérdőív","2008-11-23","S.Á."]
[254,"tesztalany 4","becsületesség",{"$f":"'Kiinduló adatok'!G7","v":5},"pont","kérdőív","2009-11-23","S.Á."]
[255,"tesztalany 5","becsületesség",{"$f":"'Kiinduló adatok'!G8","v":3},"pont","kérdőív","2009-11-23","S.Á."]
[256,"tesztalany 6","becsületesség",{"$f":"'Kiinduló adatok'!G9","v":5},"pont","kérdőív","2009-11-23","S.Á."]
[257,"tesztalany 7","becsületesség",{"$f":"'Kiinduló adatok'!G10","v":4},"pont","kérdőív","2010-11-23","S.Á."]
[258,"tesztalany 8","becsületesség",{"$f":"'Kiinduló adatok'!G11","v":5},"pont","kérdőív","2010-11-23","S.Á."]
[259,"tesztalany 9","becsületesség",{"$f":"'Kiinduló adatok'!G12","v":5},"pont","kérdőív","2010-11-23","S.Á."]
[260,"tesztalany 10","becsületesség",{"$f":"'Kiinduló adatok'!G13","v":5},"pont","kérdőív","2011-11-23","S.Á."]
[261,"tesztalany 11","becsületesség",{"$f":"'Kiinduló adatok'!G14","v":5},"pont","kérdőív","2011-11-23","S.Á."]
[262,"tesztalany 12","becsületesség",{"$f":"'Kiinduló adatok'!G15","v":5},"pont","kérdőív","2011-11-23","S.Á."]
[263,"tesztalany 13","becsületesség",{"$f":"'Kiinduló adatok'!G16","v":5},"pont","kérdőív","2011-11-23","S.Á."]
[264,"tesztalany 14","becsületesség",{"$f":"'Kiinduló adatok'!G17","v":5},"pont","kérdőív","2011-11-23","S.Á."]
[265,"tesztalany 15","becsületesség",{"$f":"'Kiinduló adatok'!G18","v":4},"pont","kérdőív","2011-11-23","S.Á."]
[266,"tesztalany 16","becsületesség",{"$f":"'Kiinduló adatok'!G19","v":5},"pont","kérdőív","2011-11-23","S.Á."]
[267,"tesztalany 17","becsületesség",{"$f":"'Kiinduló adatok'!G20","v":5},"pont","kérdőív","2011-11-23","S.Á."]
[268,"tesztalany 18","becsületesség",{"$f":"'Kiinduló adatok'!G21","v":4},"pont","kérdőív","2011-11-23","S.Á."]
[269,"tesztalany 19","becsületesség",{"$f":"'Kiinduló adatok'!G22","v":2},"pont","kérdőív","2011-11-23","S.Á."]
[270,"tesztalany 20","becsületesség",{"$f":"'Kiinduló adatok'!G23","v":5},"pont","kérdőív","2011-11-23","S.Á."]
[271,"tesztalany 21","becsületesség",{"$f":"'Kiinduló adatok'!G24","v":5},"pont","kérdőív","2011-11-23","S.Á."]
[272,"tesztalany 22","becsületesség",{"$f":"'Kiinduló adatok'!G25","v":4},"pont","kérdőív","2011-11-23","S.Á."]
[273,"tesztalany 23","becsületesség",{"$f":"'Kiinduló adatok'!G26","v":5},"pont","kérdőív","2011-11-23","S.Á."]
[274,"tesztalany 24","becsületesség",{"$f":"'Kiinduló adatok'!G27","v":5},"pont","kérdőív","2011-11-23","S.Á."]
[275,"tesztalany 25","becsületesség",{"$f":"'Kiinduló adatok'!G28","v":5},"pont","kérdőív","2011-11-23","S.Á."]
[276,"tesztalany 26","becsületesség",{"$f":"'Kiinduló adatok'!G29","v":5},"pont","kérdőív","2011-11-23","S.Á."]
[277,"tesztalany 27","becsületesség",{"$f":"'Kiinduló adatok'!G30","v":5},"pont","kérdőív","2011-11-23","S.Á."]
[278,"tesztalany 28","becsületesség",{"$f":"'Kiinduló adatok'!G31","v":5},"pont","kérdőív","2011-11-23","S.Á."]
[279,"tesztalany 29","becsületesség",{"$f":"'Kiinduló adatok'!G32","v":5},"pont","kérdőív","2011-11-23","S.Á."]
[280,"tesztalany 30","becsületesség",{"$f":"'Kiinduló adatok'!G33","v":5},"pont","kérdőív","2011-11-23","S.Á."]
[281,"tesztalany 31","becsületesség",{"$f":"'Kiinduló adatok'!G34","v":5},"pont","kérdőív","2011-11-23","S.Á."]
[282,"tesztalany 32","becsületesség",{"$f":"'Kiinduló adatok'!G35","v":5},"pont","kérdőív","2011-11-23","S.Á."]
[283,"tesztalany 33","becsületesség",{"$f":"'Kiinduló adatok'!G36","v":4},"pont","kérdőív","2011-11-23","S.Á."]
[284,"tesztalany 34","becsületesség",{"$f":"'Kiinduló adatok'!G37","v":4},"pont","kérdőív","2011-11-23","S.Á."]
[285,"tesztalany 35","becsületesség",{"$f":"'Kiinduló adatok'!G38","v":5},"pont","kérdőív","2011-11-23","S.Á."]
[286,"tesztalany 36","becsületesség",{"$f":"'Kiinduló adatok'!G39","v":5},"pont","kérdőív","2011-11-23","S.Á."]
[287,"tesztalany 37","becsületesség",{"$f":"'Kiinduló adatok'!G40","v":5},"pont","kérdőív","2011-11-23","S.Á."]
[288,"tesztalany 38","becsületesség",{"$f":"'Kiinduló adatok'!G41","v":5},"pont","kérdőív","2011-11-23","S.Á."]
[289,"tesztalany 39","becsületesség",{"$f":"'Kiinduló adatok'!G42","v":5},"pont","kérdőív","2011-11-23","S.Á."]
[290,"tesztalany 40","becsületesség",{"$f":"'Kiinduló adatok'!G43","v":4},"pont","kérdőív","2011-11-23","S.Á."]
[291,"tesztalany 41","becsületesség",{"$f":"'Kiinduló adatok'!G44","v":5},"pont","kérdőív","2011-11-23","S.Á."]
[292,"tesztalany 42","becsületesség",{"$f":"'Kiinduló adatok'!G45","v":4},"pont","kérdőív","2011-11-23","S.Á."]
[293,"tesztalany 43","becsületesség",{"$f":"'Kiinduló adatok'!G46","v":5},"pont","kérdőív","2011-11-23","S.Á."]
[294,"tesztalany 44","becsületesség",{"$f":"'Kiinduló adatok'!G47","v":5},"pont","kérdőív","2011-11-23","S.Á."]
[295,"tesztalany 45","becsületesség",{"$f":"'Kiinduló adatok'!G48","v":5},"pont","kérdőív","2011-11-23","S.Á."]
[296,"tesztalany 46","becsületesség",{"$f":"'Kiinduló adatok'!G49","v":5},"pont","kérdőív","2011-11-23","S.Á."]
[297,"tesztalany 47","becsületesség",{"$f":"'Kiinduló adatok'!G50","v":4},"pont","kérdőív","2011-11-23","S.Á."]
[298,"tesztalany 48","becsületesség",{"$f":"'Kiinduló adatok'!G51","v":4},"pont","kérdőív","2011-11-23","S.Á."]
[299,"tesztalany 49","becsületesség",{"$f":"'Kiinduló adatok'!G52","v":5},"pont","kérdőív","2011-11-23","S.Á."]
[300,"tesztalany 50","becsületesség",{"$f":"'Kiinduló adatok'!G53","v":4},"pont","kérdőív","2011-11-23","S.Á."]
[301,"tesztalany 1","hűség",{"$f":"'Kiinduló adatok'!H4","v":5},"pont","kérdőív","2011-11-23","S.Á."]
[302,"tesztalany 2","hűség",{"$f":"'Kiinduló adatok'!H5","v":5},"pont","kérdőív","2011-11-23","S.Á."]
[303,"tesztalany 3","hűség",{"$f":"'Kiinduló adatok'!H6","v":4},"pont","kérdőív","2011-11-23","S.Á."]
[304,"tesztalany 4","hűség",{"$f":"'Kiinduló adatok'!H7","v":3},"pont","kérdőív","2011-11-23","S.Á."]
[305,"tesztalany 5","hűség",{"$f":"'Kiinduló adatok'!H8","v":4},"pont","kérdőív","2011-11-23","S.Á."]
[306,"tesztalany 6","hűség",{"$f":"'Kiinduló adatok'!H9","v":5},"pont","kérdőív","2011-11-23","S.Á."]
[307,"tesztalany 7","hűség",{"$f":"'Kiinduló adatok'!H10","v":5},"pont","kérdőív","2011-11-23","S.Á."]
[308,"tesztalany 8","hűség",{"$f":"'Kiinduló adatok'!H11","v":5},"pont","kérdőív","2011-11-23","S.Á."]
[309,"tesztalany 9","hűség",{"$f":"'Kiinduló adatok'!H12","v":5},"pont","kérdőív","2011-11-23","S.Á."]
[310,"tesztalany 10","hűség",{"$f":"'Kiinduló adatok'!H13","v":5},"pont","kérdőív","2011-11-23","S.Á."]
[311,"tesztalany 11","hűség",{"$f":"'Kiinduló adatok'!H14","v":5},"pont","kérdőív","2011-11-23","S.Á."]
[312,"tesztalany 12","hűség",{"$f":"'Kiinduló adatok'!H15","v":5},"pont","kérdőív","2011-11-23","S.Á."]
[313,"tesztalany 13","hűség",{"$f":"'Kiinduló adatok'!H16","v":5},"pont","kérdőív","2011-11-23","S.Á."]
[314,"tesztalany 14","hűség",{"$f":"'Kiinduló adatok'!H17","v":5},"pont","kérdőív","2011-11-23","S.Á."]
[315,"tesztalany 15","hűség",{"$f":"'Kiinduló adatok'!H18","v":4},"pont","kérdőív","2011-11-23","S.Á."]
[316,"tesztalany 16","hűség",{"$f":"'Kiinduló adatok'!H19","v":5},"pont","kérdőív","2011-11-23","S.Á."]
[317,"tesztalany 17","hűség",{"$f":"'Kiinduló adatok'!H20","v":5},"pont","kérdőív","2011-11-23","S.Á."]
[318,"tesztalany 18","hűség",{"$f":"'Kiinduló adatok'!H21","v":5},"pont","kérdőív","2011-11-23","S.Á."]
[319,"tesztalany 19","hűség",{"$f":"'Kiinduló adatok'!H22","v":4},"pont","kérdőív","2011-11-23","S.Á."]
[320,"tesztalany 20","hűség",{"$f":"'Kiinduló adatok'!H23","v":4},"pont","kérdőív","2011-11-23","S.Á."]
[321,"tesztalany 21","hűség",{"$f":"'Kiinduló adatok'!H24","v":5},"pont","kérdőív","2011-11-23","S.Á."]
[322,"tesztalany 22","hűség",{"$f":"'Kiinduló adatok'!H25","v":5},"pont","kérdőív","2011-11-23","S.Á."]
[323,"tesztalany 23","hűség",{"$f":"'Kiinduló adatok'!H26","v":4},"pont","kérdőív","2011-11-23","S.Á."]
[324,"tesztalany 24","hűség",{"$f":"'Kiinduló adatok'!H27","v":4},"pont","kérdőív","2011-11-23","S.Á."]
[325,"tesztalany 25","hűség",{"$f":"'Kiinduló adatok'!H28","v":5},"pont","kérdőív","2011-11-23","S.Á."]
[326,"tesztalany 26","hűség",{"$f":"'Kiinduló adatok'!H29","v":3},"pont","kérdőív","2011-11-23","S.Á."]
[327,"tesztalany 27","hűség",{"$f":"'Kiinduló adatok'!H30","v":5},"pont","kérdőív","2011-11-23","S.Á."]
[328,"tesztalany 28","hűség",{"$f":"'Kiinduló adatok'!H31","v":5},"pont","kérdőív","2011-11-23","S.Á."]
[329,"tesztalany 29","hűség",{"$f":"'Kiinduló adatok'!H32","v":5},"pont","kérdőív","2011-11-23","S.Á."]
[330,"tesztalany 30","hűség",{"$f":"'Kiinduló adatok'!H33","v":5},"pont","kérdőív","2011-11-23","S.Á."]
[331,"tesztalany 31","hűség",{"$f":"'Kiinduló adatok'!H34","v":5},"pont","kérdőív","2011-11-23","S.Á."]
[332,"tesztalany 32","hűség",{"$f":"'Kiinduló adatok'!H35","v":5},"pont","kérdőív","2011-11-23","S.Á."]
[333,"tesztalany 33","hűség",{"$f":"'Kiinduló adatok'!H36","v":4},"pont","kérdőív","2011-11-23","S.Á."]
[334,"tesztalany 34","hűség",{"$f":"'Kiinduló adatok'!H37","v":5},"pont","kérdőív","2011-11-23","S.Á."]
[335,"tesztalany 35","hűség",{"$f":"'Kiinduló adatok'!H38","v":5},"pont","kérdőív","2011-11-23","S.Á."]
[336,"tesztalany 36","hűség",{"$f":"'Kiinduló adatok'!H39","v":5},"pont","kérdőív","2011-11-23","S.Á."]
[337,"tesztalany 37","hűség",{"$f":"'Kiinduló adatok'!H40","v":5},"pont","kérdőív","2011-11-23","S.Á."]
[338,"tesztalany 38","hűség",{"$f":"'Kiinduló adatok'!H41","v":4},"pont","kérdőív","2011-11-23","S.Á."]
[339,"tesztalany 39","hűség",{"$f":"'Kiinduló adatok'!H42","v":5},"pont","kérdőív","2011-11-23","S.Á."]
[340,"tesztalany 40","hűség",{"$f":"'Kiinduló adatok'!H43","v":5},"pont","kérdőív","2011-11-23","S.Á."]
[341,"tesztalany 41","hűség",{"$f":"'Kiinduló adatok'!H44","v":4},"pont","kérdőív","2011-11-23","S.Á."]
[342,"tesztalany 42","hűség",{"$f":"'Kiinduló adatok'!H45","v":3},"pont","kérdőív","2011-11-23","S.Á."]
[343,"tesztalany 43","hűség",{"$f":"'Kiinduló adatok'!H46","v":5},"pont","kérdőív","2011-11-23","S.Á."]
[344,"tesztalany 44","hűség",{"$f":"'Kiinduló adatok'!H47","v":5},"pont","kérdőív","2011-11-23","S.Á."]
[345,"tesztalany 45","hűség",{"$f":"'Kiinduló adatok'!H48","v":5},"pont","kérdőív","2011-11-23","S.Á."]
[346,"tesztalany 46","hűség",{"$f":"'Kiinduló adatok'!H49","v":4},"pont","kérdőív","2011-11-23","S.Á."]
[347,"tesztalany 47","hűség",{"$f":"'Kiinduló adatok'!H50","v":4},"pont","kérdőív","2011-11-23","S.Á."]
[348,"tesztalany 48","hűség",{"$f":"'Kiinduló adatok'!H51","v":5},"pont","kérdőív","2011-11-23","S.Á."]
[349,"tesztalany 49","hűség",{"$f":"'Kiinduló adatok'!H52","v":5},"pont","kérdőív","2011-11-23","S.Á."]
[350,"tesztalany 50","hűség",{"$f":"'Kiinduló adatok'!H53","v":5},"pont","kérdőív","2011-11-23","S.Á."]
[351,"tesztalany 1","önállóság",{"$f":"'Kiinduló adatok'!I4","v":4},"pont","kérdőív","2011-11-23","S.Á."]
[352,"tesztalany 2","önállóság",{"$f":"'Kiinduló adatok'!I5","v":5},"pont","kérdőív","2011-11-23","S.Á."]
[353,"tesztalany 3","önállóság",{"$f":"'Kiinduló adatok'!I6","v":5},"pont","kérdőív","2011-11-23","S.Á."]
[354,"tesztalany 4","önállóság",{"$f":"'Kiinduló adatok'!I7","v":4},"pont","kérdőív","2011-11-23","S.Á."]
[355,"tesztalany 5","önállóság",{"$f":"'Kiinduló adatok'!I8","v":3},"pont","kérdőív","2011-11-23","S.Á."]
[356,"tesztalany 6","önállóság",{"$f":"'Kiinduló adatok'!I9","v":4},"pont","kérdőív","2011-11-23","S.Á."]
[357,"tesztalany 7","önállóság",{"$f":"'Kiinduló adatok'!I10","v":5},"pont","kérdőív","2011-11-23","S.Á."]
[358,"tesztalany 8","önállóság",{"$f":"'Kiinduló adatok'!I11","v":4},"pont","kérdőív","2011-11-23","S.Á."]
[359,"tesztalany 9","önállóság",{"$f":"'Kiinduló adatok'!I12","v":5},"pont","kérdőív","2011-11-23","S.Á."]
[360,"tesztalany 10","önállóság",{"$f":"'Kiinduló adatok'!I13","v":5},"pont","kérdőív","2011-11-23","S.Á."]
[361,"tesztalany 11","önállóság",{"$f":"'Kiinduló adatok'!I14","v":4},"pont","kérdőív","2011-11-23","S.Á."]
[362,"tesztalany 12","önállóság",{"$f":"'Kiinduló adatok'!I15","v":5},"pont","kérdőív","2011-11-23","S.Á."]
[363,"tesztalany 13","önállóság",{"$f":"'Kiinduló adatok'!I16","v":5},"pont","kérdőív","2011-11-23","S.Á."]
[364,"tesztalany 14","önállóság",{"$f":"'Kiinduló adatok'!I17","v":3},"pont","kérdőív","2011-11-23","S.Á."]
[365,"tesztalany 15","önállóság",{"$f":"'Kiinduló adatok'!I18","v":5},"pont","kérdőív","2011-11-23","S.Á."]
[366,"tesztalany 16","önállóság",{"$f":"'Kiinduló adatok'!I19","v":5},"pont","kérdőív","2011-11-23","S.Á."]
[367,"tesztalany 17","önállóság",{"$f":"'Kiinduló adatok'!I20","v":5},"pont","kérdőív","2011-11-23","S.Á."]
[368,"tesztalany 18","önállóság",{"$f":"'Kiinduló adatok'!I21","v":4},"pont","kérdőív","2011-11-23","S.Á."]
[369,"tesztalany 19","önállóság",{"$f":"'Kiinduló adatok'!I22","v":3},"pont","kérdőív","2011-11-23","S.Á."]
[370,"tesztalany 20","önállóság",{"$f":"'Kiinduló adatok'!I23","v":4},"pont","kérdőív","2011-11-23","S.Á."]
[371,"tesztalany 21","önállóság",{"$f":"'Kiinduló adatok'!I24","v":5},"pont","kérdőív","2011-11-23","S.Á."]
[372,"tesztalany 22","önállóság",{"$f":"'Kiinduló adatok'!I25","v":5},"pont","kérdőív","2011-11-23","S.Á."]
[373,"tesztalany 23","önállóság",{"$f":"'Kiinduló adatok'!I26","v":4},"pont","kérdőív","2011-11-23","S.Á."]
[374,"tesztalany 24","önállóság",{"$f":"'Kiinduló adatok'!I27","v":3},"pont","kérdőív","2011-11-23","S.Á."]
[375,"tesztalany 25","önállóság",{"$f":"'Kiinduló adatok'!I28","v":4},"pont","kérdőív","2011-11-23","S.Á."]
[376,"tesztalany 26","önállóság",{"$f":"'Kiinduló adatok'!I29","v":3},"pont","kérdőív","2011-11-23","S.Á."]
[377,"tesztalany 27","önállóság",{"$f":"'Kiinduló adatok'!I30","v":3},"pont","kérdőív","2011-11-23","S.Á."]
[378,"tesztalany 28","önállóság",{"$f":"'Kiinduló adatok'!I31","v":4},"pont","kérdőív","2011-11-23","S.Á."]
[379,"tesztalany 29","önállóság",{"$f":"'Kiinduló adatok'!I32","v":3},"pont","kérdőív","2011-11-23","S.Á."]
[380,"tesztalany 30","önállóság",{"$f":"'Kiinduló adatok'!I33","v":5},"pont","kérdőív","2011-11-23","S.Á."]
[381,"tesztalany 31","önállóság",{"$f":"'Kiinduló adatok'!I34","v":4},"pont","kérdőív","2011-11-23","S.Á."]
[382,"tesztalany 32","önállóság",{"$f":"'Kiinduló adatok'!I35","v":4},"pont","kérdőív","2011-11-23","S.Á."]
[383,"tesztalany 33","önállóság",{"$f":"'Kiinduló adatok'!I36","v":4},"pont","kérdőív","2011-11-23","S.Á."]
[384,"tesztalany 34","önállóság",{"$f":"'Kiinduló adatok'!I37","v":5},"pont","kérdőív","2011-11-23","S.Á."]
[385,"tesztalany 35","önállóság",{"$f":"'Kiinduló adatok'!I38","v":4},"pont","kérdőív","2011-11-23","S.Á."]
[386,"tesztalany 36","önállóság",{"$f":"'Kiinduló adatok'!I39","v":4},"pont","kérdőív","2011-11-23","S.Á."]
[387,"tesztalany 37","önállóság",{"$f":"'Kiinduló adatok'!I40","v":5},"pont","kérdőív","2011-11-23","S.Á."]
[388,"tesztalany 38","önállóság",{"$f":"'Kiinduló adatok'!I41","v":5},"pont","kérdőív","2011-11-23","S.Á."]
[389,"tesztalany 39","önállóság",{"$f":"'Kiinduló adatok'!I42","v":5},"pont","kérdőív","2011-11-23","S.Á."]
[390,"tesztalany 40","önállóság",{"$f":"'Kiinduló adatok'!I43","v":5},"pont","kérdőív","2011-11-23","S.Á."]
[391,"tesztalany 41","önállóság",{"$f":"'Kiinduló adatok'!I44","v":4},"pont","kérdőív","2011-11-23","S.Á."]
[392,"tesztalany 42","önállóság",{"$f":"'Kiinduló adatok'!I45","v":5},"pont","kérdőív","2011-11-23","S.Á."]
[393,"tesztalany 43","önállóság",{"$f":"'Kiinduló adatok'!I46","v":5},"pont","kérdőív","2011-11-23","S.Á."]
[394,"tesztalany 44","önállóság",{"$f":"'Kiinduló adatok'!I47","v":4},"pont","kérdőív","2011-11-23","S.Á."]
[395,"tesztalany 45","önállóság",{"$f":"'Kiinduló adatok'!I48","v":5},"pont","kérdőív","2011-11-23","S.Á."]
[396,"tesztalany 46","önállóság",{"$f":"'Kiinduló adatok'!I49","v":5},"pont","kérdőív","2011-11-23","S.Á."]
[397,"tesztalany 47","önállóság",{"$f":"'Kiinduló adatok'!I50","v":4},"pont","kérdőív","2011-11-23","S.Á."]
[398,"tesztalany 48","önállóság",{"$f":"'Kiinduló adatok'!I51","v":4},"pont","kérdőív","2011-11-23","S.Á."]
[399,"tesztalany 49","önállóság",{"$f":"'Kiinduló adatok'!I52","v":4},"pont","kérdőív","2011-11-23","S.Á."]
[400,"tesztalany 50","önállóság",{"$f":"'Kiinduló adatok'!I53","v":5},"pont","kérdőív","2011-11-23","S.Á."]
[401,"tesztalany 1","konfliktuskezelés",{"$f":"'Kiinduló adatok'!J4","v":4},"pont","kérdőív","2011-11-23","S.Á."]
[402,"tesztalany 2","konfliktuskezelés",{"$f":"'Kiinduló adatok'!J5","v":4},"pont","kérdőív","2011-11-23","S.Á."]
[403,"tesztalany 3","konfliktuskezelés",{"$f":"'Kiinduló adatok'!J6","v":4},"pont","kérdőív","2011-11-23","S.Á."]
[404,"tesztalany 4","konfliktuskezelés",{"$f":"'Kiinduló adatok'!J7","v":4},"pont","kérdőív","2011-11-23","S.Á."]
[405,"tesztalany 5","konfliktuskezelés",{"$f":"'Kiinduló adatok'!J8","v":3},"pont","kérdőív","2011-11-23","S.Á."]
[406,"tesztalany 6","konfliktuskezelés",{"$f":"'Kiinduló adatok'!J9","v":4},"pont","kérdőív","2011-11-23","S.Á."]
[407,"tesztalany 7","konfliktuskezelés",{"$f":"'Kiinduló adatok'!J10","v":4},"pont","kérdőív","2011-11-23","S.Á."]
[408,"tesztalany 8","konfliktuskezelés",{"$f":"'Kiinduló adatok'!J11","v":2},"pont","kérdőív","2011-11-23","S.Á."]
[409,"tesztalany 9","konfliktuskezelés",{"$f":"'Kiinduló adatok'!J12","v":5},"pont","kérdőív","2011-11-23","S.Á."]
[410,"tesztalany 10","konfliktuskezelés",{"$f":"'Kiinduló adatok'!J13","v":3},"pont","kérdőív","2011-11-23","S.Á."]
[411,"tesztalany 11","konfliktuskezelés",{"$f":"'Kiinduló adatok'!J14","v":5},"pont","kérdőív","2011-11-23","S.Á."]
[412,"tesztalany 12","konfliktuskezelés",{"$f":"'Kiinduló adatok'!J15","v":5},"pont","kérdőív","2011-11-23","S.Á."]
[413,"tesztalany 13","konfliktuskezelés",{"$f":"'Kiinduló adatok'!J16","v":4},"pont","kérdőív","2011-11-23","S.Á."]
[414,"tesztalany 14","konfliktuskezelés",{"$f":"'Kiinduló adatok'!J17","v":5},"pont","kérdőív","2011-11-23","S.Á."]
[415,"tesztalany 15","konfliktuskezelés",{"$f":"'Kiinduló adatok'!J18","v":3},"pont","kérdőív","2011-11-23","S.Á."]
[416,"tesztalany 16","konfliktuskezelés",{"$f":"'Kiinduló adatok'!J19","v":3},"pont","kérdőív","2011-11-23","S.Á."]
[417,"tesztalany 17","konfliktuskezelés",{"$f":"'Kiinduló adatok'!J20","v":3},"pont","kérdőív","2011-11-23","S.Á."]
[418,"tesztalany 18","konfliktuskezelés",{"$f":"'Kiinduló adatok'!J21","v":4},"pont","kérdőív","2011-11-23","S.Á."]
[419,"tesztalany 19","konfliktuskezelés",{"$f":"'Kiinduló adatok'!J22","v":2},"pont","kérdőív","2011-11-23","S.Á."]
[420,"tesztalany 20","konfliktuskezelés",{"$f":"'Kiinduló adatok'!J23","v":5},"pont","kérdőív","2011-11-23","S.Á."]
[421,"tesztalany 21","konfliktuskezelés",{"$f":"'Kiinduló adatok'!J24","v":3},"pont","kérdőív","2011-11-23","S.Á."]
[422,"tesztalany 22","konfliktuskezelés",{"$f":"'Kiinduló adatok'!J25","v":4},"pont","kérdőív","2011-11-23","S.Á."]
[423,"tesztalany 23","konfliktuskezelés",{"$f":"'Kiinduló adatok'!J26","v":3},"pont","kérdőív","2011-11-23","S.Á."]
[424,"tesztalany 24","konfliktuskezelés",{"$f":"'Kiinduló adatok'!J27","v":3},"pont","kérdőív","2011-11-23","S.Á."]
[425,"tesztalany 25","konfliktuskezelés",{"$f":"'Kiinduló adatok'!J28","v":3},"pont","kérdőív","2011-11-23","S.Á."]
[426,"tesztalany 26","konfliktuskezelés",{"$f":"'Kiinduló adatok'!J29","v":4},"pont","kérdőív","2011-11-23","S.Á."]
[427,"tesztalany 27","konfliktuskezelés",{"$f":"'Kiinduló adatok'!J30","v":5},"pont","kérdőív","2011-11-23","S.Á."]
[428,"tesztalany 28","konfliktuskezelés",{"$f":"'Kiinduló adatok'!J31","v":3},"pont","kérdőív","2011-11-23","S.Á."]
[429,"tesztalany 29","konfliktuskezelés",{"$f":"'Kiinduló adatok'!J32","v":2},"pont","kérdőív","2011-11-23","S.Á."]
[430,"tesztalany 30","konfliktuskezelés",{"$f":"'Kiinduló adatok'!J33","v":5},"pont","kérdőív","2011-11-23","S.Á."]
[431,"tesztalany 31","konfliktuskezelés",{"$f":"'Kiinduló adatok'!J34","v":3},"pont","kérdőív","2011-11-23","S.Á."]
[432,"tesztalany 32","konfliktuskezelés",{"$f":"'Kiinduló adatok'!J35","v":5},"pont","kérdőív","2011-11-23","S.Á."]
[433,"tesztalany 33","konfliktuskezelés",{"$f":"'Kiinduló adatok'!J36","v":3},"pont","kérdőív","2011-11-23","S.Á."]
[434,"tesztalany 34","konfliktuskezelés",{"$f":"'Kiinduló adatok'!J37","v":4},"pont","kérdőív","2011-11-23","S.Á."]
[435,"tesztalany 35","konfliktuskezelés",{"$f":"'Kiinduló adatok'!J38","v":4},"pont","kérdőív","2011-11-23","S.Á."]
[436,"tesztalany 36","konfliktuskezelés",{"$f":"'Kiinduló adatok'!J39","v":4},"pont","kérdőív","2011-11-23","S.Á."]
[437,"tesztalany 37","konfliktuskezelés",{"$f":"'Kiinduló adatok'!J40","v":5},"pont","kérdőív","2011-11-23","S.Á."]
[438,"tesztalany 38","konfliktuskezelés",{"$f":"'Kiinduló adatok'!J41","v":5},"pont","kérdőív","2011-11-23","S.Á."]
[439,"tesztalany 39","konfliktuskezelés",{"$f":"'Kiinduló adatok'!J42","v":4},"pont","kérdőív","2011-11-23","S.Á."]
[440,"tesztalany 40","konfliktuskezelés",{"$f":"'Kiinduló adatok'!J43","v":5},"pont","kérdőív","2011-11-23","S.Á."]
[441,"tesztalany 41","konfliktuskezelés",{"$f":"'Kiinduló adatok'!J44","v":3},"pont","kérdőív","2011-11-23","S.Á."]
[442,"tesztalany 42","konfliktuskezelés",{"$f":"'Kiinduló adatok'!J45","v":3},"pont","kérdőív","2011-11-23","S.Á."]
[443,"tesztalany 43","konfliktuskezelés",{"$f":"'Kiinduló adatok'!J46","v":5},"pont","kérdőív","2011-11-23","S.Á."]
[444,"tesztalany 44","konfliktuskezelés",{"$f":"'Kiinduló adatok'!J47","v":4},"pont","kérdőív","2011-11-23","S.Á."]
[445,"tesztalany 45","konfliktuskezelés",{"$f":"'Kiinduló adatok'!J48","v":3},"pont","kérdőív","2011-11-23","S.Á."]
[446,"tesztalany 46","konfliktuskezelés",{"$f":"'Kiinduló adatok'!J49","v":4},"pont","kérdőív","2011-11-23","S.Á."]
[447,"tesztalany 47","konfliktuskezelés",{"$f":"'Kiinduló adatok'!J50","v":3},"pont","kérdőív","2011-11-23","S.Á."]
[448,"tesztalany 48","konfliktuskezelés",{"$f":"'Kiinduló adatok'!J51","v":5},"pont","kérdőív","2011-11-23","S.Á."]
[449,"tesztalany 49","konfliktuskezelés",{"$f":"'Kiinduló adatok'!J52","v":3},"pont","kérdőív","2011-11-23","S.Á."]
[450,"tesztalany 50","konfliktuskezelés",{"$f":"'Kiinduló adatok'!J53","v":4},"pont","kérdőív","2011-11-23","S.Á."]
[451,"tesztalany 1","segítőkészség",{"$f":"'Kiinduló adatok'!K4","v":5},"pont","kérdőív","2011-11-23","S.Á."]
[452,"tesztalany 2","segítőkészség",{"$f":"'Kiinduló adatok'!K5","v":5},"pont","kérdőív","2011-11-23","S.Á."]
[453,"tesztalany 3","segítőkészség",{"$f":"'Kiinduló adatok'!K6","v":4},"pont","kérdőív","2011-11-23","S.Á."]
[454,"tesztalany 4","segítőkészség",{"$f":"'Kiinduló adatok'!K7","v":5},"pont","kérdőív","2011-11-23","S.Á."]
[455,"tesztalany 5","segítőkészség",{"$f":"'Kiinduló adatok'!K8","v":4},"pont","kérdőív","2011-11-23","S.Á."]
[456,"tesztalany 6","segítőkészség",{"$f":"'Kiinduló adatok'!K9","v":5},"pont","kérdőív","2011-11-23","S.Á."]
[457,"tesztalany 7","segítőkészség",{"$f":"'Kiinduló adatok'!K10","v":5},"pont","kérdőív","2011-11-23","S.Á."]
[458,"tesztalany 8","segítőkészség",{"$f":"'Kiinduló adatok'!K11","v":5},"pont","kérdőív","2011-11-23","S.Á."]
[459,"tesztalany 9","segítőkészség",{"$f":"'Kiinduló adatok'!K12","v":5},"pont","kérdőív","2011-11-23","S.Á."]
[460,"tesztalany 10","segítőkészség",{"$f":"'Kiinduló adatok'!K13","v":5},"pont","kérdőív","2011-11-23","S.Á."]
[461,"tesztalany 11","segítőkészség",{"$f":"'Kiinduló adatok'!K14","v":5},"pont","kérdőív","2011-11-23","S.Á."]
[462,"tesztalany 12","segítőkészség",{"$f":"'Kiinduló adatok'!K15","v":5},"pont","kérdőív","2011-11-23","S.Á."]
[463,"tesztalany 13","segítőkészség",{"$f":"'Kiinduló adatok'!K16","v":5},"pont","kérdőív","2011-11-23","S.Á."]
[464,"tesztalany 14","segítőkészség",{"$f":"'Kiinduló adatok'!K17","v":5},"pont","kérdőív","2011-11-23","S.Á."]
[465,"tesztalany 15","segítőkészség",{"$f":"'Kiinduló adatok'!K18","v":4},"pont","kérdőív","2011-11-23","S.Á."]
[466,"tesztalany 16","segítőkészség",{"$f":"'Kiinduló adatok'!K19","v":5},"pont","kérdőív","2011-11-23","S.Á."]
[467,"tesztalany 17","segítőkészség",{"$f":"'Kiinduló adatok'!K20","v":4},"pont","kérdőív","2011-11-23","S.Á."]
[468,"tesztalany 18","segítőkészség",{"$f":"'Kiinduló adatok'!K21","v":4},"pont","kérdőív","2011-11-23","S.Á."]
[469,"tesztalany 19","segítőkészség",{"$f":"'Kiinduló adatok'!K22","v":4},"pont","kérdőív","2011-11-23","S.Á."]
[470,"tesztalany 20","segítőkészség",{"$f":"'Kiinduló adatok'!K23","v":5},"pont","kérdőív","2011-11-23","S.Á."]
[471,"tesztalany 21","segítőkészség",{"$f":"'Kiinduló adatok'!K24","v":3},"pont","kérdőív","2011-11-23","S.Á."]
[472,"tesztalany 22","segítőkészség",{"$f":"'Kiinduló adatok'!K25","v":3},"pont","kérdőív","2011-11-23","S.Á."]
[473,"tesztalany 23","segítőkészség",{"$f":"'Kiinduló adatok'!K26","v":4},"pont","kérdőív","2011-11-23","S.Á."]
[474,"tesztalany 24","segítőkészség",{"$f":"'Kiinduló adatok'!K27","v":5},"pont","kérdőív","2011-11-23","S.Á."]
[475,"tesztalany 25","segítőkészség",{"$f":"'Kiinduló adatok'!K28","v":5},"pont","kérdőív","2011-11-23","S.Á."]
[476,"tesztalany 26","segítőkészség",{"$f":"'Kiinduló adatok'!K29","v":5},"pont","kérdőív","2011-11-23","S.Á."]
[477,"tesztalany 27","segítőkészség",{"$f":"'Kiinduló adatok'!K30","v":4},"pont","kérdőív","2011-11-23","S.Á."]
[478,"tesztalany 28","segítőkészség",{"$f":"'Kiinduló adatok'!K31","v":5},"pont","kérdőív","2011-11-23","S.Á."]
[479,"tesztalany 29","segítőkészség",{"$f":"'Kiinduló adatok'!K32","v":4},"pont","kérdőív","2011-11-23","S.Á."]
[480,"tesztalany 30","segítőkészség",{"$f":"'Kiinduló adatok'!K33","v":5},"pont","kérdőív","2011-11-23","S.Á."]
[481,"tesztalany 31","segítőkészség",{"$f":"'Kiinduló adatok'!K34","v":5},"pont","kérdőív","2011-11-23","S.Á."]
[482,"tesztalany 32","segítőkészség",{"$f":"'Kiinduló adatok'!K35","v":5},"pont","kérdőív","2011-11-23","S.Á."]
[483,"tesztalany 33","segítőkészség",{"$f":"'Kiinduló adatok'!K36","v":4},"pont","kérdőív","2011-11-23","S.Á."]
[484,"tesztalany 34","segítőkészség",{"$f":"'Kiinduló adatok'!K37","v":4},"pont","kérdőív","2011-11-23","S.Á."]
[485,"tesztalany 35","segítőkészség",{"$f":"'Kiinduló adatok'!K38","v":5},"pont","kérdőív","2011-11-23","S.Á."]
[486,"tesztalany 36","segítőkészség",{"$f":"'Kiinduló adatok'!K39","v":4},"pont","kérdőív","2011-11-23","S.Á."]
[487,"tesztalany 37","segítőkészség",{"$f":"'Kiinduló adatok'!K40","v":5},"pont","kérdőív","2011-11-23","S.Á."]
[488,"tesztalany 38","segítőkészség",{"$f":"'Kiinduló adatok'!K41","v":5},"pont","kérdőív","2011-11-23","S.Á."]
[489,"tesztalany 39","segítőkészség",{"$f":"'Kiinduló adatok'!K42","v":5},"pont","kérdőív","2011-11-23","S.Á."]
[490,"tesztalany 40","segítőkészség",{"$f":"'Kiinduló adatok'!K43","v":3},"pont","kérdőív","2011-11-23","S.Á."]
[491,"tesztalany 41","segítőkészség",{"$f":"'Kiinduló adatok'!K44","v":4},"pont","kérdőív","2011-11-23","S.Á."]
[492,"tesztalany 42","segítőkészség",{"$f":"'Kiinduló adatok'!K45","v":5},"pont","kérdőív","2011-11-23","S.Á."]
[493,"tesztalany 43","segítőkészség",{"$f":"'Kiinduló adatok'!K46","v":5},"pont","kérdőív","2011-11-23","S.Á."]
[494,"tesztalany 44","segítőkészség",{"$f":"'Kiinduló adatok'!K47","v":5},"pont","kérdőív","2011-11-23","S.Á."]
[495,"tesztalany 45","segítőkészség",{"$f":"'Kiinduló adatok'!K48","v":5},"pont","kérdőív","2011-11-23","S.Á."]
[496,"tesztalany 46","segítőkészség",{"$f":"'Kiinduló adatok'!K49","v":4},"pont","kérdőív","2011-11-23","S.Á."]
[497,"tesztalany 47","segítőkészség",{"$f":"'Kiinduló adatok'!K50","v":4},"pont","kérdőív","2011-11-23","S.Á."]
[498,"tesztalany 48","segítőkészség",{"$f":"'Kiinduló adatok'!K51","v":3},"pont","kérdőív","2011-11-23","S.Á."]
[499,"tesztalany 49","segítőkészség",{"$f":"'Kiinduló adatok'!K52","v":5},"pont","kérdőív","2011-11-23","S.Á."]
[500,"tesztalany 50","segítőkészség",{"$f":"'Kiinduló adatok'!K53","v":4},"pont","kérdőív","2011-11-23","S.Á."]
[501,"tesztalany 1","pontosság",{"$f":"'Kiinduló adatok'!L4","v":5},"pont","kérdőív","2011-11-23","S.Á."]
[502,"tesztalany 2","pontosság",{"$f":"'Kiinduló adatok'!L5","v":5},"pont","kérdőív","2011-11-23","S.Á."]
[503,"tesztalany 3","pontosság",{"$f":"'Kiinduló adatok'!L6","v":3},"pont","kérdőív","2011-11-23","S.Á."]
[504,"tesztalany 4","pontosság",{"$f":"'Kiinduló adatok'!L7","v":5},"pont","kérdőív","2011-11-23","S.Á."]
[505,"tesztalany 5","pontosság",{"$f":"'Kiinduló adatok'!L8","v":3},"pont","kérdőív","2011-11-23","S.Á."]
[506,"tesztalany 6","pontosság",{"$f":"'Kiinduló adatok'!L9","v":3},"pont","kérdőív","2011-11-23","S.Á."]
[507,"tesztalany 7","pontosság",{"$f":"'Kiinduló adatok'!L10","v":4},"pont","kérdőív","2011-11-23","S.Á."]
[508,"tesztalany 8","pontosság",{"$f":"'Kiinduló adatok'!L11","v":4},"pont","kérdőív","2011-11-23","S.Á."]
[509,"tesztalany 9","pontosság",{"$f":"'Kiinduló adatok'!L12","v":5},"pont","kérdőív","2011-11-23","S.Á."]
[510,"tesztalany 10","pontosság",{"$f":"'Kiinduló adatok'!L13","v":5},"pont","kérdőív","2011-11-23","S.Á."]
[511,"tesztalany 11","pontosság",{"$f":"'Kiinduló adatok'!L14","v":5},"pont","kérdőív","2011-11-23","S.Á."]
[512,"tesztalany 12","pontosság",{"$f":"'Kiinduló adatok'!L15","v":5},"pont","kérdőív","2011-11-23","S.Á."]
[513,"tesztalany 13","pontosság",{"$f":"'Kiinduló adatok'!L16","v":4},"pont","kérdőív","2011-11-23","S.Á."]
[514,"tesztalany 14","pontosság",{"$f":"'Kiinduló adatok'!L17","v":4},"pont","kérdőív","2011-11-23","S.Á."]
[515,"tesztalany 15","pontosság",{"$f":"'Kiinduló adatok'!L18","v":3},"pont","kérdőív","2011-11-23","S.Á."]
[516,"tesztalany 16","pontosság",{"$f":"'Kiinduló adatok'!L19","v":5},"pont","kérdőív","2011-11-23","S.Á."]
[517,"tesztalany 17","pontosság",{"$f":"'Kiinduló adatok'!L20","v":5},"pont","kérdőív","2011-11-23","S.Á."]
[518,"tesztalany 18","pontosság",{"$f":"'Kiinduló adatok'!L21","v":3},"pont","kérdőív","2011-11-23","S.Á."]
[519,"tesztalany 19","pontosság",{"$f":"'Kiinduló adatok'!L22","v":3},"pont","kérdőív","2011-11-23","S.Á."]
[520,"tesztalany 20","pontosság",{"$f":"'Kiinduló adatok'!L23","v":5},"pont","kérdőív","2011-11-23","S.Á."]
[521,"tesztalany 21","pontosság",{"$f":"'Kiinduló adatok'!L24","v":5},"pont","kérdőív","2011-11-23","S.Á."]
[522,"tesztalany 22","pontosság",{"$f":"'Kiinduló adatok'!L25","v":3},"pont","kérdőív","2011-11-23","S.Á."]
[523,"tesztalany 23","pontosság",{"$f":"'Kiinduló adatok'!L26","v":4},"pont","kérdőív","2011-11-23","S.Á."]
[524,"tesztalany 24","pontosság",{"$f":"'Kiinduló adatok'!L27","v":2},"pont","kérdőív","2011-11-23","S.Á."]
[525,"tesztalany 25","pontosság",{"$f":"'Kiinduló adatok'!L28","v":5},"pont","kérdőív","2011-11-23","S.Á."]
[526,"tesztalany 26","pontosság",{"$f":"'Kiinduló adatok'!L29","v":4},"pont","kérdőív","2011-11-23","S.Á."]
[527,"tesztalany 27","pontosság",{"$f":"'Kiinduló adatok'!L30","v":4},"pont","kérdőív","2011-11-23","S.Á."]
[528,"tesztalany 28","pontosság",{"$f":"'Kiinduló adatok'!L31","v":4},"pont","kérdőív","2011-11-23","S.Á."]
[529,"tesztalany 29","pontosság",{"$f":"'Kiinduló adatok'!L32","v":4},"pont","kérdőív","2011-11-23","S.Á."]
[530,"tesztalany 30","pontosság",{"$f":"'Kiinduló adatok'!L33","v":5},"pont","kérdőív","2011-11-23","S.Á."]
[531,"tesztalany 31","pontosság",{"$f":"'Kiinduló adatok'!L34","v":4},"pont","kérdőív","2011-11-23","S.Á."]
[532,"tesztalany 32","pontosság",{"$f":"'Kiinduló adatok'!L35","v":5},"pont","kérdőív","2011-11-23","S.Á."]
[533,"tesztalany 33","pontosság",{"$f":"'Kiinduló adatok'!L36","v":3},"pont","kérdőív","2011-11-23","S.Á."]
[534,"tesztalany 34","pontosság",{"$f":"'Kiinduló adatok'!L37","v":4},"pont","kérdőív","2011-11-23","S.Á."]
[535,"tesztalany 35","pontosság",{"$f":"'Kiinduló adatok'!L38","v":4},"pont","kérdőív","2011-11-23","S.Á."]
[536,"tesztalany 36","pontosság",{"$f":"'Kiinduló adatok'!L39","v":3},"pont","kérdőív","2011-11-23","S.Á."]
[537,"tesztalany 37","pontosság",{"$f":"'Kiinduló adatok'!L40","v":5},"pont","kérdőív","2011-11-23","S.Á."]
[538,"tesztalany 38","pontosság",{"$f":"'Kiinduló adatok'!L41","v":4},"pont","kérdőív","2011-11-23","S.Á."]
[539,"tesztalany 39","pontosság",{"$f":"'Kiinduló adatok'!L42","v":5},"pont","kérdőív","2011-11-23","S.Á."]
[540,"tesztalany 40","pontosság",{"$f":"'Kiinduló adatok'!L43","v":3},"pont","kérdőív","2011-11-23","S.Á."]
[541,"tesztalany 41","pontosság",{"$f":"'Kiinduló adatok'!L44","v":5},"pont","kérdőív","2011-11-23","S.Á."]
[542,"tesztalany 42","pontosság",{"$f":"'Kiinduló adatok'!L45","v":3},"pont","kérdőív","2011-11-23","S.Á."]
[543,"tesztalany 43","pontosság",{"$f":"'Kiinduló adatok'!L46","v":4},"pont","kérdőív","2011-11-23","S.Á."]
[544,"tesztalany 44","pontosság",{"$f":"'Kiinduló adatok'!L47","v":4},"pont","kérdőív","2011-11-23","S.Á."]
[545,"tesztalany 45","pontosság",{"$f":"'Kiinduló adatok'!L48","v":4},"pont","kérdőív","2011-11-23","S.Á."]
[546,"tesztalany 46","pontosság",{"$f":"'Kiinduló adatok'!L49","v":3},"pont","kérdőív","2011-11-23","S.Á."]
[547,"tesztalany 47","pontosság",{"$f":"'Kiinduló adatok'!L50","v":4},"pont","kérdőív","2011-11-23","S.Á."]
[548,"tesztalany 48","pontosság",{"$f":"'Kiinduló adatok'!L51","v":4},"pont","kérdőív","2011-11-23","S.Á."]
[549,"tesztalany 49","pontosság",{"$f":"'Kiinduló adatok'!L52","v":4},"pont","kérdőív","2011-11-23","S.Á."]
[550,"tesztalany 50","pontosság",{"$f":"'Kiinduló adatok'!L53","v":4},"pont","kérdőív","2011-11-23","S.Á."]
[551,"tesztalany 1","csapatjáték",{"$f":"'Kiinduló adatok'!M4","v":5},"pont","kérdőív","2011-11-23","S.Á."]
[552,"tesztalany 2","csapatjáték",{"$f":"'Kiinduló adatok'!M5","v":5},"pont","kérdőív","2011-11-23","S.Á."]
[553,"tesztalany 3","csapatjáték",{"$f":"'Kiinduló adatok'!M6","v":4},"pont","kérdőív","2011-11-23","S.Á."]
[554,"tesztalany 4","csapatjáték",{"$f":"'Kiinduló adatok'!M7","v":5},"pont","kérdőív","2011-11-23","S.Á."]
[555,"tesztalany 5","csapatjáték",{"$f":"'Kiinduló adatok'!M8","v":4},"pont","kérdőív","2011-11-23","S.Á."]
[556,"tesztalany 6","csapatjáték",{"$f":"'Kiinduló adatok'!M9","v":4},"pont","kérdőív","2011-11-23","S.Á."]
[557,"tesztalany 7","csapatjáték",{"$f":"'Kiinduló adatok'!M10","v":4},"pont","kérdőív","2011-11-23","S.Á."]
[558,"tesztalany 8","csapatjáték",{"$f":"'Kiinduló adatok'!M11","v":5},"pont","kérdőív","2011-11-23","S.Á."]
[559,"tesztalany 9","csapatjáték",{"$f":"'Kiinduló adatok'!M12","v":5},"pont","kérdőív","2011-11-23","S.Á."]
[560,"tesztalany 10","csapatjáték",{"$f":"'Kiinduló adatok'!M13","v":4},"pont","kérdőív","2011-11-23","S.Á."]
[561,"tesztalany 11","csapatjáték",{"$f":"'Kiinduló adatok'!M14","v":4},"pont","kérdőív","2011-11-23","S.Á."]
[562,"tesztalany 12","csapatjáték",{"$f":"'Kiinduló adatok'!M15","v":5},"pont","kérdőív","2011-11-23","S.Á."]
[563,"tesztalany 13","csapatjáték",{"$f":"'Kiinduló adatok'!M16","v":4},"pont","kérdőív","2011-11-23","S.Á."]
[564,"tesztalany 14","csapatjáték",{"$f":"'Kiinduló adatok'!M17","v":4},"pont","kérdőív","2011-11-23","S.Á."]
[565,"tesztalany 15","csapatjáték",{"$f":"'Kiinduló adatok'!M18","v":4},"pont","kérdőív","2011-11-23","S.Á."]
[566,"tesztalany 16","csapatjáték",{"$f":"'Kiinduló adatok'!M19","v":5},"pont","kérdőív","2011-11-23","S.Á."]
[567,"tesztalany 17","csapatjáték",{"$f":"'Kiinduló adatok'!M20","v":3},"pont","kérdőív","2011-11-23","S.Á."]
[568,"tesztalany 18","csapatjáték",{"$f":"'Kiinduló adatok'!M21","v":3},"pont","kérdőív","2011-11-23","S.Á."]
[569,"tesztalany 19","csapatjáték",{"$f":"'Kiinduló adatok'!M22","v":3},"pont","kérdőív","2011-11-23","S.Á."]
[570,"tesztalany 20","csapatjáték",{"$f":"'Kiinduló adatok'!M23","v":5},"pont","kérdőív","2011-11-23","S.Á."]
[571,"tesztalany 21","csapatjáték",{"$f":"'Kiinduló adatok'!M24","v":5},"pont","kérdőív","2011-11-23","S.Á."]
[572,"tesztalany 22","csapatjáték",{"$f":"'Kiinduló adatok'!M25","v":3},"pont","kérdőív","2011-11-23","S.Á."]
[573,"tesztalany 23","csapatjáték",{"$f":"'Kiinduló adatok'!M26","v":3},"pont","kérdőív","2011-11-23","S.Á."]
[574,"tesztalany 24","csapatjáték",{"$f":"'Kiinduló adatok'!M27","v":4},"pont","kérdőív","2011-11-23","S.Á."]
[575,"tesztalany 25","csapatjáték",{"$f":"'Kiinduló adatok'!M28","v":4},"pont","kérdőív","2011-11-23","S.Á."]
[576,"tesztalany 26","csapatjáték",{"$f":"'Kiinduló adatok'!M29","v":5},"pont","kérdőív","2011-11-23","S.Á."]
[577,"tesztalany 27","csapatjáték",{"$f":"'Kiinduló adatok'!M30","v":4},"pont","kérdőív","2011-11-23","S.Á."]
[578,"tesztalany 28","csapatjáték",{"$f":"'Kiinduló adatok'!M31","v":4},"pont","kérdőív","2011-11-23","S.Á."]
[579,"tesztalany 29","csapatjáték",{"$f":"'Kiinduló adatok'!M32","v":4},"pont","kérdőív","2011-11-23","S.Á."]
[580,"tesztalany 30","csapatjáték",{"$f":"'Kiinduló adatok'!M33","v":5},"pont","kérdőív","2011-11-23","S.Á."]
[581,"tesztalany 31","csapatjáték",{"$f":"'Kiinduló adatok'!M34","v":4},"pont","kérdőív","2011-11-23","S.Á."]
[582,"tesztalany 32","csapatjáték",{"$f":"'Kiinduló adatok'!M35","v":4},"pont","kérdőív","2011-11-23","S.Á."]
[583,"tesztalany 33","csapatjáték",{"$f":"'Kiinduló adatok'!M36","v":4},"pont","kérdőív","2011-11-23","S.Á."]
[584,"tesztalany 34","csapatjáték",{"$f":"'Kiinduló adatok'!M37","v":4},"pont","kérdőív","2011-11-23","S.Á."]
[585,"tesztalany 35","csapatjáték",{"$f":"'Kiinduló adatok'!M38","v":5},"pont","kérdőív","2011-11-23","S.Á."]
[586,"tesztalany 36","csapatjáték",{"$f":"'Kiinduló adatok'!M39","v":4},"pont","kérdőív","2011-11-23","S.Á."]
[587,"tesztalany 37","csapatjáték",{"$f":"'Kiinduló adatok'!M40","v":5},"pont","kérdőív","2011-11-23","S.Á."]
[588,"tesztalany 38","csapatjáték",{"$f":"'Kiinduló adatok'!M41","v":4},"pont","kérdőív","2011-11-23","S.Á."]
[589,"tesztalany 39","csapatjáték",{"$f":"'Kiinduló adatok'!M42","v":4},"pont","kérdőív","2011-11-23","S.Á."]
[590,"tesztalany 40","csapatjáték",{"$f":"'Kiinduló adatok'!M43","v":5},"pont","kérdőív","2011-11-23","S.Á."]
[591,"tesztalany 41","csapatjáték",{"$f":"'Kiinduló adatok'!M44","v":5},"pont","kérdőív","2011-11-23","S.Á."]
[592,"tesztalany 42","csapatjáték",{"$f":"'Kiinduló adatok'!M45","v":5},"pont","kérdőív","2011-11-23","S.Á."]
[593,"tesztalany 43","csapatjáték",{"$f":"'Kiinduló adatok'!M46","v":5},"pont","kérdőív","2011-11-23","S.Á."]
[594,"tesztalany 44","csapatjáték",{"$f":"'Kiinduló adatok'!M47","v":4},"pont","kérdőív","2011-11-23","S.Á."]
[595,"tesztalany 45","csapatjáték",{"$f":"'Kiinduló adatok'!M48","v":5},"pont","kérdőív","2011-11-23","S.Á."]
[596,"tesztalany 46","csapatjáték",{"$f":"'Kiinduló adatok'!M49","v":4},"pont","kérdőív","2011-11-23","S.Á."]
[597,"tesztalany 47","csapatjáték",{"$f":"'Kiinduló adatok'!M50","v":3},"pont","kérdőív","2011-11-23","S.Á."]
[598,"tesztalany 48","csapatjáték",{"$f":"'Kiinduló adatok'!M51","v":4},"pont","kérdőív","2011-11-23","S.Á."]
[599,"tesztalany 49","csapatjáték",{"$f":"'Kiinduló adatok'!M52","v":5},"pont","kérdőív","2011-11-23","S.Á."]
[600,"tesztalany 50","csapatjáték",{"$f":"'Kiinduló adatok'!M53","v":3},"pont","kérdőív","2011-11-23","S.Á."]
[601,"tesztalany 1","karrierfejlesztés",{"$f":"'Kiinduló adatok'!N4","v":4},"pont","kérdőív","2011-11-23","S.Á."]
[602,"tesztalany 2","karrierfejlesztés",{"$f":"'Kiinduló adatok'!N5","v":2},"pont","kérdőív","2011-11-23","S.Á."]
[603,"tesztalany 3","karrierfejlesztés",{"$f":"'Kiinduló adatok'!N6","v":4},"pont","kérdőív","2011-11-23","S.Á."]
[604,"tesztalany 4","karrierfejlesztés",{"$f":"'Kiinduló adatok'!N7","v":3},"pont","kérdőív","2011-11-23","S.Á."]
[605,"tesztalany 5","karrierfejlesztés",{"$f":"'Kiinduló adatok'!N8","v":5},"pont","kérdőív","2011-11-23","S.Á."]
[606,"tesztalany 6","karrierfejlesztés",{"$f":"'Kiinduló adatok'!N9","v":0},"pont","kérdőív","2011-11-23","S.Á."]
[607,"tesztalany 7","karrierfejlesztés",{"$f":"'Kiinduló adatok'!N10","v":5},"pont","kérdőív","2011-11-23","S.Á."]
[608,"tesztalany 8","karrierfejlesztés",{"$f":"'Kiinduló adatok'!N11","v":3},"pont","kérdőív","2011-11-23","S.Á."]
[609,"tesztalany 9","karrierfejlesztés",{"$f":"'Kiinduló adatok'!N12","v":0},"pont","kérdőív","2011-11-23","S.Á."]
[610,"tesztalany 10","karrierfejlesztés",{"$f":"'Kiinduló adatok'!N13","v":0},"pont","kérdőív","2011-11-23","S.Á."]
[611,"tesztalany 11","karrierfejlesztés",{"$f":"'Kiinduló adatok'!N14","v":3},"pont","kérdőív","2011-11-23","S.Á."]
[612,"tesztalany 12","karrierfejlesztés",{"$f":"'Kiinduló adatok'!N15","v":3},"pont","kérdőív","2011-11-23","S.Á."]
[613,"tesztalany 13","karrierfejlesztés",{"$f":"'Kiinduló adatok'!N16","v":2},"pont","kérdőív","2011-11-23","S.Á."]
[614,"tesztalany 14","karrierfejlesztés",{"$f":"'Kiinduló adatok'!N17","v":0},"pont","kérdőív","2011-11-23","S.Á."]
[615,"tesztalany 15","karrierfejlesztés",{"$f":"'Kiinduló adatok'!N18","v":5},"pont","kérdőív","2011-11-23","S.Á."]
[616,"tesztalany 16","karrierfejlesztés",{"$f":"'Kiinduló adatok'!N19","v":0},"pont","kérdőív","2011-11-23","S.Á."]
[617,"tesztalany 17","karrierfejlesztés",{"$f":"'Kiinduló adatok'!N20","v":4},"pont","kérdőív","2011-11-23","S.Á."]
[618,"tesztalany 18","karrierfejlesztés",{"$f":"'Kiinduló adatok'!N21","v":4},"pont","kérdőív","2011-11-23","S.Á."]
[619,"tesztalany 19","karrierfejlesztés",{"$f":"'Kiinduló adatok'!N22","v":2},"pont","kérdőív","2011-11-23","S.Á."]
[620,"tesztalany 20","karrierfejlesztés",{"$f":"'Kiinduló adatok'!N23","v":2},"pont","kérdőív","2011-11-23","S.Á."]
[621,"tesztalany 21","karrierfejlesztés",{"$f":"'Kiinduló adatok'!N24","v":2},"pont","kérdőív","2011-11-23","S.Á."]
[622,"tesztalany 22","karrierfejlesztés",{"$f":"'Kiinduló adatok'!N25","v":0},"pont","kérdőív","2011-11-23","S.Á."]
[623,"tesztalany 23","karrierfejlesztés",{"$f":"'Kiinduló adatok'!N26","v":2},"pont","kérdőív","2011-11-23","S.Á."]
[624,"tesztalany 24","karrierfejlesztés",{"$f":"'Kiinduló adatok'!N27","v":4},"pont","kérdőív","2011-11-23","S.Á."]
[625,"tesztalany 25","karrierfejlesztés",{"$f":"'Kiinduló adatok'!N28","v":1},"pont","kérdőív","2011-11-23","S.Á."]
[626,"tesztalany 26","karrierfejlesztés",{"$f":"'Kiinduló adatok'!N29","v":4},"pont","kérdőív","2011-11-23","S.Á."]
[627,"tesztalany 27","karrierfejlesztés",{"$f":"'Kiinduló adatok'!N30","v":0},"pont","kérdőív","2011-11-23","S.Á."]
[628,"tesztalany 28","karrierfejlesztés",{"$f":"'Kiinduló adatok'!N31","v":1},"pont","kérdőív","2011-11-23","S.Á."]
[629,"tesztalany 29","karrierfejlesztés",{"$f":"'Kiinduló adatok'!N32","v":2},"pont","kérdőív","2011-11-23","S.Á."]
[630,"tesztalany 30","karrierfejlesztés",{"$f":"'Kiinduló adatok'!N33","v":5},"pont","kérdőív","2011-11-23","S.Á."]
[631,"tesztalany 31","karrierfejlesztés",{"$f":"'Kiinduló adatok'!N34","v":0},"pont","kérdőív","2011-11-23","S.Á."]
[632,"tesztalany 32","karrierfejlesztés",{"$f":"'Kiinduló adatok'!N35","v":2},"pont","kérdőív","2011-11-23","S.Á."]
[633,"tesztalany 33","karrierfejlesztés",{"$f":"'Kiinduló adatok'!N36","v":1},"pont","kérdőív","2011-11-23","S.Á."]
[634,"tesztalany 34","karrierfejlesztés",{"$f":"'Kiinduló adatok'!N37","v":2},"pont","kérdőív","2011-11-23","S.Á."]
[635,"tesztalany 35","karrierfejlesztés",{"$f":"'Kiinduló adatok'!N38","v":1},"pont","kérdőív","2011-11-23","S.Á."]
[636,"tesztalany 36","karrierfejlesztés",{"$f":"'Kiinduló adatok'!N39","v":2},"pont","kérdőív","2011-11-23","S.Á."]
[637,"tesztalany 37","karrierfejlesztés",{"$f":"'Kiinduló adatok'!N40","v":5},"pont","kérdőív","2011-11-23","S.Á."]
[638,"tesztalany 38","karrierfejlesztés",{"$f":"'Kiinduló adatok'!N41","v":4},"pont","kérdőív","2011-11-23","S.Á."]
[639,"tesztalany 39","karrierfejlesztés",{"$f":"'Kiinduló adatok'!N42","v":0},"pont","kérdőív","2011-11-23","S.Á."]
[640,"tesztalany 40","karrierfejlesztés",{"$f":"'Kiinduló adatok'!N43","v":4},"pont","kérdőív","2011-11-23","S.Á."]
[641,"tesztalany 41","karrierfejlesztés",{"$f":"'Kiinduló adatok'!N44","v":3},"pont","kérdőív","2011-11-23","S.Á."]
[642,"tesztalany 42","karrierfejlesztés",{"$f":"'Kiinduló adatok'!N45","v":5},"pont","kérdőív","2011-11-23","S.Á."]
[643,"tesztalany 43","karrierfejlesztés",{"$f":"'Kiinduló adatok'!N46","v":4},"pont","kérdőív","2011-11-23","S.Á."]
[644,"tesztalany 44","karrierfejlesztés",{"$f":"'Kiinduló adatok'!N47","v":4},"pont","kérdőív","2011-11-23","S.Á."]
[645,"tesztalany 45","karrierfejlesztés",{"$f":"'Kiinduló adatok'!N48","v":4},"pont","kérdőív","2011-11-23","S.Á."]
[646,"tesztalany 46","karrierfejlesztés",{"$f":"'Kiinduló adatok'!N49","v":3},"pont","kérdőív","2011-11-23","S.Á."]
[647,"tesztalany 47","karrierfejlesztés",{"$f":"'Kiinduló adatok'!N50","v":3},"pont","kérdőív","2011-11-23","S.Á."]
[648,"tesztalany 48","karrierfejlesztés",{"$f":"'Kiinduló adatok'!N51","v":5},"pont","kérdőív","2011-11-23","S.Á."]
[649,"tesztalany 49","karrierfejlesztés",{"$f":"'Kiinduló adatok'!N52","v":2},"pont","kérdőív","2011-11-23","S.Á."]
[650,"tesztalany 50","karrierfejlesztés",{"$f":"'Kiinduló adatok'!N53","v":3},"pont","kérdőív","2011-11-23","S.Á."]
[651,"tesztalany 1","képzés, továbbképzés",{"$f":"'Kiinduló adatok'!O4","v":5},"pont","kérdőív","2011-11-23","S.Á."]
[652,"tesztalany 2","képzés, továbbképzés",{"$f":"'Kiinduló adatok'!O5","v":1},"pont","kérdőív","2011-11-23","S.Á."]
[653,"tesztalany 3","képzés, továbbképzés",{"$f":"'Kiinduló adatok'!O6","v":2},"pont","kérdőív","2011-11-23","S.Á."]
[654,"tesztalany 4","képzés, továbbképzés",{"$f":"'Kiinduló adatok'!O7","v":5},"pont","kérdőív","2011-11-23","S.Á."]
[655,"tesztalany 5","képzés, továbbképzés",{"$f":"'Kiinduló adatok'!O8","v":0},"pont","kérdőív","2011-11-23","S.Á."]
[656,"tesztalany 6","képzés, továbbképzés",{"$f":"'Kiinduló adatok'!O9","v":1},"pont","kérdőív","2011-11-23","S.Á."]
[657,"tesztalany 7","képzés, továbbképzés",{"$f":"'Kiinduló adatok'!O10","v":2},"pont","kérdőív","2011-11-23","S.Á."]
[658,"tesztalany 8","képzés, továbbképzés",{"$f":"'Kiinduló adatok'!O11","v":3},"pont","kérdőív","2011-11-23","S.Á."]
[659,"tesztalany 9","képzés, továbbképzés",{"$f":"'Kiinduló adatok'!O12","v":5},"pont","kérdőív","2011-11-23","S.Á."]
[660,"tesztalany 10","képzés, továbbképzés",{"$f":"'Kiinduló adatok'!O13","v":1},"pont","kérdőív","2011-11-23","S.Á."]
[661,"tesztalany 11","képzés, továbbképzés",{"$f":"'Kiinduló adatok'!O14","v":2},"pont","kérdőív","2011-11-23","S.Á."]
[662,"tesztalany 12","képzés, továbbképzés",{"$f":"'Kiinduló adatok'!O15","v":3},"pont","kérdőív","2011-11-23","S.Á."]
[663,"tesztalany 13","képzés, továbbképzés",{"$f":"'Kiinduló adatok'!O16","v":3},"pont","kérdőív","2011-11-23","S.Á."]
[664,"tesztalany 14","képzés, továbbképzés",{"$f":"'Kiinduló adatok'!O17","v":3},"pont","kérdőív","2011-11-23","S.Á."]
[665,"tesztalany 15","képzés, továbbképzés",{"$f":"'Kiinduló adatok'!O18","v":1},"pont","kérdőív","2011-11-23","S.Á."]
[666,"tesztalany 16","képzés, továbbképzés",{"$f":"'Kiinduló adatok'!O19","v":0},"pont","kérdőív","2011-11-23","S.Á."]
[667,"tesztalany 17","képzés, továbbképzés",{"$f":"'Kiinduló adatok'!O20","v":4},"pont","kérdőív","2011-11-23","S.Á."]
[668,"tesztalany 18","képzés, továbbképzés",{"$f":"'Kiinduló adatok'!O21","v":1},"pont","kérdőív","2011-11-23","S.Á."]
[669,"tesztalany 19","képzés, továbbképzés",{"$f":"'Kiinduló adatok'!O22","v":0},"pont","kérdőív","2011-11-23","S.Á."]
[670,"tesztalany 20","képzés, továbbképzés",{"$f":"'Kiinduló adatok'!O23","v":3},"pont","kérdőív","2011-11-23","S.Á."]
[671,"tesztalany 21","képzés, továbbképzés",{"$f":"'Kiinduló adatok'!O24","v":2},"pont","kérdőív","2011-11-23","S.Á."]
[672,"tesztalany 22","képzés, továbbképzés",{"$f":"'Kiinduló adatok'!O25","v":0},"pont","kérdőív","2011-11-23","S.Á."]
[673,"tesztalany 23","képzés, továbbképzés",{"$f":"'Kiinduló adatok'!O26","v":4},"pont","kérdőív","2011-11-23","S.Á."]
[674,"tesztalany 24","képzés, továbbképzés",{"$f":"'Kiinduló adatok'!O27","v":4},"pont","kérdőív","2011-11-23","S.Á."]
[675,"tesztalany 25","képzés, továbbképzés",{"$f":"'Kiinduló adatok'!O28","v":2},"pont","kérdőív","2011-11-23","S.Á."]
[676,"tesztalany 26","képzés, továbbképzés",{"$f":"'Kiinduló adatok'!O29","v":4},"pont","kérdőív","2011-11-23","S.Á."]
[677,"tesztalany 27","képzés, továbbképzés",{"$f":"'Kiinduló adatok'!O30","v":0},"pont","kérdőív","2011-11-23","S.Á."]
[678,"tesztalany 28","képzés, továbbképzés",{"$f":"'Kiinduló adatok'!O31","v":3},"pont","kérdőív","2011-11-23","S.Á."]
[679,"tesztalany 29","képzés, továbbképzés",{"$f":"'Kiinduló adatok'!O32","v":2},"pont","kérdőív","2011-11-23","S.Á."]
[680,"tesztalany 30","képzés, továbbképzés",{"$f":"'Kiinduló adatok'!O33","v":5},"pont","kérdőív","2011-11-23","S.Á."]
[681,"tesztalany 31","képzés, továbbképzés",{"$f":"'Kiinduló adatok'!O34","v":2},"pont","kérdőív","2011-11-23","S.Á."]
[682,"tesztalany 32","képzés, továbbképzés",{"$f":"'Kiinduló adatok'!O35","v":5},"pont","kérdőív","2011-11-23","S.Á."]
[683,"tesztalany 33","képzés, továbbképzés",{"$f":"'Kiinduló adatok'!O36","v":2},"pont","kérdőív","2011-11-23","S.Á."]
[684,"tesztalany 34","képzés, továbbképzés",{"$f":"'Kiinduló adatok'!O37","v":1},"pont","kérdőív","2011-11-23","S.Á."]
[685,"tesztalany 35","képzés, továbbképzés",{"$f":"'Kiinduló adatok'!O38","v":4},"pont","kérdőív","2011-11-23","S.Á."]
[686,"tesztalany 36","képzés, továbbképzés",{"$f":"'Kiinduló adatok'!O39","v":3},"pont","kérdőív","2011-11-23","S.Á."]
[687,"tesztalany 37","képzés, továbbképzés",{"$f":"'Kiinduló adatok'!O40","v":5},"pont","kérdőív","2011-11-23","S.Á."]
[688,"tesztalany 38","képzés, továbbképzés",{"$f":"'Kiinduló adatok'!O41","v":4},"pont","kérdőív","2011-11-23","S.Á."]
[689,"tesztalany 39","képzés, továbbképzés",{"$f":"'Kiinduló adatok'!O42","v":3},"pont","kérdőív","2011-11-23","S.Á."]
[690,"tesztalany 40","képzés, továbbképzés",{"$f":"'Kiinduló adatok'!O43","v":2},"pont","kérdőív","2011-11-23","S.Á."]
[691,"tesztalany 41","képzés, továbbképzés",{"$f":"'Kiinduló adatok'!O44","v":2},"pont","kérdőív","2011-11-23","S.Á."]
[692,"tesztalany 42","képzés, továbbképzés",{"$f":"'Kiinduló adatok'!O45","v":5},"pont","kérdőív","2011-11-23","S.Á."]
[693,"tesztalany 43","képzés, továbbképzés",{"$f":"'Kiinduló adatok'!O46","v":5},"pont","kérdőív","2011-11-23","S.Á."]
[694,"tesztalany 44","képzés, továbbképzés",{"$f":"'Kiinduló adatok'!O47","v":4},"pont","kérdőív","2011-11-23","S.Á."]
[695,"tesztalany 45","képzés, továbbképzés",{"$f":"'Kiinduló adatok'!O48","v":5},"pont","kérdőív","2011-11-23","S.Á."]
[696,"tesztalany 46","képzés, továbbképzés",{"$f":"'Kiinduló adatok'!O49","v":5},"pont","kérdőív","2011-11-23","S.Á."]
[697,"tesztalany 47","képzés, továbbképzés",{"$f":"'Kiinduló adatok'!O50","v":3},"pont","kérdőív","2011-11-23","S.Á."]
[698,"tesztalany 48","képzés, továbbképzés",{"$f":"'Kiinduló adatok'!O51","v":4},"pont","kérdőív","2011-11-23","S.Á."]
[699,"tesztalany 49","képzés, továbbképzés",{"$f":"'Kiinduló adatok'!O52","v":3},"pont","kérdőív","2011-11-23","S.Á."]
[700,"tesztalany 50","képzés, továbbképzés",{"$f":"'Kiinduló adatok'!O53","v":2},"pont","kérdőív","2011-11-23","S.Á."]
[701,"tesztalany 1","családi élet",{"$f":"'Kiinduló adatok'!P4","v":5},"pont","kérdőív","2011-11-23","S.Á."]
[702,"tesztalany 2","családi élet",{"$f":"'Kiinduló adatok'!P5","v":5},"pont","kérdőív","2011-11-23","S.Á."]
[703,"tesztalany 3","családi élet",{"$f":"'Kiinduló adatok'!P6","v":3},"pont","kérdőív","2011-11-23","S.Á."]
[704,"tesztalany 4","családi élet",{"$f":"'Kiinduló adatok'!P7","v":5},"pont","kérdőív","2011-11-23","S.Á."]
[705,"tesztalany 5","családi élet",{"$f":"'Kiinduló adatok'!P8","v":0},"pont","kérdőív","2011-11-23","S.Á."]
[706,"tesztalany 6","családi élet",{"$f":"'Kiinduló adatok'!P9","v":5},"pont","kérdőív","2011-11-23","S.Á."]
[707,"tesztalany 7","családi élet",{"$f":"'Kiinduló adatok'!P10","v":3},"pont","kérdőív","2011-11-23","S.Á."]
[708,"tesztalany 8","családi élet",{"$f":"'Kiinduló adatok'!P11","v":3},"pont","kérdőív","2011-11-23","S.Á."]
[709,"tesztalany 9","családi élet",{"$f":"'Kiinduló adatok'!P12","v":0},"pont","kérdőív","2011-11-23","S.Á."]
[710,"tesztalany 10","családi élet",{"$f":"'Kiinduló adatok'!P13","v":5},"pont","kérdőív","2011-11-23","S.Á."]
[711,"tesztalany 11","családi élet",{"$f":"'Kiinduló adatok'!P14","v":5},"pont","kérdőív","2011-11-23","S.Á."]
[712,"tesztalany 12","családi élet",{"$f":"'Kiinduló adatok'!P15","v":5},"pont","kérdőív","2011-11-23","S.Á."]
[713,"tesztalany 13","családi élet",{"$f":"'Kiinduló adatok'!P16","v":5},"pont","kérdőív","2011-11-23","S.Á."]
[714,"tesztalany 14","családi élet",{"$f":"'Kiinduló adatok'!P17","v":5},"pont","kérdőív","2011-11-23","S.Á."]
[715,"tesztalany 15","családi élet",{"$f":"'Kiinduló adatok'!P18","v":4},"pont","kérdőív","2011-11-23","S.Á."]
[716,"tesztalany 16","családi élet",{"$f":"'Kiinduló adatok'!P19","v":5},"pont","kérdőív","2011-11-23","S.Á."]
[717,"tesztalany 17","családi élet",{"$f":"'Kiinduló adatok'!P20","v":5},"pont","kérdőív","2011-11-23","S.Á."]
[718,"tesztalany 18","családi élet",{"$f":"'Kiinduló adatok'!P21","v":5},"pont","kérdőív","2011-11-23","S.Á."]
[719,"tesztalany 19","családi élet",{"$f":"'Kiinduló adatok'!P22","v":4},"pont","kérdőív","2011-11-23","S.Á."]
[720,"tesztalany 20","családi élet",{"$f":"'Kiinduló adatok'!P23","v":5},"pont","kérdőív","2011-11-23","S.Á."]
[721,"tesztalany 21","családi élet",{"$f":"'Kiinduló adatok'!P24","v":5},"pont","kérdőív","2011-11-23","S.Á."]
[722,"tesztalany 22","családi élet",{"$f":"'Kiinduló adatok'!P25","v":0},"pont","kérdőív","2011-11-23","S.Á."]
[723,"tesztalany 23","családi élet",{"$f":"'Kiinduló adatok'!P26","v":5},"pont","kérdőív","2011-11-23","S.Á."]
[724,"tesztalany 24","családi élet",{"$f":"'Kiinduló adatok'!P27","v":4},"pont","kérdőív","2011-11-23","S.Á."]
[725,"tesztalany 25","családi élet",{"$f":"'Kiinduló adatok'!P28","v":4},"pont","kérdőív","2011-11-23","S.Á."]
[726,"tesztalany 26","családi élet",{"$f":"'Kiinduló adatok'!P29","v":5},"pont","kérdőív","2011-11-23","S.Á."]
[727,"tesztalany 27","családi élet",{"$f":"'Kiinduló adatok'!P30","v":5},"pont","kérdőív","2011-11-23","S.Á."]
[728,"tesztalany 28","családi élet",{"$f":"'Kiinduló adatok'!P31","v":4},"pont","kérdőív","2011-11-23","S.Á."]
[729,"tesztalany 29","családi élet",{"$f":"'Kiinduló adatok'!P32","v":5},"pont","kérdőív","2011-11-23","S.Á."]
[730,"tesztalany 30","családi élet",{"$f":"'Kiinduló adatok'!P33","v":5},"pont","kérdőív","2011-11-23","S.Á."]
[731,"tesztalany 31","családi élet",{"$f":"'Kiinduló adatok'!P34","v":5},"pont","kérdőív","2011-11-23","S.Á."]
[732,"tesztalany 32","családi élet",{"$f":"'Kiinduló adatok'!P35","v":4},"pont","kérdőív","2011-11-23","S.Á."]
[733,"tesztalany 33","családi élet",{"$f":"'Kiinduló adatok'!P36","v":3},"pont","kérdőív","2011-11-23","S.Á."]
[734,"tesztalany 34","családi élet",{"$f":"'Kiinduló adatok'!P37","v":4},"pont","kérdőív","2011-11-23","S.Á."]
[735,"tesztalany 35","családi élet",{"$f":"'Kiinduló adatok'!P38","v":5},"pont","kérdőív","2011-11-23","S.Á."]
[736,"tesztalany 36","családi élet",{"$f":"'Kiinduló adatok'!P39","v":5},"pont","kérdőív","2011-11-23","S.Á."]
[737,"tesztalany 37","családi élet",{"$f":"'Kiinduló adatok'!P40","v":5},"pont","kérdőív","2011-11-23","S.Á."]
[738,"tesztalany 38","családi élet",{"$f":"'Kiinduló adatok'!P41","v":5},"pont","kérdőív","2011-11-23","S.Á."]
[739,"tesztalany 39","családi élet",{"$f":"'Kiinduló adatok'!P42","v":5},"pont","kérdőív","2011-11-23","S.Á."]
[740,"tesztalany 40","családi élet",{"$f":"'Kiinduló adatok'!P43","v":5},"pont","kérdőív","2011-11-23","S.Á."]
[741,"tesztalany 41","családi élet",{"$f":"'Kiinduló adatok'!P44","v":5},"pont","kérdőív","2011-11-23","S.Á."]
[742,"tesztalany 42","családi élet",{"$f":"'Kiinduló adatok'!P45","v":4},"pont","kérdőív","2011-11-23","S.Á."]
[743,"tesztalany 43","családi élet",{"$f":"'Kiinduló adatok'!P46","v":5},"pont","kérdőív","2011-11-23","S.Á."]
[744,"tesztalany 44","családi élet",{"$f":"'Kiinduló adatok'!P47","v":5},"pont","kérdőív","2011-11-23","S.Á."]
[745,"tesztalany 45","családi élet",{"$f":"'Kiinduló adatok'!P48","v":0},"pont","kérdőív","2011-11-23","S.Á."]
[746,"tesztalany 46","családi élet",{"$f":"'Kiinduló adatok'!P49","v":3},"pont","kérdőív","2011-11-23","S.Á."]
[747,"tesztalany 47","családi élet",{"$f":"'Kiinduló adatok'!P50","v":4},"pont","kérdőív","2011-11-23","S.Á."]
[748,"tesztalany 48","családi élet",{"$f":"'Kiinduló adatok'!P51","v":4},"pont","kérdőív","2011-11-23","S.Á."]
[749,"tesztalany 49","családi élet",{"$f":"'Kiinduló adatok'!P52","v":5},"pont","kérdőív","2011-11-23","S.Á."]
[750,"tesztalany 50","családi élet",{"$f":"'Kiinduló adatok'!P53","v":5},"pont","kérdőív","2011-11-23","S.Á."]
[751,"tesztalany 1","párkapcsolat",{"$f":"'Kiinduló adatok'!Q4","v":4},"pont","kérdőív","2011-11-23","S.Á."]
[752,"tesztalany 2","párkapcsolat",{"$f":"'Kiinduló adatok'!Q5","v":2},"pont","kérdőív","2011-11-23","S.Á."]
[753,"tesztalany 3","párkapcsolat",{"$f":"'Kiinduló adatok'!Q6","v":1},"pont","kérdőív","2011-11-23","S.Á."]
[754,"tesztalany 4","párkapcsolat",{"$f":"'Kiinduló adatok'!Q7","v":3},"pont","kérdőív","2011-11-23","S.Á."]
[755,"tesztalany 5","párkapcsolat",{"$f":"'Kiinduló adatok'!Q8","v":0},"pont","kérdőív","2011-11-23","S.Á."]
[756,"tesztalany 6","párkapcsolat",{"$f":"'Kiinduló adatok'!Q9","v":0},"pont","kérdőív","2011-11-23","S.Á."]
[757,"tesztalany 7","párkapcsolat",{"$f":"'Kiinduló adatok'!Q10","v":4},"pont","kérdőív","2011-11-23","S.Á."]
[758,"tesztalany 8","párkapcsolat",{"$f":"'Kiinduló adatok'!Q11","v":3},"pont","kérdőív","2011-11-23","S.Á."]
[759,"tesztalany 9","párkapcsolat",{"$f":"'Kiinduló adatok'!Q12","v":0},"pont","kérdőív","2011-11-23","S.Á."]
[760,"tesztalany 10","párkapcsolat",{"$f":"'Kiinduló adatok'!Q13","v":5},"pont","kérdőív","2011-11-23","S.Á."]
[761,"tesztalany 11","párkapcsolat",{"$f":"'Kiinduló adatok'!Q14","v":4},"pont","kérdőív","2011-11-23","S.Á."]
[762,"tesztalany 12","párkapcsolat",{"$f":"'Kiinduló adatok'!Q15","v":5},"pont","kérdőív","2011-11-23","S.Á."]
[763,"tesztalany 13","párkapcsolat",{"$f":"'Kiinduló adatok'!Q16","v":4},"pont","kérdőív","2011-11-23","S.Á."]
[764,"tesztalany 14","párkapcsolat",{"$f":"'Kiinduló adatok'!Q17","v":5},"pont","kérdőív","2011-11-23","S.Á."]
[765,"tesztalany 15","párkapcsolat",{"$f":"'Kiinduló adatok'!Q18","v":2},"pont","kérdőív","2011-11-23","S.Á."]
[766,"tesztalany 16","párkapcsolat",{"$f":"'Kiinduló adatok'!Q19","v":5},"pont","kérdőív","2011-11-23","S.Á."]
[767,"tesztalany 17","párkapcsolat",{"$f":"'Kiinduló adatok'!Q20","v":5},"pont","kérdőív","2011-11-23","S.Á."]
[768,"tesztalany 18","párkapcsolat",{"$f":"'Kiinduló adatok'!Q21","v":5},"pont","kérdőív","2011-11-23","S.Á."]
[769,"tesztalany 19","párkapcsolat",{"$f":"'Kiinduló adatok'!Q22","v":4},"pont","kérdőív","2011-11-23","S.Á."]
[770,"tesztalany 20","párkapcsolat",{"$f":"'Kiinduló adatok'!Q23","v":4},"pont","kérdőív","2011-11-23","S.Á."]
[771,"tesztalany 21","párkapcsolat",{"$f":"'Kiinduló adatok'!Q24","v":5},"pont","kérdőív","2011-11-23","S.Á."]
[772,"tesztalany 22","párkapcsolat",{"$f":"'Kiinduló adatok'!Q25","v":5},"pont","kérdőív","2011-11-23","S.Á."]
[773,"tesztalany 23","párkapcsolat",{"$f":"'Kiinduló adatok'!Q26","v":3},"pont","kérdőív","2011-11-23","S.Á."]
[774,"tesztalany 24","párkapcsolat",{"$f":"'Kiinduló adatok'!Q27","v":4},"pont","kérdőív","2011-11-23","S.Á."]
[775,"tesztalany 25","párkapcsolat",{"$f":"'Kiinduló adatok'!Q28","v":3},"pont","kérdőív","2011-11-23","S.Á."]
[776,"tesztalany 26","párkapcsolat",{"$f":"'Kiinduló adatok'!Q29","v":5},"pont","kérdőív","2011-11-23","S.Á."]
[777,"tesztalany 27","párkapcsolat",{"$f":"'Kiinduló adatok'!Q30","v":5},"pont","kérdőív","2011-11-23","S.Á."]
[778,"tesztalany 28","párkapcsolat",{"$f":"'Kiinduló adatok'!Q31","v":2},"pont","kérdőív","2011-11-23","S.Á."]
[779,"tesztalany 29","párkapcsolat",{"$f":"'Kiinduló adatok'!Q32","v":3},"pont","kérdőív","2011-11-23","S.Á."]
[780,"tesztalany 30","párkapcsolat",{"$f":"'Kiinduló adatok'!Q33","v":5},"pont","kérdőív","2011-11-23","S.Á."]
[781,"tesztalany 31","párkapcsolat",{"$f":"'Kiinduló adatok'!Q34","v":5},"pont","kérdőív","2011-11-23","S.Á."]
[782,"tesztalany 32","párkapcsolat",{"$f":"'Kiinduló adatok'!Q35","v":1},"pont","kérdőív","2011-11-23","S.Á."]
[783,"tesztalany 33","párkapcsolat",{"$f":"'Kiinduló adatok'!Q36","v":4},"pont","kérdőív","2011-11-23","S.Á."]
[784,"tesztalany 34","párkapcsolat",{"$f":"'Kiinduló adatok'!Q37","v":3},"pont","kérdőív","2011-11-23","S.Á."]
[785,"tesztalany 35","párkapcsolat",{"$f":"'Kiinduló adatok'!Q38","v":3},"pont","kérdőív","2011-11-23","S.Á."]
[786,"tesztalany 36","párkapcsolat",{"$f":"'Kiinduló adatok'!Q39","v":4},"pont","kérdőív","2011-11-23","S.Á."]
[787,"tesztalany 37","párkapcsolat",{"$f":"'Kiinduló adatok'!Q40","v":5},"pont","kérdőív","2011-11-23","S.Á."]
[788,"tesztalany 38","párkapcsolat",{"$f":"'Kiinduló adatok'!Q41","v":0},"pont","kérdőív","2011-11-23","S.Á."]
[789,"tesztalany 39","párkapcsolat",{"$f":"'Kiinduló adatok'!Q42","v":5},"pont","kérdőív","2011-11-23","S.Á."]
[790,"tesztalany 40","párkapcsolat",{"$f":"'Kiinduló adatok'!Q43","v":4},"pont","kérdőív","2011-11-23","S.Á."]
[791,"tesztalany 41","párkapcsolat",{"$f":"'Kiinduló adatok'!Q44","v":4},"pont","kérdőív","2011-11-23","S.Á."]
[792,"tesztalany 42","párkapcsolat",{"$f":"'Kiinduló adatok'!Q45","v":4},"pont","kérdőív","2011-11-23","S.Á."]
[793,"tesztalany 43","párkapcsolat",{"$f":"'Kiinduló adatok'!Q46","v":5},"pont","kérdőív","2011-11-23","S.Á."]
[794,"tesztalany 44","párkapcsolat",{"$f":"'Kiinduló adatok'!Q47","v":4},"pont","kérdőív","2011-11-23","S.Á."]
[795,"tesztalany 45","párkapcsolat",{"$f":"'Kiinduló adatok'!Q48","v":0},"pont","kérdőív","2011-11-23","S.Á."]
[796,"tesztalany 46","párkapcsolat",{"$f":"'Kiinduló adatok'!Q49","v":3},"pont","kérdőív","2011-11-23","S.Á."]
[797,"tesztalany 47","párkapcsolat",{"$f":"'Kiinduló adatok'!Q50","v":4},"pont","kérdőív","2011-11-23","S.Á."]
[798,"tesztalany 48","párkapcsolat",{"$f":"'Kiinduló adatok'!Q51","v":4},"pont","kérdőív","2011-11-23","S.Á."]
[799,"tesztalany 49","párkapcsolat",{"$f":"'Kiinduló adatok'!Q52","v":4},"pont","kérdőív","2011-11-23","S.Á."]
[800,"tesztalany 50","párkapcsolat",{"$f":"'Kiinduló adatok'!Q53","v":4},"pont","kérdőív","2011-11-23","S.Á."]
[801,"tesztalany 1","vallás",{"$f":"'Kiinduló adatok'!R4","v":5},"pont","kérdőív","2011-11-23","S.Á."]
[802,"tesztalany 2","vallás",{"$f":"'Kiinduló adatok'!R5","v":0},"pont","kérdőív","2011-11-23","S.Á."]
[803,"tesztalany 3","vallás",{"$f":"'Kiinduló adatok'!R6","v":5},"pont","kérdőív","2011-11-23","S.Á."]
[804,"tesztalany 4","vallás",{"$f":"'Kiinduló adatok'!R7","v":5},"pont","kérdőív","2011-11-23","S.Á."]
[805,"tesztalany 5","vallás",{"$f":"'Kiinduló adatok'!R8","v":0},"pont","kérdőív","2011-11-23","S.Á."]
[806,"tesztalany 6","vallás",{"$f":"'Kiinduló adatok'!R9","v":0},"pont","kérdőív","2011-11-23","S.Á."]
[807,"tesztalany 7","vallás",{"$f":"'Kiinduló adatok'!R10","v":1},"pont","kérdőív","2011-11-23","S.Á."]
[808,"tesztalany 8","vallás",{"$f":"'Kiinduló adatok'!R11","v":3},"pont","kérdőív","2011-11-23","S.Á."]
[809,"tesztalany 9","vallás",{"$f":"'Kiinduló adatok'!R12","v":0},"pont","kérdőív","2011-11-23","S.Á."]
[810,"tesztalany 10","vallás",{"$f":"'Kiinduló adatok'!R13","v":5},"pont","kérdőív","2011-11-23","S.Á."]
[811,"tesztalany 11","vallás",{"$f":"'Kiinduló adatok'!R14","v":1},"pont","kérdőív","2011-11-23","S.Á."]
[812,"tesztalany 12","vallás",{"$f":"'Kiinduló adatok'!R15","v":0},"pont","kérdőív","2011-11-23","S.Á."]
[813,"tesztalany 13","vallás",{"$f":"'Kiinduló adatok'!R16","v":1},"pont","kérdőív","2011-11-23","S.Á."]
[814,"tesztalany 14","vallás",{"$f":"'Kiinduló adatok'!R17","v":3},"pont","kérdőív","2011-11-23","S.Á."]
[815,"tesztalany 15","vallás",{"$f":"'Kiinduló adatok'!R18","v":3},"pont","kérdőív","2011-11-23","S.Á."]
[816,"tesztalany 16","vallás",{"$f":"'Kiinduló adatok'!R19","v":0},"pont","kérdőív","2011-11-23","S.Á."]
[817,"tesztalany 17","vallás",{"$f":"'Kiinduló adatok'!R20","v":5},"pont","kérdőív","2011-11-23","S.Á."]
[818,"tesztalany 18","vallás",{"$f":"'Kiinduló adatok'!R21","v":2},"pont","kérdőív","2011-11-23","S.Á."]
[819,"tesztalany 19","vallás",{"$f":"'Kiinduló adatok'!R22","v":4},"pont","kérdőív","2011-11-23","S.Á."]
[820,"tesztalany 20","vallás",{"$f":"'Kiinduló adatok'!R23","v":1},"pont","kérdőív","2011-11-23","S.Á."]
[821,"tesztalany 21","vallás",{"$f":"'Kiinduló adatok'!R24","v":5},"pont","kérdőív","2011-11-23","S.Á."]
[822,"tesztalany 22","vallás",{"$f":"'Kiinduló adatok'!R25","v":0},"pont","kérdőív","2011-11-23","S.Á."]
[823,"tesztalany 23","vallás",{"$f":"'Kiinduló adatok'!R26","v":1},"pont","kérdőív","2011-11-23","S.Á."]
[824,"tesztalany 24","vallás",{"$f":"'Kiinduló adatok'!R27","v":0},"pont","kérdőív","2011-11-23","S.Á."]
[825,"tesztalany 25","vallás",{"$f":"'Kiinduló adatok'!R28","v":0},"pont","kérdőív","2011-11-23","S.Á."]
[826,"tesztalany 26","vallás",{"$f":"'Kiinduló adatok'!R29","v":0},"pont","kérdőív","2011-11-23","S.Á."]
[827,"tesztalany 27","vallás",{"$f":"'Kiinduló adatok'!R30","v":3},"pont","kérdőív","2011-11-23","S.Á."]
[828,"tesztalany 28","vallás",{"$f":"'Kiinduló adatok'!R31","v":5},"pont","kérdőív","2011-11-23","S.Á."]
[829,"tesztalany 29","vallás",{"$f":"'Kiinduló adatok'!R32","v":3},"pont","kérdőív","2011-11-23","S.Á."]
[830,"tesztalany 30","vallás",{"$f":"'Kiinduló adatok'!R33","v":5},"pont","kérdőív","2011-11-23","S.Á."]
[831,"tesztalany 31","vallás",{"$f":"'Kiinduló adatok'!R34","v":0},"pont","kérdőív","2011-11-23","S.Á."]
[832,"tesztalany 32","vallás",{"$f":"'Kiinduló adatok'!R35","v":3},"pont","kérdőív","2011-11-23","S.Á."]
[833,"tesztalany 33","vallás",{"$f":"'Kiinduló adatok'!R36","v":0},"pont","kérdőív","2011-11-23","S.Á."]
[834,"tesztalany 34","vallás",{"$f":"'Kiinduló adatok'!R37","v":0},"pont","kérdőív","2011-11-23","S.Á."]
[835,"tesztalany 35","vallás",{"$f":"'Kiinduló adatok'!R38","v":0},"pont","kérdőív","2011-11-23","S.Á."]
[836,"tesztalany 36","vallás",{"$f":"'Kiinduló adatok'!R39","v":0},"pont","kérdőív","2011-11-23","S.Á."]
[837,"tesztalany 37","vallás",{"$f":"'Kiinduló adatok'!R40","v":5},"pont","kérdőív","2011-11-23","S.Á."]
[838,"tesztalany 38","vallás",{"$f":"'Kiinduló adatok'!R41","v":5},"pont","kérdőív","2011-11-23","S.Á."]
[839,"tesztalany 39","vallás",{"$f":"'Kiinduló adatok'!R42","v":2},"pont","kérdőív","2011-11-23","S.Á."]
[840,"tesztalany 40","vallás",{"$f":"'Kiinduló adatok'!R43","v":0},"pont","kérdőív","2011-11-23","S.Á."]
[841,"tesztalany 41","vallás",{"$f":"'Kiinduló adatok'!R44","v":0},"pont","kérdőív","2011-11-23","S.Á."]
[842,"tesztalany 42","vallás",{"$f":"'Kiinduló adatok'!R45","v":0},"pont","kérdőív","2011-11-23","S.Á."]
[843,"tesztalany 43","vallás",{"$f":"'Kiinduló adatok'!R46","v":3},"pont","kérdőív","2011-11-23","S.Á."]
[844,"tesztalany 44","vallás",{"$f":"'Kiinduló adatok'!R47","v":4},"pont","kérdőív","2011-11-23","S.Á."]
[845,"tesztalany 45","vallás",{"$f":"'Kiinduló adatok'!R48","v":0},"pont","kérdőív","2011-11-23","S.Á."]
[846,"tesztalany 46","vallás",{"$f":"'Kiinduló adatok'!R49","v":3},"pont","kérdőív","2011-11-23","S.Á."]
[847,"tesztalany 47","vallás",{"$f":"'Kiinduló adatok'!R50","v":3},"pont","kérdőív","2011-11-23","S.Á."]
[848,"tesztalany 48","vallás",{"$f":"'Kiinduló adatok'!R51","v":2},"pont","kérdőív","2011-11-23","S.Á."]
[849,"tesztalany 49","vallás",{"$f":"'Kiinduló adatok'!R52","v":1},"pont","kérdőív","2011-11-23","S.Á."]
[850,"tesztalany 50","vallás",{"$f":"'Kiinduló adatok'!R53","v":1},"pont","kérdőív","2011-11-23","S.Á."]

{"sheet":"Kimutatás darab","index":3,"n_rows":55,"n_cols":19,"rows_kept":55,"cut":false,"hidden":false,"merged":[]}
[]
[]
["Darab / Mértékegység","Oszlopcímkék"]
["Sorcímkék","alkalmazkodás","becsületesség","családi élet","csapatjáték","döntésképesség","hűség","karrierfejlesztés","képzés, továbbképzés","kezdeményezőkészség","konfliktuskezelés","nyitottság","önállóság","párkapcsolat","pontosság","rátermettség","segítőkészség","vallás","Végösszeg"]
["tesztalany 1",1,1,1,1,1,1,1,1,1,1,1,1,1,1,1,1,1,17]
["tesztalany 10",1,1,1,1,1,1,1,1,1,1,1,1,1,1,1,1,1,17]
["tesztalany 11",1,1,1,1,1,1,1,1,1,1,1,1,1,1,1,1,1,17]
["tesztalany 12",1,1,1,1,1,1,1,1,1,1,1,1,1,1,1,1,1,17]
["tesztalany 13",1,1,1,1,1,1,1,1,1,1,1,1,1,1,1,1,1,17]
["tesztalany 14",1,1,1,1,1,1,1,1,1,1,1,1,1,1,1,1,1,17]
["tesztalany 15",1,1,1,1,1,1,1,1,1,1,1,1,1,1,1,1,1,17]
["tesztalany 16",1,1,1,1,1,1,1,1,1,1,1,1,1,1,1,1,1,17]
["tesztalany 17",1,1,1,1,1,1,1,1,1,1,1,1,1,1,1,1,1,17]
["tesztalany 18",1,1,1,1,1,1,1,1,1,1,1,1,1,1,1,1,1,17]
["tesztalany 19",1,1,1,1,1,1,1,1,1,1,1,1,1,1,1,1,1,17]
["tesztalany 2",1,1,1,1,1,1,1,1,1,1,1,1,1,1,1,1,1,17]
["tesztalany 20",1,1,1,1,1,1,1,1,1,1,1,1,1,1,1,1,1,17]
["tesztalany 21",1,1,1,1,1,1,1,1,1,1,1,1,1,1,1,1,1,17]
["tesztalany 22",1,1,1,1,1,1,1,1,1,1,1,1,1,1,1,1,1,17]
["tesztalany 23",1,1,1,1,1,1,1,1,1,1,1,1,1,1,1,1,1,17]
["tesztalany 24",1,1,1,1,1,1,1,1,1,1,1,1,1,1,1,1,1,17]
["tesztalany 25",1,1,1,1,1,1,1,1,1,1,1,1,1,1,1,1,1,17]
["tesztalany 26",1,1,1,1,1,1,1,1,1,1,1,1,1,1,1,1,1,17]
["tesztalany 27",1,1,1,1,1,1,1,1,1,1,1,1,1,1,1,1,1,17]
["tesztalany 28",1,1,1,1,1,1,1,1,1,1,1,1,1,1,1,1,1,17]
["tesztalany 29",1,1,1,1,1,1,1,1,1,1,1,1,1,1,1,1,1,17]
["tesztalany 3",1,1,1,1,1,1,1,1,1,1,1,1,1,1,1,1,1,17]
["tesztalany 30",1,1,1,1,1,1,1,1,1,1,1,1,1,1,1,1,1,17]
["tesztalany 31",1,1,1,1,1,1,1,1,1,1,1,1,1,1,1,1,1,17]
["tesztalany 32",1,1,1,1,1,1,1,1,1,1,1,1,1,1,1,1,1,17]
["tesztalany 33",1,1,1,1,1,1,1,1,1,1,1,1,1,1,1,1,1,17]
["tesztalany 34",1,1,1,1,1,1,1,1,1,1,1,1,1,1,1,1,1,17]
["tesztalany 35",1,1,1,1,1,1,1,1,1,1,1,1,1,1,1,1,1,17]
["tesztalany 36",1,1,1,1,1,1,1,1,1,1,1,1,1,1,1,1,1,17]
["tesztalany 37",1,1,1,1,1,1,1,1,1,1,1,1,1,1,1,1,1,17]
["tesztalany 38",1,1,1,1,1,1,1,1,1,1,1,1,1,1,1,1,1,17]
["tesztalany 39",1,1,1,1,1,1,1,1,1,1,1,1,1,1,1,1,1,17]
["tesztalany 4",1,1,1,1,1,1,1,1,1,1,1,1,1,1,1,1,1,17]
["tesztalany 40",1,1,1,1,1,1,1,1,1,1,1,1,1,1,1,1,1,17]
["tesztalany 41",1,1,1,1,1,1,1,1,1,1,1,1,1,1,1,1,1,17]
["tesztalany 42",1,1,1,1,1,1,1,1,1,1,1,1,1,1,1,1,1,17]
["tesztalany 43",1,1,1,1,1,1,1,1,1,1,1,1,1,1,1,1,1,17]
["tesztalany 44",1,1,1,1,1,1,1,1,1,1,1,1,1,1,1,1,1,17]
["tesztalany 45",1,1,1,1,1,1,1,1,1,1,1,1,1,1,1,1,1,17]
["tesztalany 46",1,1,1,1,1,1,1,1,1,1,1,1,1,1,1,1,1,17]
["tesztalany 47",1,1,1,1,1,1,1,1,1,1,1,1,1,1,1,1,1,17]
["tesztalany 48",1,1,1,1,1,1,1,1,1,1,1,1,1,1,1,1,1,17]
["tesztalany 49",1,1,1,1,1,1,1,1,1,1,1,1,1,1,1,1,1,17]
["tesztalany 5",1,1,1,1,1,1,1,1,1,1,1,1,1,1,1,1,1,17]
["tesztalany 50",1,1,1,1,1,1,1,1,1,1,1,1,1,1,1,1,1,17]
["tesztalany 6",1,1,1,1,1,1,1,1,1,1,1,1,1,1,1,1,1,17]
["tesztalany 7",1,1,1,1,1,1,1,1,1,1,1,1,1,1,1,1,1,17]
["tesztalany 8",1,1,1,1,1,1,1,1,1,1,1,1,1,1,1,1,1,17]
["tesztalany 9",1,1,1,1,1,1,1,1,1,1,1,1,1,1,1,1,1,17]
["Végösszeg",50,50,50,50,50,50,50,50,50,50,50,50,50,50,50,50,50,850]

{"sheet":"Kimutatás   érték","index":4,"n_rows":57,"n_cols":19,"rows_kept":57,"cut":false,"hidden":false,"merged":[]}
["Mértékegység","pont"]
[]
["Összeg / Érték","Oszlopcímkék"]
["Sorcímkék","alkalmazkodás","becsületesség","családi élet","csapatjáték","döntésképesség","hűség","karrierfejlesztés","képzés, továbbképzés","kezdeményezőkészség","konfliktuskezelés","nyitottság","önállóság","párkapcsolat","pontosság","rátermettség","segítőkészség","vallás","Végösszeg"]
["tesztalany 1",4,5,5,5,4,5,4,5,4,4,5,4,4,5,5,5,5,78]
["tesztalany 10",5,5,5,4,5,5,0,1,5,3,5,5,5,5,4,5,5,72]
["tesztalany 11",4,5,5,4,1,5,3,2,3,5,2,4,4,5,3,5,1,61]
["tesztalany 12",5,5,5,5,5,5,3,3,3,5,5,5,5,5,3,5,0,72]
["tesztalany 13",4,5,5,4,4,5,2,3,3,4,5,5,4,4,3,5,1,66]
["tesztalany 14",4,5,5,4,5,5,0,3,5,5,4,3,5,4,3,5,3,68]
["tesztalany 15",4,4,4,4,4,4,5,1,3,3,4,5,2,3,3,4,3,60]
["tesztalany 16",4,5,5,5,5,5,0,0,5,3,5,5,5,5,3,5,0,65]
["tesztalany 17",3,5,5,3,4,5,4,4,3,3,5,5,5,5,3,4,5,71]
["tesztalany 18",4,4,5,3,3,5,4,1,3,4,4,4,5,3,2,4,2,60]
["tesztalany 19",3,2,4,3,4,4,2,0,2,2,3,3,4,3,2,4,4,49]
["tesztalany 2",5,5,5,5,5,5,2,1,3,4,5,5,2,5,5,5,0,67]
["tesztalany 20",5,5,5,5,4,4,2,3,5,5,5,4,4,5,3,5,1,70]
["tesztalany 21",4,5,5,5,1,5,2,2,5,3,5,5,5,5,3,3,5,68]
["tesztalany 22",5,4,0,3,4,5,0,0,3,4,5,5,5,3,3,3,0,52]
["tesztalany 23",3,5,5,3,4,4,2,4,4,3,4,4,3,4,3,4,1,60]
["tesztalany 24",3,5,4,4,4,4,4,4,4,3,4,3,4,2,2,5,0,59]
["tesztalany 25",3,5,4,4,4,5,1,2,4,3,4,4,3,5,4,5,0,60]
["tesztalany 26",3,5,5,5,5,3,4,4,5,4,5,3,5,4,4,5,0,69]
["tesztalany 27",3,5,5,4,3,5,0,0,5,5,3,3,5,4,3,4,3,60]
["tesztalany 28",4,5,4,4,3,5,1,3,4,3,5,4,2,4,3,5,5,64]
["tesztalany 29",3,5,5,4,3,5,2,2,4,2,3,3,3,4,2,4,3,57]
["tesztalany 3",4,4,3,4,4,4,4,2,3,4,4,5,1,3,3,4,5,61]
["tesztalany 30",5,5,5,5,4,5,5,5,5,5,5,5,5,5,5,5,5,84]
["tesztalany 31",4,5,5,4,5,5,0,2,4,3,4,4,5,4,3,5,0,62]
["tesztalany 32",4,5,4,4,5,5,2,5,3,5,4,4,1,5,4,5,3,68]
["tesztalany 33",4,4,3,4,4,4,1,2,4,3,3,4,4,3,4,4,0,55]
["tesztalany 34",4,4,4,4,5,5,2,1,4,4,4,5,3,4,4,4,0,61]
["tesztalany 35",3,5,5,5,5,5,1,4,5,4,4,4,3,4,4,5,0,66]
["tesztalany 36",4,5,5,4,4,5,2,3,4,4,5,4,4,3,4,4,0,64]
["tesztalany 37",5,5,5,5,4,5,5,5,5,5,5,5,5,5,5,5,5,84]
["tesztalany 38",3,5,5,4,5,4,4,4,5,5,5,5,0,4,3,5,5,71]
["tesztalany 39",3,5,5,4,4,5,0,3,3,4,5,5,5,5,3,5,2,66]
["tesztalany 4",4,5,5,5,3,3,3,5,4,4,5,4,3,5,4,5,5,72]
["tesztalany 40",5,4,5,5,4,5,4,2,4,5,5,5,4,3,4,3,0,67]
["tesztalany 41",2,5,5,5,2,4,3,2,4,3,4,4,4,5,3,4,0,59]
["tesztalany 42",5,4,4,5,2,3,5,5,4,3,5,5,4,3,4,5,0,66]
["tesztalany 43",5,5,5,5,5,5,4,5,5,5,5,5,5,4,5,5,3,81]
["tesztalany 44",4,5,5,4,5,5,4,4,4,4,5,4,4,4,4,5,4,74]
["tesztalany 45",4,5,0,5,5,5,4,5,2,3,3,5,0,4,4,5,0,59]
["tesztalany 46",5,5,3,4,4,4,3,5,3,4,5,5,3,3,3,4,3,66]
["tesztalany 47",4,4,4,3,4,4,3,3,3,3,4,4,4,4,4,4,3,62]
["tesztalany 48",4,4,4,4,3,5,5,4,3,5,4,4,4,4,3,3,2,65]
["tesztalany 49",3,5,5,5,4,5,2,3,3,3,5,4,4,4,3,5,1,64]
["tesztalany 5",2,3,0,4,5,4,5,0,4,3,1,3,0,3,4,4,0,45]
["tesztalany 50",3,4,5,3,5,5,3,2,5,4,5,5,4,4,3,4,1,65]
["tesztalany 6",4,5,5,4,5,5,0,1,4,4,5,4,0,3,4,5,0,58]
["tesztalany 7",3,4,3,4,4,5,5,2,3,4,4,5,4,4,4,5,1,64]
["tesztalany 8",4,5,3,5,2,5,3,3,4,2,4,4,3,4,3,5,3,62]
["tesztalany 9",5,5,0,5,5,5,0,5,5,5,5,5,0,5,5,5,0,65]
["Végösszeg",194,233,210,212,200,232,129,140,194,190,217,216,175,203,175,226,98,3244]
[]
[{"$f":"'Kiinduló adatok'!A56","v":"irány"},0,0,1,1,0,1,0,0,0,0,0,0,1,0,0,0,1]

{"sheet":"Munka2","index":5,"n_rows":0,"n_cols":0,"rows_kept":0,"cut":false,"hidden":true,"merged":[]}

{"sheet":"sorszám-inverz","index":6,"n_rows":161,"n_cols":19,"rows_kept":161,"cut":false,"hidden":false,"merged":[]}
["Összeg / Érték","Oszlopcímkék"]
["Sorcímkék","alkalmazkodás","becsületesség","családi élet","csapatjáték","döntésképesség","hűség","karrierfejlesztés","képzés, továbbképzés","kezdeményezőkészség","konfliktuskezelés","nyitottság","önállóság","párkapcsolat","pontosság","rátermettség","segítőkészség","vallás","Végösszeg"]
["tesztalany 1",4,5,5,5,4,5,4,5,4,4,5,4,4,5,5,5,5,78]
["tesztalany 10",5,5,5,4,5,5,0,1,5,3,5,5,5,5,4,5,5,72]
["tesztalany 11",4,5,5,4,1,5,3,2,3,5,2,4,4,5,3,5,1,61]
["tesztalany 12",5,5,5,5,5,5,3,3,3,5,5,5,5,5,3,5,0,72]
["tesztalany 13",4,5,5,4,4,5,2,3,3,4,5,5,4,4,3,5,1,66]
["tesztalany 14",4,5,5,4,5,5,0,3,5,5,4,3,5,4,3,5,3,68]
["tesztalany 15",4,4,4,4,4,4,5,1,3,3,4,5,2,3,3,4,3,60]
["tesztalany 16",4,5,5,5,5,5,0,0,5,3,5,5,5,5,3,5,0,65]
["tesztalany 17",3,5,5,3,4,5,4,4,3,3,5,5,5,5,3,4,5,71]
["tesztalany 18",4,4,5,3,3,5,4,1,3,4,4,4,5,3,2,4,2,60]
["tesztalany 19",3,2,4,3,4,4,2,0,2,2,3,3,4,3,2,4,4,49]
["tesztalany 2",5,5,5,5,5,5,2,1,3,4,5,5,2,5,5,5,0,67]
["tesztalany 20",5,5,5,5,4,4,2,3,5,5,5,4,4,5,3,5,1,70]
["tesztalany 21",4,5,5,5,1,5,2,2,5,3,5,5,5,5,3,3,5,68]
["tesztalany 22",5,4,0,3,4,5,0,0,3,4,5,5,5,3,3,3,0,52]
["tesztalany 23",3,5,5,3,4,4,2,4,4,3,4,4,3,4,3,4,1,60]
["tesztalany 24",3,5,4,4,4,4,4,4,4,3,4,3,4,2,2,5,0,59]
["tesztalany 25",3,5,4,4,4,5,1,2,4,3,4,4,3,5,4,5,0,60]
["tesztalany 26",3,5,5,5,5,3,4,4,5,4,5,3,5,4,4,5,0,69]
["tesztalany 27",3,5,5,4,3,5,0,0,5,5,3,3,5,4,3,4,3,60]
["tesztalany 28",4,5,4,4,3,5,1,3,4,3,5,4,2,4,3,5,5,64]
["tesztalany 29",3,5,5,4,3,5,2,2,4,2,3,3,3,4,2,4,3,57]
["tesztalany 3",4,4,3,4,4,4,4,2,3,4,4,5,1,3,3,4,5,61]
["tesztalany 30",5,5,5,5,4,5,5,5,5,5,5,5,5,5,5,5,5,84]
["tesztalany 31",4,5,5,4,5,5,0,2,4,3,4,4,5,4,3,5,0,62]
["tesztalany 32",4,5,4,4,5,5,2,5,3,5,4,4,1,5,4,5,3,68]
["tesztalany 33",4,4,3,4,4,4,1,2,4,3,3,4,4,3,4,4,0,55]
["tesztalany 34",4,4,4,4,5,5,2,1,4,4,4,5,3,4,4,4,0,61]
["tesztalany 35",3,5,5,5,5,5,1,4,5,4,4,4,3,4,4,5,0,66]
["tesztalany 36",4,5,5,4,4,5,2,3,4,4,5,4,4,3,4,4,0,64]
["tesztalany 37",5,5,5,5,4,5,5,5,5,5,5,5,5,5,5,5,5,84]
["tesztalany 38",3,5,5,4,5,4,4,4,5,5,5,5,0,4,3,5,5,71]
["tesztalany 39",3,5,5,4,4,5,0,3,3,4,5,5,5,5,3,5,2,66]
["tesztalany 4",4,5,5,5,3,3,3,5,4,4,5,4,3,5,4,5,5,72]
["tesztalany 40",5,4,5,5,4,5,4,2,4,5,5,5,4,3,4,3,0,67]
["tesztalany 41",2,5,5,5,2,4,3,2,4,3,4,4,4,5,3,4,0,59]
["tesztalany 42",5,4,4,5,2,3,5,5,4,3,5,5,4,3,4,5,0,66]
["tesztalany 43",5,5,5,5,5,5,4,5,5,5,5,5,5,4,5,5,3,81]
["tesztalany 44",4,5,5,4,5,5,4,4,4,4,5,4,4,4,4,5,4,74]
["tesztalany 45",4,5,0,5,5,5,4,5,2,3,3,5,0,4,4,5,0,59]
["tesztalany 46",5,5,3,4,4,4,3,5,3,4,5,5,3,3,3,4,3,66]
["tesztalany 47",4,4,4,3,4,4,3,3,3,3,4,4,4,4,4,4,3,62]
["tesztalany 48",4,4,4,4,3,5,5,4,3,5,4,4,4,4,3,3,2,65]
["tesztalany 49",3,5,5,5,4,5,2,3,3,3,5,4,4,4,3,5,1,64]
["tesztalany 5",2,3,0,4,5,4,5,0,4,3,1,3,0,3,4,4,0,45]
["tesztalany 50",3,4,5,3,5,5,3,2,5,4,5,5,4,4,3,4,1,65]
["tesztalany 6",4,5,5,4,5,5,0,1,4,4,5,4,0,3,4,5,0,58]
["tesztalany 7",3,4,3,4,4,5,5,2,3,4,4,5,4,4,4,5,1,64]
["tesztalany 8",4,5,3,5,2,5,3,3,4,2,4,4,3,4,3,5,3,62]
["tesztalany 9",5,5,0,5,5,5,0,5,5,5,5,5,0,5,5,5,0,65]
["Végösszeg",194,233,210,212,200,232,129,140,194,190,217,216,175,203,175,226,98,3244]
[]
["irány",0,0,1,1,0,1,0,0,0,0,0,0,1,0,0,0,1]
[]
["sorszám",{"$f":"B2","v":"alkalmazkodás"},{"$f":"C2","v":"becsületesség"},"családi élet","csapatjáték","döntésképesség","hűség","karrierfejlesztés","képzés, továbbképzés","kezdeményezőkészség","konfliktuskezelés","nyitottság","önállóság","párkapcsolat","pontosság","rátermettség","segítőkészség","vallás","Y"]
[{"$f":"A3","v":"tesztalany 1"},{"$f":"RANK(B3,B$3:B$52,B$55)","v":13},{"$f":"RANK(C3,C$3:C$52,C$55)","v":1},20,32,19,16,8,1,15,14,1,24,19,1,1,1,41,100]
["tesztalany 10",{"$f":"RANK(B4,B$3:B$52,B$55)","v":1},1,20,8,1,16,42,40,1,31,1,1,36,1,7,1,41,100]
["tesztalany 11",{"$f":"RANK(B5,B$3:B$52,B$55)","v":13},1,20,8,49,16,19,29,33,1,49,24,19,1,24,1,20,100]
["tesztalany 12",{"$f":"RANK(B6,B$3:B$52,B$55)","v":1},1,20,32,1,16,19,19,33,1,1,1,36,1,24,1,1,100]
["tesztalany 13",{"$f":"RANK(B7,B$3:B$52,B$55)","v":13},1,20,8,19,16,27,19,33,14,1,1,19,18,24,1,20,100]
["tesztalany 14",{"$f":"RANK(B8,B$3:B$52,B$55)","v":13},1,20,8,1,16,42,19,1,1,28,44,36,18,24,1,30,100]
["tesztalany 15",{"$f":"RANK(B9,B$3:B$52,B$55)","v":13},37,10,8,19,4,1,40,33,31,28,1,8,38,24,31,30,100]
["tesztalany 16",{"$f":"RANK(B10,B$3:B$52,B$55)","v":13},1,20,32,1,16,42,46,1,31,1,1,36,1,24,1,1,100]
["tesztalany 17",{"$f":"RANK(B11,B$3:B$52,B$55)","v":35},1,20,1,19,16,8,11,33,31,1,1,36,1,24,31,41,100]
["tesztalany 18",{"$f":"RANK(B12,B$3:B$52,B$55)","v":13},37,20,1,40,16,8,40,33,14,28,24,36,38,47,31,27,100]
["tesztalany 19",{"$f":"RANK(B13,B$3:B$52,B$55)","v":35},50,10,1,19,4,27,46,49,48,44,44,19,38,47,31,39,100]
["tesztalany 2",{"$f":"RANK(B14,B$3:B$52,B$55)","v":1},1,20,32,1,16,27,40,33,14,1,1,8,1,1,1,1,100]
["tesztalany 20",{"$f":"RANK(B15,B$3:B$52,B$55)","v":1},1,20,32,19,4,27,19,1,1,1,24,19,1,24,1,20,100]
["tesztalany 21",{"$f":"RANK(B16,B$3:B$52,B$55)","v":13},1,20,32,49,16,27,29,1,31,1,1,36,1,24,47,41,100]
["tesztalany 22",{"$f":"RANK(B17,B$3:B$52,B$55)","v":1},37,1,1,19,16,42,46,33,14,1,1,36,38,24,47,1,100]
["tesztalany 23",{"$f":"RANK(B18,B$3:B$52,B$55)","v":35},1,20,1,19,4,27,11,15,31,28,24,11,18,24,31,20,100]
["tesztalany 24",{"$f":"RANK(B19,B$3:B$52,B$55)","v":35},1,10,8,19,4,8,11,15,31,28,44,19,50,47,1,1,100]
["tesztalany 25",{"$f":"RANK(B20,B$3:B$52,B$55)","v":35},1,10,8,19,16,38,29,15,31,28,24,11,1,7,1,1,100]
["tesztalany 26",{"$f":"RANK(B21,B$3:B$52,B$55)","v":35},1,20,32,1,1,8,11,1,14,1,44,36,18,7,1,1,100]
["tesztalany 27",{"$f":"RANK(B22,B$3:B$52,B$55)","v":35},1,20,8,40,16,42,46,1,1,44,44,36,18,24,31,30,100]
["tesztalany 28",{"$f":"RANK(B23,B$3:B$52,B$55)","v":13},1,10,8,40,16,38,19,15,31,1,24,8,18,24,1,41,100]
["tesztalany 29",{"$f":"RANK(B24,B$3:B$52,B$55)","v":35},1,20,8,40,16,27,29,15,48,44,44,11,18,47,31,30,100]
["tesztalany 3",{"$f":"RANK(B25,B$3:B$52,B$55)","v":13},37,5,8,19,4,8,29,33,14,28,1,6,38,24,31,41,100]
["tesztalany 30",{"$f":"RANK(B26,B$3:B$52,B$55)","v":1},1,20,32,19,16,1,1,1,1,1,1,36,1,1,1,41,100]
["tesztalany 31",{"$f":"RANK(B27,B$3:B$52,B$55)","v":13},1,20,8,1,16,42,29,15,31,28,24,36,18,24,1,1,100]
["tesztalany 32",{"$f":"RANK(B28,B$3:B$52,B$55)","v":13},1,10,8,1,16,27,1,33,1,28,24,6,1,7,1,30,100]
["tesztalany 33",{"$f":"RANK(B29,B$3:B$52,B$55)","v":13},37,5,8,19,4,38,29,15,31,44,24,19,38,7,31,1,100]
["tesztalany 34",{"$f":"RANK(B30,B$3:B$52,B$55)","v":13},37,10,8,1,16,27,40,15,14,28,1,11,18,7,31,1,100]
["tesztalany 35",{"$f":"RANK(B31,B$3:B$52,B$55)","v":35},1,20,32,1,16,38,11,1,14,28,24,11,18,7,1,1,100]
["tesztalany 36",{"$f":"RANK(B32,B$3:B$52,B$55)","v":13},1,20,8,19,16,27,19,15,14,1,24,19,38,7,31,1,100]
["tesztalany 37",{"$f":"RANK(B33,B$3:B$52,B$55)","v":1},1,20,32,19,16,1,1,1,1,1,1,36,1,1,1,41,100]
["tesztalany 38",{"$f":"RANK(B34,B$3:B$52,B$55)","v":35},1,20,8,1,4,8,11,1,1,1,1,1,18,24,1,41,100]
[{"$f":"A35","v":"tesztalany 39"},{"$f":"RANK(B35,B$3:B$52,B$55)","v":35},1,20,8,19,16,42,19,33,14,1,1,36,1,24,1,27,100]
["tesztalany 4",{"$f":"RANK(B36,B$3:B$52,B$55)","v":13},1,20,32,40,1,19,1,15,14,1,24,11,1,7,1,41,100]
["tesztalany 40",{"$f":"RANK(B37,B$3:B$52,B$55)","v":1},37,20,32,19,16,8,29,15,1,1,1,19,38,7,47,1,100]
["tesztalany 41",{"$f":"RANK(B38,B$3:B$52,B$55)","v":49},1,20,32,46,4,19,29,15,31,28,24,19,1,24,31,1,100]
["tesztalany 42",{"$f":"RANK(B39,B$3:B$52,B$55)","v":1},37,10,32,46,1,1,1,15,31,1,1,19,38,7,1,1,100]
["tesztalany 43",{"$f":"RANK(B40,B$3:B$52,B$55)","v":1},1,20,32,1,16,8,1,1,1,1,1,36,18,1,1,30,100]
["tesztalany 44",{"$f":"RANK(B41,B$3:B$52,B$55)","v":13},1,20,8,1,16,8,11,15,14,1,24,19,18,7,1,39,100]
["tesztalany 45",{"$f":"RANK(B42,B$3:B$52,B$55)","v":13},1,1,32,1,16,8,1,49,31,44,1,1,18,7,1,1,100]
["tesztalany 46",{"$f":"RANK(B43,B$3:B$52,B$55)","v":1},1,5,8,19,4,19,1,33,14,1,1,11,38,24,31,30,100]
["tesztalany 47",{"$f":"RANK(B44,B$3:B$52,B$55)","v":13},37,10,1,19,4,19,19,33,31,28,24,19,18,7,31,30,100]
["tesztalany 48",{"$f":"RANK(B45,B$3:B$52,B$55)","v":13},37,10,8,40,16,1,11,33,1,28,24,19,18,24,47,27,100]
["tesztalany 49",{"$f":"RANK(B46,B$3:B$52,B$55)","v":35},1,20,32,19,16,27,19,33,31,1,24,19,18,24,1,20,100]
["tesztalany 5",{"$f":"RANK(B47,B$3:B$52,B$55)","v":49},49,1,8,1,4,1,46,15,31,50,44,1,38,7,31,1,100]
["tesztalany 50",{"$f":"RANK(B48,B$3:B$52,B$55)","v":35},37,20,1,1,16,19,29,1,14,1,1,19,18,24,31,20,100]
["tesztalany 6",{"$f":"RANK(B49,B$3:B$52,B$55)","v":13},1,20,8,1,16,42,40,15,14,1,24,1,38,7,1,1,100]
["tesztalany 7",{"$f":"RANK(B50,B$3:B$52,B$55)","v":35},37,5,8,19,16,1,29,33,14,28,1,19,18,7,1,20,100]
["tesztalany 8",{"$f":"RANK(B51,B$3:B$52,B$55)","v":13},1,5,32,46,16,19,19,15,48,28,24,11,18,24,1,30,100]
["tesztalany 9",{"$f":"RANK(B52,B$3:B$52,B$55)","v":1},1,1,32,1,16,42,1,1,1,1,1,1,1,1,1,1,100]
[]
["inverz",{"$f":"B2","v":"alkalmazkodás"},{"$f":"C2","v":"becsületesség"},"családi élet","csapatjáték","döntésképesség","hűség","karrierfejlesztés","képzés, továbbképzés","kezdeményezőkészség","konfliktuskezelés","nyitottság","önállóság","párkapcsolat","pontosság","rátermettség","segítőkészség","vallás"]
[{"$f":"A58","v":"tesztalany 1"},{"$f":"RANK(B58,B$58:B$107,0)","v":17},{"$f":"RANK(C58,C$58:C$107,0)","v":15},1,1,12,1,33,41,19,21,24,8,16,34,45,21,1,100]
[{"$f":"A59","v":"tesztalany 10"},39,{"$f":"RANK(C59,C$58:C$107,0)","v":15},1,20,33,1,1,6,37,4,24,28,1,34,28,21,1,100]
["tesztalany 11",17,{"$f":"RANK(C60,C$58:C$107,0)","v":15},1,20,1,1,25,12,3,38,2,8,16,34,5,21,25,100]
["tesztalany 12",39,{"$f":"RANK(C61,C$58:C$107,0)","v":15},1,1,33,1,25,23,3,38,24,28,1,34,5,21,32,100]
["tesztalany 13",17,{"$f":"RANK(C62,C$58:C$107,0)","v":15},1,20,12,1,14,23,3,21,24,28,16,14,5,21,25,100]
["tesztalany 14",17,{"$f":"RANK(C63,C$58:C$107,0)","v":15},1,20,33,1,1,23,37,38,8,1,1,14,5,21,13,100]
["tesztalany 15",17,{"$f":"RANK(C64,C$58:C$107,0)","v":3},32,20,12,36,44,6,3,4,8,28,41,2,5,5,13,100]
["tesztalany 16",17,{"$f":"RANK(C65,C$58:C$107,0)","v":15},1,1,33,1,1,1,37,4,24,28,1,34,5,21,32,100]
["tesztalany 17",3,{"$f":"RANK(C66,C$58:C$107,0)","v":15},1,44,12,1,33,33,3,4,24,28,1,34,5,5,1,100]
["tesztalany 18",17,{"$f":"RANK(C67,C$58:C$107,0)","v":3},1,44,6,1,33,6,3,21,8,8,1,2,1,5,22,100]
["tesztalany 19",3,{"$f":"RANK(C68,C$58:C$107,0)","v":1},32,44,12,36,14,1,1,1,3,1,16,2,1,5,11,100]
["tesztalany 2",39,{"$f":"RANK(C69,C$58:C$107,0)","v":15},1,1,33,1,14,6,3,21,24,28,41,34,45,21,32,100]
["tesztalany 20",39,{"$f":"RANK(C70,C$58:C$107,0)","v":15},1,1,12,36,14,23,37,38,24,8,16,34,5,21,25,100]
["tesztalany 21",17,{"$f":"RANK(C71,C$58:C$107,0)","v":15},1,1,1,1,14,12,37,4,24,28,1,34,5,1,1,100]
["tesztalany 22",39,{"$f":"RANK(C72,C$58:C$107,0)","v":3},47,44,12,1,1,1,3,21,24,28,1,2,5,1,32,100]
["tesztalany 23",3,{"$f":"RANK(C73,C$58:C$107,0)","v":15},1,44,12,36,14,33,19,4,8,8,33,14,5,5,25,100]
["tesztalany 24",3,{"$f":"RANK(C74,C$58:C$107,0)","v":15},32,20,12,36,33,33,19,4,8,1,16,1,1,21,32,100]
["tesztalany 25",3,{"$f":"RANK(C75,C$58:C$107,0)","v":15},32,20,12,1,10,12,19,4,8,8,33,34,28,21,32,100]
["tesztalany 26",3,{"$f":"RANK(C76,C$58:C$107,0)","v":15},1,1,33,48,33,33,37,21,24,1,1,14,28,21,32,100]
["tesztalany 27",3,{"$f":"RANK(C77,C$58:C$107,0)","v":15},1,20,6,1,1,1,37,38,3,1,1,14,5,5,13,100]
["tesztalany 28",17,{"$f":"RANK(C78,C$58:C$107,0)","v":15},32,20,6,1,10,23,19,4,24,8,41,14,5,21,1,100]
["tesztalany 29",3,{"$f":"RANK(C79,C$58:C$107,0)","v":15},1,20,6,1,14,12,19,1,3,1,33,14,1,5,13,100]
["tesztalany 3",17,{"$f":"RANK(C80,C$58:C$107,0)","v":3},42,20,12,36,33,12,3,21,8,28,44,2,5,5,1,100]
["tesztalany 30",39,{"$f":"RANK(C81,C$58:C$107,0)","v":15},1,1,12,1,44,41,37,38,24,28,1,34,45,21,1,100]
["tesztalany 31",17,{"$f":"RANK(C82,C$58:C$107,0)","v":15},1,20,33,1,1,12,19,4,8,8,1,14,5,21,32,100]
["tesztalany 32",17,{"$f":"RANK(C83,C$58:C$107,0)","v":15},32,20,33,1,14,41,3,38,8,8,44,34,28,21,13,100]
["tesztalany 33",17,{"$f":"RANK(C84,C$58:C$107,0)","v":3},42,20,12,36,10,12,19,4,3,8,16,2,28,5,32,100]
["tesztalany 34",17,{"$f":"RANK(C85,C$58:C$107,0)","v":3},32,20,33,1,14,6,19,21,8,28,33,14,28,5,32,100]
["tesztalany 35",3,{"$f":"RANK(C86,C$58:C$107,0)","v":15},1,1,33,1,10,33,37,21,8,8,33,14,28,21,32,100]
["tesztalany 36",17,{"$f":"RANK(C87,C$58:C$107,0)","v":15},1,20,12,1,14,23,19,21,24,8,16,2,28,5,32,100]
["tesztalany 37",39,{"$f":"RANK(C88,C$58:C$107,0)","v":15},1,1,12,1,44,41,37,38,24,28,1,34,45,21,1,100]
["tesztalany 38",3,{"$f":"RANK(C89,C$58:C$107,0)","v":15},1,20,33,36,33,33,37,38,24,28,46,14,5,21,1,100]
["tesztalany 39",{"$f":"RANK(B90,B$58:B$107,0)","v":3},{"$f":"RANK(C90,C$58:C$107,0)","v":15},1,20,12,1,1,23,3,21,24,28,1,34,5,21,22,100]
["tesztalany 4",17,{"$f":"RANK(C91,C$58:C$107,0)","v":15},1,1,6,48,25,41,19,21,24,8,33,34,28,21,1,100]
["tesztalany 40",39,{"$f":"RANK(C92,C$58:C$107,0)","v":3},1,1,12,1,33,12,19,38,24,28,16,2,28,1,32,100]
["tesztalany 41",1,{"$f":"RANK(C93,C$58:C$107,0)","v":15},1,1,3,36,25,12,19,4,8,8,16,34,5,5,32,100]
["tesztalany 42",39,{"$f":"RANK(C94,C$58:C$107,0)","v":3},32,1,3,48,44,41,19,4,24,28,16,2,28,21,32,100]
["tesztalany 43",39,{"$f":"RANK(C95,C$58:C$107,0)","v":15},1,1,33,1,33,41,37,38,24,28,1,14,45,21,13,100]
["tesztalany 44",17,{"$f":"RANK(C96,C$58:C$107,0)","v":15},1,20,33,1,33,33,19,21,24,8,16,14,28,21,11,100]
["tesztalany 45",17,{"$f":"RANK(C97,C$58:C$107,0)","v":15},47,1,33,1,33,41,1,4,3,28,46,14,28,21,32,100]
["tesztalany 46",39,{"$f":"RANK(C98,C$58:C$107,0)","v":15},42,20,12,36,25,41,3,21,24,28,33,2,5,5,13,100]
["tesztalany 47",17,{"$f":"RANK(C99,C$58:C$107,0)","v":3},32,44,12,36,25,23,3,4,8,8,16,14,28,5,13,100]
["tesztalany 48",17,{"$f":"RANK(C100,C$58:C$107,0)","v":3},32,20,6,1,44,33,3,38,8,8,16,14,5,1,22,100]
["tesztalany 49",3,{"$f":"RANK(C101,C$58:C$107,0)","v":15},1,1,12,1,14,23,3,4,24,8,16,14,5,21,25,100]
["tesztalany 5",1,{"$f":"RANK(C102,C$58:C$107,0)","v":2},47,20,33,36,44,1,19,4,1,1,46,2,28,5,32,100]
["tesztalany 50",3,{"$f":"RANK(C103,C$58:C$107,0)","v":3},1,44,33,1,25,12,37,21,24,28,16,14,5,5,25,100]
["tesztalany 6",17,{"$f":"RANK(C104,C$58:C$107,0)","v":15},1,20,33,1,1,6,19,21,24,8,46,2,28,21,32,100]
["tesztalany 7",3,{"$f":"RANK(C105,C$58:C$107,0)","v":3},42,20,12,1,44,12,3,21,8,28,16,14,28,21,25,100]
["tesztalany 8",17,{"$f":"RANK(C106,C$58:C$107,0)","v":15},42,1,3,1,25,23,19,1,8,8,33,14,5,21,13,100]
["tesztalany 9",39,{"$f":"RANK(C107,C$58:C$107,0)","v":15},47,1,33,1,1,41,37,38,24,28,46,34,45,21,32,100]
[]
["súly",5,4,3,3,5,4,5,4,4,3,4,5,2,4,5,4,1]

{"sheet":"COCO","index":7,"n_rows":210,"n_cols":23,"rows_kept":210,"cut":false,"hidden":false,"merged":[]}
["Azonosító:","Teszt","Objektumok:",50,"Attribútumok:",17,"Lepcsők:",50,"Eltolás:",0,"Leírás:","COCO Y0: Teszt"]
[]
["Rangsor","X(A1)","X(A2)","X(A3)","X(A4)","X(A5)","X(A6)","X(A7)","X(A8)","X(A9)","X(A10)","X(A11)","X(A12)","X(A13)","X(A14)","X(A15)","X(A16)","X(A17)","Y(A18)"]
["O1",13,1,20,32,19,16,8,1,15,14,1,24,19,1,1,1,41,1000000]
["O2",1,1,20,8,1,16,42,40,1,31,1,1,36,1,7,1,41,1000000]
["O3",13,1,20,8,49,16,19,29,33,1,49,24,19,1,24,1,20,1000000]
["O4",1,1,20,32,1,16,19,19,33,1,1,1,36,1,24,1,1,1000000]
["O5",13,1,20,8,19,16,27,19,33,14,1,1,19,18,24,1,20,1000000]
["O6",13,1,20,8,1,16,42,19,1,1,28,44,36,18,24,1,30,1000000]
["O7",13,37,10,8,19,4,1,40,33,31,28,1,8,38,24,31,30,1000000]
["O8",13,1,20,32,1,16,42,46,1,31,1,1,36,1,24,1,1,1000000]
["O9",35,1,20,1,19,16,8,11,33,31,1,1,36,1,24,31,41,1000000]
["O10",13,37,20,1,40,16,8,40,33,14,28,24,36,38,47,31,27,1000000]
["O11",35,50,10,1,19,4,27,46,49,48,44,44,19,38,47,31,39,1000000]
["O12",1,1,20,32,1,16,27,40,33,14,1,1,8,1,1,1,1,1000000]
["O13",1,1,20,32,19,4,27,19,1,1,1,24,19,1,24,1,20,1000000]
["O14",13,1,20,32,49,16,27,29,1,31,1,1,36,1,24,47,41,1000000]
["O15",1,37,1,1,19,16,42,46,33,14,1,1,36,38,24,47,1,1000000]
["O16",35,1,20,1,19,4,27,11,15,31,28,24,11,18,24,31,20,1000000]
["O17",35,1,10,8,19,4,8,11,15,31,28,44,19,50,47,1,1,1000000]
["O18",35,1,10,8,19,16,38,29,15,31,28,24,11,1,7,1,1,1000000]
["O19",35,1,20,32,1,1,8,11,1,14,1,44,36,18,7,1,1,1000000]
["O20",35,1,20,8,40,16,42,46,1,1,44,44,36,18,24,31,30,1000000]
["O21",13,1,10,8,40,16,38,19,15,31,1,24,8,18,24,1,41,1000000]
["O22",35,1,20,8,40,16,27,29,15,48,44,44,11,18,47,31,30,1000000]
["O23",13,37,5,8,19,4,8,29,33,14,28,1,6,38,24,31,41,1000000]
["O24",1,1,20,32,19,16,1,1,1,1,1,1,36,1,1,1,41,1000000]
["O25",13,1,20,8,1,16,42,29,15,31,28,24,36,18,24,1,1,1000000]
["O26",13,1,10,8,1,16,27,1,33,1,28,24,6,1,7,1,30,1000000]
["O27",13,37,5,8,19,4,38,29,15,31,44,24,19,38,7,31,1,1000000]
["O28",13,37,10,8,1,16,27,40,15,14,28,1,11,18,7,31,1,1000000]
["O29",35,1,20,32,1,16,38,11,1,14,28,24,11,18,7,1,1,1000000]
["O30",13,1,20,8,19,16,27,19,15,14,1,24,19,38,7,31,1,1000000]
["O31",1,1,20,32,19,16,1,1,1,1,1,1,36,1,1,1,41,1000000]
["O32",35,1,20,8,1,4,8,11,1,1,1,1,1,18,24,1,41,1000000]
["O33",35,1,20,8,19,16,42,19,33,14,1,1,36,1,24,1,27,1000000]
["O34",13,1,20,32,40,1,19,1,15,14,1,24,11,1,7,1,41,1000000]
["O35",1,37,20,32,19,16,8,29,15,1,1,1,19,38,7,47,1,1000000]
["O36",49,1,20,32,46,4,19,29,15,31,28,24,19,1,24,31,1,1000000]
["O37",1,37,10,32,46,1,1,1,15,31,1,1,19,38,7,1,1,1000000]
["O38",1,1,20,32,1,16,8,1,1,1,1,1,36,18,1,1,30,1000000]
["O39",13,1,20,8,1,16,8,11,15,14,1,24,19,18,7,1,39,1000000]
["O40",13,1,1,32,1,16,8,1,49,31,44,1,1,18,7,1,1,1000000]
["O41",1,1,5,8,19,4,19,1,33,14,1,1,11,38,24,31,30,1000000]
["O42",13,37,10,1,19,4,19,19,33,31,28,24,19,18,7,31,30,1000000]
["O43",13,37,10,8,40,16,1,11,33,1,28,24,19,18,24,47,27,1000000]
["O44",35,1,20,32,19,16,27,19,33,31,1,24,19,18,24,1,20,1000000]
["O45",49,49,1,8,1,4,1,46,15,31,50,44,1,38,7,31,1,1000000]
["O46",35,37,20,1,1,16,19,29,1,14,1,1,19,18,24,31,20,1000000]
["O47",13,1,20,8,1,16,42,40,15,14,1,24,1,38,7,1,1,1000000]
["O48",35,37,5,8,19,16,1,29,33,14,28,1,19,18,7,1,20,1000000]
["O49",13,1,5,32,46,16,19,19,15,48,28,24,11,18,24,1,30,1000000]
["O50",1,1,1,32,1,16,42,1,1,1,1,1,1,1,1,1,1,1000000]
[]
["Lépcsők(1)","X(A1)","X(A2)","X(A3)","X(A4)","X(A5)","X(A6)","X(A7)","X(A8)","X(A9)","X(A10)","X(A11)","X(A12)","X(A13)","X(A14)","X(A15)","X(A16)","X(A17)"]
["S1","(0+26.9)/(1)=26.9","(0+26.9)/(1)=26.9","(0+26.9)/(1)=26.9","(0+26.9)/(1)=26.9","(0+26.9)/(1)=26.9","(0+26.9)/(1)=26.9","(0+26.9)/(1)=26.9","(0+26.9)/(1)=26.9","(0+26.9)/(1)=26.9","(0+26.9)/(1)=26.9","(0+26.9)/(1)=26.9","(0+26.9)/(1)=26.9","(0+26.9)/(1)=26.9","(0+26.9)/(1)=26.9","(0+26.9)/(1)=26.9","(0+26.9)/(1)=26.9","(0+26.9)/(1)=26.9"]
["S2","(0+26.4)/(1)=26.4","(0+26.4)/(1)=26.4","(0+26.4)/(1)=26.4","(0+26.4)/(1)=26.4","(0+26.4)/(1)=26.4","(0+26.4)/(1)=26.4","(0+26.4)/(1)=26.4","(0+26.4)/(1)=26.4","(0+26.4)/(1)=26.4","(0+26.4)/(1)=26.4","(0+26.4)/(1)=26.4","(0+26.4)/(1)=26.4","(0+26.4)/(1)=26.4","(0+26.4)/(1)=26.4","(0+26.4)/(1)=26.4","(0+26.4)/(1)=26.4","(0+26.4)/(1)=26.4"]
["S3","(0+25.8)/(1)=25.8","(0+25.8)/(1)=25.8","(0+25.8)/(1)=25.8","(0+25.8)/(1)=25.8","(0+25.8)/(1)=25.8","(0+25.8)/(1)=25.8","(0+25.8)/(1)=25.8","(0+25.8)/(1)=25.8","(0+25.8)/(1)=25.8","(0+25.8)/(1)=25.8","(0+25.8)/(1)=25.8","(0+25.8)/(1)=25.8","(0+25.8)/(1)=25.8","(0+25.8)/(1)=25.8","(0+25.8)/(1)=25.8","(0+25.8)/(1)=25.8","(0+25.8)/(1)=25.8"]
["S4","(0+25.3)/(1)=25.3","(0+25.3)/(1)=25.3","(0+25.3)/(1)=25.3","(0+25.3)/(1)=25.3","(0+25.3)/(1)=25.3","(0+25.3)/(1)=25.3","(0+25.3)/(1)=25.3","(0+25.3)/(1)=25.3","(0+25.3)/(1)=25.3","(0+25.3)/(1)=25.3","(0+25.3)/(1)=25.3","(0+25.3)/(1)=25.3","(0+25.3)/(1)=25.3","(0+25.3)/(1)=25.3","(0+25.3)/(1)=25.3","(0+25.3)/(1)=25.3","(0+25.3)/(1)=25.3"]
["S5","(0+24.7)/(1)=24.7","(0+24.7)/(1)=24.7","(0+24.7)/(1)=24.7","(0+24.7)/(1)=24.7","(0+24.7)/(1)=24.7","(0+24.7)/(1)=24.7","(0+24.7)/(1)=24.7","(0+24.7)/(1)=24.7","(0+24.7)/(1)=24.7","(0+24.7)/(1)=24.7","(0+24.7)/(1)=24.7","(0+24.7)/(1)=24.7","(0+24.7)/(1)=24.7","(0+24.7)/(1)=24.7","(0+24.7)/(1)=24.7","(0+24.7)/(1)=24.7","(0+24.7)/(1)=24.7"]
["S6","(0+24.2)/(1)=24.2","(0+24.2)/(1)=24.2","(0+24.2)/(1)=24.2","(0+24.2)/(1)=24.2","(0+24.2)/(1)=24.2","(0+24.2)/(1)=24.2","(0+24.2)/(1)=24.2","(0+24.2)/(1)=24.2","(0+24.2)/(1)=24.2","(0+24.2)/(1)=24.2","(0+24.2)/(1)=24.2","(0+24.2)/(1)=24.2","(0+24.2)/(1)=24.2","(0+24.2)/(1)=24.2","(0+24.2)/(1)=24.2","(0+24.2)/(1)=24.2","(0+24.2)/(1)=24.2"]
["S7","(0+23.6)/(1)=23.6","(0+23.6)/(1)=23.6","(0+23.6)/(1)=23.6","(0+23.6)/(1)=23.6","(0+23.6)/(1)=23.6","(0+23.6)/(1)=23.6","(0+23.6)/(1)=23.6","(0+23.6)/(1)=23.6","(0+23.6)/(1)=23.6","(0+23.6)/(1)=23.6","(0+23.6)/(1)=23.6","(0+23.6)/(1)=23.6","(0+23.6)/(1)=23.6","(0+23.6)/(1)=23.6","(0+23.6)/(1)=23.6","(0+23.6)/(1)=23.6","(0+23.6)/(1)=23.6"]
["S8","(0+23.1)/(1)=23.1","(0+23.1)/(1)=23.1","(0+23.1)/(1)=23.1","(0+23.1)/(1)=23.1","(0+23.1)/(1)=23.1","(0+23.1)/(1)=23.1","(0+23.1)/(1)=23.1","(0+23.1)/(1)=23.1","(0+23.1)/(1)=23.1","(0+23.1)/(1)=23.1","(0+23.1)/(1)=23.1","(0+23.1)/(1)=23.1","(0+23.1)/(1)=23.1","(0+23.1)/(1)=23.1","(0+23.1)/(1)=23.1","(0+23.1)/(1)=23.1","(0+23.1)/(1)=23.1"]
["S9","(0+22.5)/(1)=22.5","(0+22.5)/(1)=22.5","(0+22.5)/(1)=22.5","(0+22.5)/(1)=22.5","(0+22.5)/(1)=22.5","(0+22.5)/(1)=22.5","(0+22.5)/(1)=22.5","(0+22.5)/(1)=22.5","(0+22.5)/(1)=22.5","(0+22.5)/(1)=22.5","(0+22.5)/(1)=22.5","(0+22.5)/(1)=22.5","(0+22.5)/(1)=22.5","(0+22.5)/(1)=22.5","(0+22.5)/(1)=22.5","(0+22.5)/(1)=22.5","(0+22.5)/(1)=22.5"]
["S10","(0+22)/(1)=22","(0+22)/(1)=22","(0+22)/(1)=22","(0+22)/(1)=22","(0+22)/(1)=22","(0+22)/(1)=22","(0+22)/(1)=22","(0+22)/(1)=22","(0+22)/(1)=22","(0+22)/(1)=22","(0+22)/(1)=22","(0+22)/(1)=22","(0+22)/(1)=22","(0+22)/(1)=22","(0+22)/(1)=22","(0+22)/(1)=22","(0+22)/(1)=22"]
["S11","(0+21.4)/(1)=21.4","(0+21.4)/(1)=21.4","(0+21.4)/(1)=21.4","(0+21.4)/(1)=21.4","(0+21.4)/(1)=21.4","(0+21.4)/(1)=21.4","(0+21.4)/(1)=21.4","(0+21.4)/(1)=21.4","(0+21.4)/(1)=21.4","(0+21.4)/(1)=21.4","(0+21.4)/(1)=21.4","(0+21.4)/(1)=21.4","(0+21.4)/(1)=21.4","(0+21.4)/(1)=21.4","(0+21.4)/(1)=21.4","(0+21.4)/(1)=21.4","(0+21.4)/(1)=21.4"]
["S12","(0+20.9)/(1)=20.9","(0+20.9)/(1)=20.9","(0+20.9)/(1)=20.9","(0+20.9)/(1)=20.9","(0+20.9)/(1)=20.9","(0+20.9)/(1)=20.9","(0+20.9)/(1)=20.9","(0+20.9)/(1)=20.9","(0+20.9)/(1)=20.9","(0+20.9)/(1)=20.9","(0+20.9)/(1)=20.9","(0+20.9)/(1)=20.9","(0+20.9)/(1)=20.9","(0+20.9)/(1)=20.9","(0+20.9)/(1)=20.9","(0+20.9)/(1)=20.9","(0+20.9)/(1)=20.9"]
["S13","(0+20.3)/(1)=20.3","(0+20.3)/(1)=20.3","(0+20.3)/(1)=20.3","(0+20.3)/(1)=20.3","(0+20.3)/(1)=20.3","(0+20.3)/(1)=20.3","(0+20.3)/(1)=20.3","(0+20.3)/(1)=20.3","(0+20.3)/(1)=20.3","(0+20.3)/(1)=20.3","(0+20.3)/(1)=20.3","(0+20.3)/(1)=20.3","(0+20.3)/(1)=20.3","(0+20.3)/(1)=20.3","(0+20.3)/(1)=20.3","(0+20.3)/(1)=20.3","(0+20.3)/(1)=20.3"]
["S14","(0+19.8)/(1)=19.8","(0+19.8)/(1)=19.8","(0+19.8)/(1)=19.8","(0+19.8)/(1)=19.8","(0+19.8)/(1)=19.8","(0+19.8)/(1)=19.8","(0+19.8)/(1)=19.8","(0+19.8)/(1)=19.8","(0+19.8)/(1)=19.8","(0+19.8)/(1)=19.8","(0+19.8)/(1)=19.8","(0+19.8)/(1)=19.8","(0+19.8)/(1)=19.8","(0+19.8)/(1)=19.8","(0+19.8)/(1)=19.8","(0+19.8)/(1)=19.8","(0+19.8)/(1)=19.8"]
["S15","(0+19.2)/(1)=19.2","(0+19.2)/(1)=19.2","(0+19.2)/(1)=19.2","(0+19.2)/(1)=19.2","(0+19.2)/(1)=19.2","(0+19.2)/(1)=19.2","(0+19.2)/(1)=19.2","(0+19.2)/(1)=19.2","(0+19.2)/(1)=19.2","(0+19.2)/(1)=19.2","(0+19.2)/(1)=19.2","(0+19.2)/(1)=19.2","(0+19.2)/(1)=19.2","(0+19.2)/(1)=19.2","(0+19.2)/(1)=19.2","(0+19.2)/(1)=19.2","(0+19.2)/(1)=19.2"]
["S16","(0+18.7)/(1)=18.7","(0+18.7)/(1)=18.7","(0+18.7)/(1)=18.7","(0+18.7)/(1)=18.7","(0+18.7)/(1)=18.7","(0+18.7)/(1)=18.7","(0+18.7)/(1)=18.7","(0+18.7)/(1)=18.7","(0+18.7)/(1)=18.7","(0+18.7)/(1)=18.7","(0+18.7)/(1)=18.7","(0+18.7)/(1)=18.7","(0+18.7)/(1)=18.7","(0+18.7)/(1)=18.7","(0+18.7)/(1)=18.7","(0+18.7)/(1)=18.7","(0+18.7)/(1)=18.7"]
["S17","(0+18.1)/(1)=18.1","(0+18.1)/(1)=18.1","(0+18.1)/(1)=18.1","(0+18.1)/(1)=18.1","(0+18.1)/(1)=18.1","(0+18.1)/(1)=18.1","(0+18.1)/(1)=18.1","(0+18.1)/(1)=18.1","(0+18.1)/(1)=18.1","(0+18.1)/(1)=18.1","(0+18.1)/(1)=18.1","(0+18.1)/(1)=18.1","(0+18.1)/(1)=18.1","(0+18.1)/(1)=18.1","(0+18.1)/(1)=18.1","(0+18.1)/(1)=18.1","(0+18.1)/(1)=18.1"]
["S18","(0+17.6)/(1)=17.6","(0+17.6)/(1)=17.6","(0+17.6)/(1)=17.6","(0+17.6)/(1)=17.6","(0+17.6)/(1)=17.6","(0+17.6)/(1)=17.6","(0+17.6)/(1)=17.6","(0+17.6)/(1)=17.6","(0+17.6)/(1)=17.6","(0+17.6)/(1)=17.6","(0+17.6)/(1)=17.6","(0+17.6)/(1)=17.6","(0+17.6)/(1)=17.6","(0+17.6)/(1)=17.6","(0+17.6)/(1)=17.6","(0+17.6)/(1)=17.6","(0+17.6)/(1)=17.6"]
["S19","(0+17)/(1)=17","(0+17)/(1)=17","(0+17)/(1)=17","(0+17)/(1)=17","(0+17)/(1)=17","(0+17)/(1)=17","(0+17)/(1)=17","(0+17)/(1)=17","(0+17)/(1)=17","(0+17)/(1)=17","(0+17)/(1)=17","(0+17)/(1)=17","(0+17)/(1)=17","(0+17)/(1)=17","(0+17)/(1)=17","(0+17)/(1)=17","(0+17)/(1)=17"]
["S20","(0+16.5)/(1)=16.5","(0+16.5)/(1)=16.5","(0+16.5)/(1)=16.5","(0+16.5)/(1)=16.5","(0+16.5)/(1)=16.5","(0+16.5)/(1)=16.5","(0+16.5)/(1)=16.5","(0+16.5)/(1)=16.5","(0+16.5)/(1)=16.5","(0+16.5)/(1)=16.5","(0+16.5)/(1)=16.5","(0+16.5)/(1)=16.5","(0+16.5)/(1)=16.5","(0+16.5)/(1)=16.5","(0+16.5)/(1)=16.5","(0+16.5)/(1)=16.5","(0+16.5)/(1)=16.5"]
["S21","(0+15.9)/(1)=15.9","(0+15.9)/(1)=15.9","(0+15.9)/(1)=15.9","(0+15.9)/(1)=15.9","(0+15.9)/(1)=15.9","(0+15.9)/(1)=15.9","(0+15.9)/(1)=15.9","(0+15.9)/(1)=15.9","(0+15.9)/(1)=15.9","(0+15.9)/(1)=15.9","(0+15.9)/(1)=15.9","(0+15.9)/(1)=15.9","(0+15.9)/(1)=15.9","(0+15.9)/(1)=15.9","(0+15.9)/(1)=15.9","(0+15.9)/(1)=15.9","(0+15.9)/(1)=15.9"]
["S22","(0+15.4)/(1)=15.4","(0+15.4)/(1)=15.4","(0+15.4)/(1)=15.4","(0+15.4)/(1)=15.4","(0+15.4)/(1)=15.4","(0+15.4)/(1)=15.4","(0+15.4)/(1)=15.4","(0+15.4)/(1)=15.4","(0+15.4)/(1)=15.4","(0+15.4)/(1)=15.4","(0+15.4)/(1)=15.4","(0+15.4)/(1)=15.4","(0+15.4)/(1)=15.4","(0+15.4)/(1)=15.4","(0+15.4)/(1)=15.4","(0+15.4)/(1)=15.4","(0+15.4)/(1)=15.4"]
["S23","(0+14.8)/(1)=14.8","(0+14.8)/(1)=14.8","(0+14.8)/(1)=14.8","(0+14.8)/(1)=14.8","(0+14.8)/(1)=14.8","(0+14.8)/(1)=14.8","(0+14.8)/(1)=14.8","(0+14.8)/(1)=14.8","(0+14.8)/(1)=14.8","(0+14.8)/(1)=14.8","(0+14.8)/(1)=14.8","(0+14.8)/(1)=14.8","(0+14.8)/(1)=14.8","(0+14.8)/(1)=14.8","(0+14.8)/(1)=14.8","(0+14.8)/(1)=14.8","(0+14.8)/(1)=14.8"]
["S24","(0+14.3)/(1)=14.3","(0+14.3)/(1)=14.3","(0+14.3)/(1)=14.3","(0+14.3)/(1)=14.3","(0+14.3)/(1)=14.3","(0+14.3)/(1)=14.3","(0+14.3)/(1)=14.3","(0+14.3)/(1)=14.3","(0+14.3)/(1)=14.3","(0+14.3)/(1)=14.3","(0+14.3)/(1)=14.3","(0+14.3)/(1)=14.3","(0+14.3)/(1)=14.3","(0+14.3)/(1)=14.3","(0+14.3)/(1)=14.3","(0+14.3)/(1)=14.3","(0+14.3)/(1)=14.3"]
["S25","(0+13.7)/(1)=13.7","(0+13.7)/(1)=13.7","(0+13.7)/(1)=13.7","(0+13.7)/(1)=13.7","(0+13.7)/(1)=13.7","(0+13.7)/(1)=13.7","(0+13.7)/(1)=13.7","(0+13.7)/(1)=13.7","(0+13.7)/(1)=13.7","(0+13.7)/(1)=13.7","(0+13.7)/(1)=13.7","(0+13.7)/(1)=13.7","(0+13.7)/(1)=13.7","(0+13.7)/(1)=13.7","(0+13.7)/(1)=13.7","(0+13.7)/(1)=13.7","(0+13.7)/(1)=13.7"]
["S26","(0+13.2)/(1)=13.2","(0+13.2)/(1)=13.2","(0+13.2)/(1)=13.2","(0+13.2)/(1)=13.2","(0+13.2)/(1)=13.2","(0+13.2)/(1)=13.2","(0+13.2)/(1)=13.2","(0+13.2)/(1)=13.2","(0+13.2)/(1)=13.2","(0+13.2)/(1)=13.2","(0+13.2)/(1)=13.2","(0+13.2)/(1)=13.2","(0+13.2)/(1)=13.2","(0+13.2)/(1)=13.2","(0+13.2)/(1)=13.2","(0+13.2)/(1)=13.2","(0+13.2)/(1)=13.2"]
["S27","(0+12.6)/(1)=12.6","(0+12.6)/(1)=12.6","(0+12.6)/(1)=12.6","(0+12.6)/(1)=12.6","(0+12.6)/(1)=12.6","(0+12.6)/(1)=12.6","(0+12.6)/(1)=12.6","(0+12.6)/(1)=12.6","(0+12.6)/(1)=12.6","(0+12.6)/(1)=12.6","(0+12.6)/(1)=12.6","(0+12.6)/(1)=12.6","(0+12.6)/(1)=12.6","(0+12.6)/(1)=12.6","(0+12.6)/(1)=12.6","(0+12.6)/(1)=12.6","(0+12.6)/(1)=12.6"]
["S28","(0+12.1)/(1)=12.1","(0+12.1)/(1)=12.1","(0+12.1)/(1)=12.1","(0+12.1)/(1)=12.1","(0+12.1)/(1)=12.1","(0+12.1)/(1)=12.1","(0+12.1)/(1)=12.1","(0+12.1)/(1)=12.1","(0+12.1)/(1)=12.1","(0+12.1)/(1)=12.1","(0+12.1)/(1)=12.1","(0+12.1)/(1)=12.1","(0+12.1)/(1)=12.1","(0+12.1)/(1)=12.1","(0+12.1)/(1)=12.1","(0+12.1)/(1)=12.1","(0+12.1)/(1)=12.1"]
["S29","(0+11.5)/(1)=11.5","(0+11.5)/(1)=11.5","(0+11.5)/(1)=11.5","(0+11.5)/(1)=11.5","(0+11.5)/(1)=11.5","(0+11.5)/(1)=11.5","(0+11.5)/(1)=11.5","(0+11.5)/(1)=11.5","(0+11.5)/(1)=11.5","(0+11.5)/(1)=11.5","(0+11.5)/(1)=11.5","(0+11.5)/(1)=11.5","(0+11.5)/(1)=11.5","(0+11.5)/(1)=11.5","(0+11.5)/(1)=11.5","(0+11.5)/(1)=11.5","(0+11.5)/(1)=11.5"]
["S30","(0+11)/(1)=11","(0+11)/(1)=11","(0+11)/(1)=11","(0+11)/(1)=11","(0+11)/(1)=11","(0+11)/(1)=11","(0+11)/(1)=11","(0+11)/(1)=11","(0+11)/(1)=11","(0+11)/(1)=11","(0+11)/(1)=11","(0+11)/(1)=11","(0+11)/(1)=11","(0+11)/(1)=11","(0+11)/(1)=11","(0+11)/(1)=11","(0+11)/(1)=11"]
["S31","(0+10.4)/(1)=10.4","(0+10.4)/(1)=10.4","(0+10.4)/(1)=10.4","(0+10.4)/(1)=10.4","(0+10.4)/(1)=10.4","(0+10.4)/(1)=10.4","(0+10.4)/(1)=10.4","(0+10.4)/(1)=10.4","(0+10.4)/(1)=10.4","(0+10.4)/(1)=10.4","(0+10.4)/(1)=10.4","(0+10.4)/(1)=10.4","(0+10.4)/(1)=10.4","(0+10.4)/(1)=10.4","(0+10.4)/(1)=10.4","(0+10.4)/(1)=10.4","(0+10.4)/(1)=10.4"]
["S32","(0+9.9)/(1)=9.9","(0+9.9)/(1)=9.9","(0+9.9)/(1)=9.9","(0+9.9)/(1)=9.9","(0+9.9)/(1)=9.9","(0+9.9)/(1)=9.9","(0+9.9)/(1)=9.9","(0+9.9)/(1)=9.9","(0+9.9)/(1)=9.9","(0+9.9)/(1)=9.9","(0+9.9)/(1)=9.9","(0+9.9)/(1)=9.9","(0+9.9)/(1)=9.9","(0+9.9)/(1)=9.9","(0+9.9)/(1)=9.9","(0+9.9)/(1)=9.9","(0+9.9)/(1)=9.9"]
["S33","(0+9.3)/(1)=9.3","(0+9.3)/(1)=9.3","(0+9.3)/(1)=9.3","(0+9.3)/(1)=9.3","(0+9.3)/(1)=9.3","(0+9.3)/(1)=9.3","(0+9.3)/(1)=9.3","(0+9.3)/(1)=9.3","(0+9.3)/(1)=9.3","(0+9.3)/(1)=9.3","(0+9.3)/(1)=9.3","(0+9.3)/(1)=9.3","(0+9.3)/(1)=9.3","(0+9.3)/(1)=9.3","(0+9.3)/(1)=9.3","(0+9.3)/(1)=9.3","(0+9.3)/(1)=9.3"]
["S34","(0+8.8)/(1)=8.8","(0+8.8)/(1)=8.8","(0+8.8)/(1)=8.8","(0+8.8)/(1)=8.8","(0+8.8)/(1)=8.8","(0+8.8)/(1)=8.8","(0+8.8)/(1)=8.8","(0+8.8)/(1)=8.8","(0+8.8)/(1)=8.8","(0+8.8)/(1)=8.8","(0+8.8)/(1)=8.8","(0+8.8)/(1)=8.8","(0+8.8)/(1)=8.8","(0+8.8)/(1)=8.8","(0+8.8)/(1)=8.8","(0+8.8)/(1)=8.8","(0+8.8)/(1)=8.8"]
["S35","(0+8.2)/(1)=8.2","(0+8.2)/(1)=8.2","(0+8.2)/(1)=8.2","(0+8.2)/(1)=8.2","(0+8.2)/(1)=8.2","(0+8.2)/(1)=8.2","(0+8.2)/(1)=8.2","(0+8.2)/(1)=8.2","(0+8.2)/(1)=8.2","(0+8.2)/(1)=8.2","(0+8.2)/(1)=8.2","(0+8.2)/(1)=8.2","(0+8.2)/(1)=8.2","(0+8.2)/(1)=8.2","(0+8.2)/(1)=8.2","(0+8.2)/(1)=8.2","(0+8.2)/(1)=8.2"]
["S36","(0+7.7)/(1)=7.7","(0+7.7)/(1)=7.7","(0+7.7)/(1)=7.7","(0+7.7)/(1)=7.7","(0+7.7)/(1)=7.7","(0+7.7)/(1)=7.7","(0+7.7)/(1)=7.7","(0+7.7)/(1)=7.7","(0+7.7)/(1)=7.7","(0+7.7)/(1)=7.7","(0+7.7)/(1)=7.7","(0+7.7)/(1)=7.7","(0+7.7)/(1)=7.7","(0+7.7)/(1)=7.7","(0+7.7)/(1)=7.7","(0+7.7)/(1)=7.7","(0+7.7)/(1)=7.7"]
["S37","(0+7.1)/(1)=7.1","(0+7.1)/(1)=7.1","(0+7.1)/(1)=7.1","(0+7.1)/(1)=7.1","(0+7.1)/(1)=7.1","(0+7.1)/(1)=7.1","(0+7.1)/(1)=7.1","(0+7.1)/(1)=7.1","(0+7.1)/(1)=7.1","(0+7.1)/(1)=7.1","(0+7.1)/(1)=7.1","(0+7.1)/(1)=7.1","(0+7.1)/(1)=7.1","(0+7.1)/(1)=7.1","(0+7.1)/(1)=7.1","(0+7.1)/(1)=7.1","(0+7.1)/(1)=7.1"]
["S38","(0+6.6)/(1)=6.6","(0+6.6)/(1)=6.6","(0+6.6)/(1)=6.6","(0+6.6)/(1)=6.6","(0+6.6)/(1)=6.6","(0+6.6)/(1)=6.6","(0+6.6)/(1)=6.6","(0+6.6)/(1)=6.6","(0+6.6)/(1)=6.6","(0+6.6)/(1)=6.6","(0+6.6)/(1)=6.6","(0+6.6)/(1)=6.6","(0+6.6)/(1)=6.6","(0+6.6)/(1)=6.6","(0+6.6)/(1)=6.6","(0+6.6)/(1)=6.6","(0+6.6)/(1)=6.6"]
["S39","(0+6)/(1)=6","(0+6)/(1)=6","(0+6)/(1)=6","(0+6)/(1)=6","(0+6)/(1)=6","(0+6)/(1)=6","(0+6)/(1)=6","(0+6)/(1)=6","(0+6)/(1)=6","(0+6)/(1)=6","(0+6)/(1)=6","(0+6)/(1)=6","(0+6)/(1)=6","(0+6)/(1)=6","(0+6)/(1)=6","(0+6)/(1)=6","(0+6)/(1)=6"]
["S40","(0+5.5)/(1)=5.5","(0+5.5)/(1)=5.5","(0+5.5)/(1)=5.5","(0+5.5)/(1)=5.5","(0+5.5)/(1)=5.5","(0+5.5)/(1)=5.5","(0+5.5)/(1)=5.5","(0+5.5)/(1)=5.5","(0+5.5)/(1)=5.5","(0+5.5)/(1)=5.5","(0+5.5)/(1)=5.5","(0+5.5)/(1)=5.5","(0+5.5)/(1)=5.5","(0+5.5)/(1)=5.5","(0+5.5)/(1)=5.5","(0+5.5)/(1)=5.5","(0+5.5)/(1)=5.5"]
["S41","(0+4.9)/(1)=4.9","(0+4.9)/(1)=4.9","(0+4.9)/(1)=4.9","(0+4.9)/(1)=4.9","(0+4.9)/(1)=4.9","(0+4.9)/(1)=4.9","(0+4.9)/(1)=4.9","(0+4.9)/(1)=4.9","(0+4.9)/(1)=4.9","(0+4.9)/(1)=4.9","(0+4.9)/(1)=4.9","(0+4.9)/(1)=4.9","(0+4.9)/(1)=4.9","(0+4.9)/(1)=4.9","(0+4.9)/(1)=4.9","(0+4.9)/(1)=4.9","(0+4.9)/(1)=4.9"]
["S42","(0+4.4)/(1)=4.4","(0+4.4)/(1)=4.4","(0+4.4)/(1)=4.4","(0+4.4)/(1)=4.4","(0+4.4)/(1)=4.4","(0+4.4)/(1)=4.4","(0+4.4)/(1)=4.4","(0+4.4)/(1)=4.4","(0+4.4)/(1)=4.4","(0+4.4)/(1)=4.4","(0+4.4)/(1)=4.4","(0+4.4)/(1)=4.4","(0+4.4)/(1)=4.4","(0+4.4)/(1)=4.4","(0+4.4)/(1)=4.4","(0+4.4)/(1)=4.4","(0+4.4)/(1)=4.4"]
["S43","(0+3.8)/(1)=3.8","(0+3.8)/(1)=3.8","(0+3.8)/(1)=3.8","(0+3.8)/(1)=3.8","(0+3.8)/(1)=3.8","(0+3.8)/(1)=3.8","(0+3.8)/(1)=3.8","(0+3.8)/(1)=3.8","(0+3.8)/(1)=3.8","(0+3.8)/(1)=3.8","(0+3.8)/(1)=3.8","(0+3.8)/(1)=3.8","(0+3.8)/(1)=3.8","(0+3.8)/(1)=3.8","(0+3.8)/(1)=3.8","(0+3.8)/(1)=3.8","(0+3.8)/(1)=3.8"]
["S44","(0+3.3)/(1)=3.3","(0+3.3)/(1)=3.3","(0+3.3)/(1)=3.3","(0+3.3)/(1)=3.3","(0+3.3)/(1)=3.3","(0+3.3)/(1)=3.3","(0+3.3)/(1)=3.3","(0+3.3)/(1)=3.3","(0+3.3)/(1)=3.3","(0+3.3)/(1)=3.3","(0+3.3)/(1)=3.3","(0+3.3)/(1)=3.3","(0+3.3)/(1)=3.3","(0+3.3)/(1)=3.3","(0+3.3)/(1)=3.3","(0+3.3)/(1)=3.3","(0+3.3)/(1)=3.3"]
["S45","(0+2.7)/(1)=2.7","(0+2.7)/(1)=2.7","(0+2.7)/(1)=2.7","(0+2.7)/(1)=2.7","(0+2.7)/(1)=2.7","(0+2.7)/(1)=2.7","(0+2.7)/(1)=2.7","(0+2.7)/(1)=2.7","(0+2.7)/(1)=2.7","(0+2.7)/(1)=2.7","(0+2.7)/(1)=2.7","(0+2.7)/(1)=2.7","(0+2.7)/(1)=2.7","(0+2.7)/(1)=2.7","(0+2.7)/(1)=2.7","(0+2.7)/(1)=2.7","(0+2.7)/(1)=2.7"]
["S46","(0+2.2)/(1)=2.2","(0+2.2)/(1)=2.2","(0+2.2)/(1)=2.2","(0+2.2)/(1)=2.2","(0+2.2)/(1)=2.2","(0+2.2)/(1)=2.2","(0+2.2)/(1)=2.2","(0+2.2)/(1)=2.2","(0+2.2)/(1)=2.2","(0+2.2)/(1)=2.2","(0+2.2)/(1)=2.2","(0+2.2)/(1)=2.2","(0+2.2)/(1)=2.2","(0+2.2)/(1)=2.2","(0+2.2)/(1)=2.2","(0+2.2)/(1)=2.2","(0+2.2)/(1)=2.2"]
["S47","(0+1.6)/(1)=1.6","(0+1.6)/(1)=1.6","(0+1.6)/(1)=1.6","(0+1.6)/(1)=1.6","(0+1.6)/(1)=1.6","(0+1.6)/(1)=1.6","(0+1.6)/(1)=1.6","(0+1.6)/(1)=1.6","(0+1.6)/(1)=1.6","(0+1.6)/(1)=1.6","(0+1.6)/(1)=1.6","(0+1.6)/(1)=1.6","(0+1.6)/(1)=1.6","(0+1.6)/(1)=1.6","(0+1.6)/(1)=1.6","(0+1.6)/(1)=1.6","(0+1.6)/(1)=1.6"]
["S48","(0+1.1)/(1)=1.1","(0+1.1)/(1)=1.1","(0+1.1)/(1)=1.1","(0+1.1)/(1)=1.1","(0+1.1)/(1)=1.1","(0+1.1)/(1)=1.1","(0+1.1)/(1)=1.1","(0+1.1)/(1)=1.1","(0+1.1)/(1)=1.1","(0+1.1)/(1)=1.1","(0+1.1)/(1)=1.1","(0+1.1)/(1)=1.1","(0+1.1)/(1)=1.1","(0+1.1)/(1)=1.1","(0+1.1)/(1)=1.1","(0+1.1)/(1)=1.1","(0+1.1)/(1)=1.1"]
["S49","(0+0.5)/(1)=0.5","(0+0.5)/(1)=0.5","(0+0.5)/(1)=0.5","(0+0.5)/(1)=0.5","(0+0.5)/(1)=0.5","(0+0.5)/(1)=0.5","(0+0.5)/(1)=0.5","(0+0.5)/(1)=0.5","(0+0.5)/(1)=0.5","(0+0.5)/(1)=0.5","(0+0.5)/(1)=0.5","(0+0.5)/(1)=0.5","(0+0.5)/(1)=0.5","(0+0.5)/(1)=0.5","(0+0.5)/(1)=0.5","(0+0.5)/(1)=0.5","(0+0.5)/(1)=0.5"]
["S50","(0+0)/(1)=0","(0+0)/(1)=0","(0+0)/(1)=0","(0+0)/(1)=0","(0+0)/(1)=0","(0+0)/(1)=0","(0+0)/(1)=0","(0+0)/(1)=0","(0+0)/(1)=0","(0+0)/(1)=0","(0+0)/(1)=0","(0+0)/(1)=0","(0+0)/(1)=0","(0+0)/(1)=0","(0+0)/(1)=0","(0+0)/(1)=0","(0+0)/(1)=0"]
[]
["Lépcsők(2)","X(A1)","X(A2)","X(A3)","X(A4)","X(A5)","X(A6)","X(A7)","X(A8)","X(A9)","X(A10)","X(A11)","X(A12)","X(A13)","X(A14)","X(A15)","X(A16)","X(A17)"]
["S1",26.9,26.9,26.9,26.9,26.9,26.9,26.9,26.9,26.9,26.9,26.9,26.9,26.9,26.9,26.9,26.9,26.9]
["S2",26.4,26.4,26.4,26.4,26.4,26.4,26.4,26.4,26.4,26.4,26.4,26.4,26.4,26.4,26.4,26.4,26.4]
["S3",25.8,25.8,25.8,25.8,25.8,25.8,25.8,25.8,25.8,25.8,25.8,25.8,25.8,25.8,25.8,25.8,25.8]
["S4",25.3,25.3,25.3,25.3,25.3,25.3,25.3,25.3,25.3,25.3,25.3,25.3,25.3,25.3,25.3,25.3,25.3]
["S5",24.7,24.7,24.7,24.7,24.7,24.7,24.7,24.7,24.7,24.7,24.7,24.7,24.7,24.7,24.7,24.7,24.7]
["S6",24.2,24.2,24.2,24.2,24.2,24.2,24.2,24.2,24.2,24.2,24.2,24.2,24.2,24.2,24.2,24.2,24.2]
["S7",23.6,23.6,23.6,23.6,23.6,23.6,23.6,23.6,23.6,23.6,23.6,23.6,23.6,23.6,23.6,23.6,23.6]
["S8",23.1,23.1,23.1,23.1,23.1,23.1,23.1,23.1,23.1,23.1,23.1,23.1,23.1,23.1,23.1,23.1,23.1]
["S9",22.5,22.5,22.5,22.5,22.5,22.5,22.5,22.5,22.5,22.5,22.5,22.5,22.5,22.5,22.5,22.5,22.5]
["S10",22,22,22,22,22,22,22,22,22,22,22,22,22,22,22,22,22]
["S11",21.4,21.4,21.4,21.4,21.4,21.4,21.4,21.4,21.4,21.4,21.4,21.4,21.4,21.4,21.4,21.4,21.4]
["S12",20.9,20.9,20.9,20.9,20.9,20.9,20.9,20.9,20.9,20.9,20.9,20.9,20.9,20.9,20.9,20.9,20.9]
["S13",20.3,20.3,20.3,20.3,20.3,20.3,20.3,20.3,20.3,20.3,20.3,20.3,20.3,20.3,20.3,20.3,20.3]
["S14",19.8,19.8,19.8,19.8,19.8,19.8,19.8,19.8,19.8,19.8,19.8,19.8,19.8,19.8,19.8,19.8,19.8]
["S15",19.2,19.2,19.2,19.2,19.2,19.2,19.2,19.2,19.2,19.2,19.2,19.2,19.2,19.2,19.2,19.2,19.2]
["S16",18.7,18.7,18.7,18.7,18.7,18.7,18.7,18.7,18.7,18.7,18.7,18.7,18.7,18.7,18.7,18.7,18.7]
["S17",18.100000000000001,18.100000000000001,18.100000000000001,18.100000000000001,18.100000000000001,18.100000000000001,18.100000000000001,18.100000000000001,18.100000000000001,18.100000000000001,18.100000000000001,18.100000000000001,18.100000000000001,18.100000000000001,18.100000000000001,18.100000000000001,18.100000000000001]
["S18",17.600000000000001,17.600000000000001,17.600000000000001,17.600000000000001,17.600000000000001,17.600000000000001,17.600000000000001,17.600000000000001,17.600000000000001,17.600000000000001,17.600000000000001,17.600000000000001,17.600000000000001,17.600000000000001,17.600000000000001,17.600000000000001,17.600000000000001]
["S19",17,17,17,17,17,17,17,17,17,17,17,17,17,17,17,17,17]
["S20",16.5,16.5,16.5,16.5,16.5,16.5,16.5,16.5,16.5,16.5,16.5,16.5,16.5,16.5,16.5,16.5,16.5]
["S21",15.9,15.9,15.9,15.9,15.9,15.9,15.9,15.9,15.9,15.9,15.9,15.9,15.9,15.9,15.9,15.9,15.9]
["S22",15.4,15.4,15.4,15.4,15.4,15.4,15.4,15.4,15.4,15.4,15.4,15.4,15.4,15.4,15.4,15.4,15.4]
["S23",14.8,14.8,14.8,14.8,14.8,14.8,14.8,14.8,14.8,14.8,14.8,14.8,14.8,14.8,14.8,14.8,14.8]
["S24",14.3,14.3,14.3,14.3,14.3,14.3,14.3,14.3,14.3,14.3,14.3,14.3,14.3,14.3,14.3,14.3,14.3]
["S25",13.7,13.7,13.7,13.7,13.7,13.7,13.7,13.7,13.7,13.7,13.7,13.7,13.7,13.7,13.7,13.7,13.7]
["S26",13.2,13.2,13.2,13.2,13.2,13.2,13.2,13.2,13.2,13.2,13.2,13.2,13.2,13.2,13.2,13.2,13.2]
["S27",12.6,12.6,12.6,12.6,12.6,12.6,12.6,12.6,12.6,12.6,12.6,12.6,12.6,12.6,12.6,12.6,12.6]
["S28",12.1,12.1,12.1,12.1,12.1,12.1,12.1,12.1,12.1,12.1,12.1,12.1,12.1,12.1,12.1,12.1,12.1]
["S29",11.5,11.5,11.5,11.5,11.5,11.5,11.5,11.5,11.5,11.5,11.5,11.5,11.5,11.5,11.5,11.5,11.5]
["S30",11,11,11,11,11,11,11,11,11,11,11,11,11,11,11,11,11]
["S31",10.4,10.4,10.4,10.4,10.4,10.4,10.4,10.4,10.4,10.4,10.4,10.4,10.4,10.4,10.4,10.4,10.4]
["S32",9.9,9.9,9.9,9.9,9.9,9.9,9.9,9.9,9.9,9.9,9.9,9.9,9.9,9.9,9.9,9.9,9.9]
["S33",9.3000000000000007,9.3000000000000007,9.3000000000000007,9.3000000000000007,9.3000000000000007,9.3000000000000007,9.3000000000000007,9.3000000000000007,9.3000000000000007,9.3000000000000007,9.3000000000000007,9.3000000000000007,9.3000000000000007,9.3000000000000007,9.3000000000000007,9.3000000000000007,9.3000000000000007]
["S34",8.8000000000000007,8.8000000000000007,8.8000000000000007,8.8000000000000007,8.8000000000000007,8.8000000000000007,8.8000000000000007,8.8000000000000007,8.8000000000000007,8.8000000000000007,8.8000000000000007,8.8000000000000007,8.8000000000000007,8.8000000000000007,8.8000000000000007,8.8000000000000007,8.8000000000000007]
["S35",8.1999999999999993,8.1999999999999993,8.1999999999999993,8.1999999999999993,8.1999999999999993,8.1999999999999993,8.1999999999999993,8.1999999999999993,8.1999999999999993,8.1999999999999993,8.1999999999999993,8.1999999999999993,8.1999999999999993,8.1999999999999993,8.1999999999999993,8.1999999999999993,8.1999999999999993]
["S36",7.7,7.7,7.7,7.7,7.7,7.7,7.7,7.7,7.7,7.7,7.7,7.7,7.7,7.7,7.7,7.7,7.7]
["S37",7.1,7.1,7.1,7.1,7.1,7.1,7.1,7.1,7.1,7.1,7.1,7.1,7.1,7.1,7.1,7.1,7.1]
["S38",6.6,6.6,6.6,6.6,6.6,6.6,6.6,6.6,6.6,6.6,6.6,6.6,6.6,6.6,6.6,6.6,6.6]
["S39",6,6,6,6,6,6,6,6,6,6,6,6,6,6,6,6,6]
["S40",5.5,5.5,5.5,5.5,5.5,5.5,5.5,5.5,5.5,5.5,5.5,5.5,5.5,5.5,5.5,5.5,5.5]
["S41",4.9000000000000004,4.9000000000000004,4.9000000000000004,4.9000000000000004,4.9000000000000004,4.9000000000000004,4.9000000000000004,4.9000000000000004,4.9000000000000004,4.9000000000000004,4.9000000000000004,4.9000000000000004,4.9000000000000004,4.9000000000000004,4.9000000000000004,4.9000000000000004,4.9000000000000004]
["S42",4.4000000000000004,4.4000000000000004,4.4000000000000004,4.4000000000000004,4.4000000000000004,4.4000000000000004,4.4000000000000004,4.4000000000000004,4.4000000000000004,4.4000000000000004,4.4000000000000004,4.4000000000000004,4.4000000000000004,4.4000000000000004,4.4000000000000004,4.4000000000000004,4.4000000000000004]
["S43",3.8,3.8,3.8,3.8,3.8,3.8,3.8,3.8,3.8,3.8,3.8,3.8,3.8,3.8,3.8,3.8,3.8]
["S44",3.3,3.3,3.3,3.3,3.3,3.3,3.3,3.3,3.3,3.3,3.3,3.3,3.3,3.3,3.3,3.3,3.3]
["S45",2.7,2.7,2.7,2.7,2.7,2.7,2.7,2.7,2.7,2.7,2.7,2.7,2.7,2.7,2.7,2.7,2.7]
["S46",2.2000000000000002,2.2000000000000002,2.2000000000000002,2.2000000000000002,2.2000000000000002,2.2000000000000002,2.2000000000000002,2.2000000000000002,2.2000000000000002,2.2000000000000002,2.2000000000000002,2.2000000000000002,2.2000000000000002,2.2000000000000002,2.2000000000000002,2.2000000000000002,2.2000000000000002]
["S47",1.6,1.6,1.6,1.6,1.6,1.6,1.6,1.6,1.6,1.6,1.6,1.6,1.6,1.6,1.6,1.6,1.6]
["S48",1.1000000000000001,1.1000000000000001,1.1000000000000001,1.1000000000000001,1.1000000000000001,1.1000000000000001,1.1000000000000001,1.1000000000000001,1.1000000000000001,1.1000000000000001,1.1000000000000001,1.1000000000000001,1.1000000000000001,1.1000000000000001,1.1000000000000001,1.1000000000000001,1.1000000000000001]
["S49",0.5,0.5,0.5,0.5,0.5,0.5,0.5,0.5,0.5,0.5,0.5,0.5,0.5,0.5,0.5,0.5,0.5]
["S50",0,0,0,0,0,0,0,0,0,0,0,0,0,0,0,0,0]
[]
["COCO:Y0","X(A1)","X(A2)","X(A3)","X(A4)","X(A5)","X(A6)","X(A7)","X(A8)","X(A9)","X(A10)","X(A11)","X(A12)","X(A13)","X(A14)","X(A15)","X(A16)","X(A17)","Becslés","Tény+0","Delta","Delta/Tény"]
["O1",20.3,26.9,16.5,9.9,17,18.7,23.1,26.9,19.2,19.8,26.9,14.3,17,26.9,26.9,26.9,4.9000000000000004,342.1,100,-242.1,-242.1,{"$f":"IF(U160*inverz!U160<=0,\"hiteles\",\"hiteltelen\")","v":"hiteltelen"}]
["O2",26.9,26.9,16.5,23.1,26.9,18.7,4.4000000000000004,5.5,26.9,10.4,26.9,26.9,7.7,26.9,23.6,26.9,4.9000000000000004,330,100,-230,-230,{"$f":"IF(U161*inverz!U161<=0,\"hiteles\",\"hiteltelen\")","v":"hiteltelen"}]
["O3",20.3,26.9,16.5,23.1,0.5,18.7,17,11.5,9.3000000000000007,26.9,0.5,14.3,17,26.9,14.3,26.9,16.5,287.2,100,-187.2,-187.2,{"$f":"IF(U162*inverz!U162<=0,\"hiteles\",\"hiteltelen\")","v":"hiteltelen"}]
["O4",26.9,26.9,16.5,9.9,26.9,18.7,17,17,9.3000000000000007,26.9,26.9,26.9,7.7,26.9,14.3,26.9,26.9,352.6,100,-252.6,-252.6,{"$f":"IF(U163*inverz!U163<=0,\"hiteles\",\"hiteltelen\")","v":"hiteltelen"}]
["O5",20.3,26.9,16.5,23.1,17,18.7,12.6,17,9.3000000000000007,19.8,26.9,26.9,17,17.600000000000001,14.3,26.9,16.5,327.3,100,-227.3,-227.3,{"$f":"IF(U164*inverz!U164<=0,\"hiteles\",\"hiteltelen\")","v":"hiteltelen"}]
["O6",20.3,26.9,16.5,23.1,26.9,18.7,4.4000000000000004,17,26.9,26.9,12.1,3.3,7.7,17.600000000000001,14.3,26.9,11,300.39999999999998,100,-200.4,-200.4,{"$f":"IF(U165*inverz!U165<=0,\"hiteles\",\"hiteltelen\")","v":"hiteltelen"}]
["O7",20.3,7.1,22,23.1,17,25.3,26.9,5.5,9.3000000000000007,10.4,12.1,26.9,23.1,6.6,14.3,10.4,11,271.3,100,-171.3,-171.3,{"$f":"IF(U166*inverz!U166<=0,\"hiteles\",\"hiteltelen\")","v":"hiteltelen"}]
["O8",20.3,26.9,16.5,9.9,26.9,18.7,4.4000000000000004,2.2000000000000002,26.9,10.4,26.9,26.9,7.7,26.9,14.3,26.9,26.9,319.60000000000002,100,-219.6,-219.6,{"$f":"IF(U167*inverz!U167<=0,\"hiteles\",\"hiteltelen\")","v":"hiteltelen"}]
["O9",8.1999999999999993,26.9,16.5,26.9,17,18.7,23.1,21.4,9.3000000000000007,10.4,26.9,26.9,7.7,26.9,14.3,10.4,4.9000000000000004,296.5,100,-196.5,-196.5,{"$f":"IF(U168*inverz!U168<=0,\"hiteles\",\"hiteltelen\")","v":"hiteltelen"}]
["O10",20.3,7.1,16.5,26.9,5.5,18.7,23.1,5.5,9.3000000000000007,19.8,12.1,14.3,7.7,6.6,1.6,10.4,12.6,218,100,-118,-118,{"$f":"IF(U169*inverz!U169<=0,\"hiteles\",\"hiteltelen\")","v":"hiteltelen"}]
["O11",8.1999999999999993,0,22,26.9,17,25.3,12.6,2.2000000000000002,0.5,1.1000000000000001,3.3,3.3,17,6.6,1.6,10.4,6,164.2,100,-64.2,-64.2,{"$f":"IF(U170*inverz!U170<=0,\"hiteles\",\"hiteltelen\")","v":"hiteltelen"}]
["O12",26.9,26.9,16.5,9.9,26.9,18.7,12.6,5.5,9.3000000000000007,19.8,26.9,26.9,23.1,26.9,26.9,26.9,26.9,357.5,100,-257.5,-257.5,{"$f":"IF(U171*inverz!U171<=0,\"hiteles\",\"hiteltelen\")","v":"hiteltelen"}]
["O13",26.9,26.9,16.5,9.9,17,25.3,12.6,17,26.9,26.9,26.9,14.3,17,26.9,14.3,26.9,16.5,348.7,100,-248.7,-248.7,{"$f":"IF(U172*inverz!U172<=0,\"hiteles\",\"hiteltelen\")","v":"hiteltelen"}]
["O14",20.3,26.9,16.5,9.9,0.5,18.7,12.6,11.5,26.9,10.4,26.9,26.9,7.7,26.9,14.3,1.6,4.9000000000000004,263.60000000000002,100,-163.6,-163.6,{"$f":"IF(U173*inverz!U173<=0,\"hiteles\",\"hiteltelen\")","v":"hiteltelen"}]
["O15",26.9,7.1,26.9,26.9,17,18.7,4.4000000000000004,2.2000000000000002,9.3000000000000007,19.8,26.9,26.9,7.7,6.6,14.3,1.6,26.9,270.2,100,-170.2,-170.2,{"$f":"IF(U174*inverz!U174<=0,\"hiteles\",\"hiteltelen\")","v":"hiteltelen"}]
["O16",8.1999999999999993,26.9,16.5,26.9,17,25.3,12.6,21.4,19.2,10.4,12.1,14.3,21.4,17.600000000000001,14.3,10.4,16.5,291,100,-191,-191,{"$f":"IF(U175*inverz!U175<=0,\"hiteles\",\"hiteltelen\")","v":"hiteltelen"}]
["O17",8.1999999999999993,26.9,22,23.1,17,25.3,23.1,21.4,19.2,10.4,12.1,3.3,17,0,1.6,26.9,26.9,284.5,100,-184.5,-184.5,{"$f":"IF(U176*inverz!U176<=0,\"hiteles\",\"hiteltelen\")","v":"hiteltelen"}]
["O18",8.1999999999999993,26.9,22,23.1,17,18.7,6.6,11.5,19.2,10.4,12.1,14.3,21.4,26.9,23.6,26.9,26.9,315.8,100,-215.8,-215.8,{"$f":"IF(U177*inverz!U177<=0,\"hiteles\",\"hiteltelen\")","v":"hiteltelen"}]
["O19",8.1999999999999993,26.9,16.5,9.9,26.9,26.9,23.1,21.4,26.9,19.8,26.9,3.3,7.7,17.600000000000001,23.6,26.9,26.9,339.4,100,-239.4,-239.4,{"$f":"IF(U178*inverz!U178<=0,\"hiteles\",\"hiteltelen\")","v":"hiteltelen"}]
["O20",8.1999999999999993,26.9,16.5,23.1,5.5,18.7,4.4000000000000004,2.2000000000000002,26.9,26.9,3.3,3.3,7.7,17.600000000000001,14.3,10.4,11,226.8,100,-126.8,-126.8,{"$f":"IF(U179*inverz!U179<=0,\"hiteles\",\"hiteltelen\")","v":"hiteltelen"}]
["O21",20.3,26.9,22,23.1,5.5,18.7,6.6,17,19.2,10.4,26.9,14.3,23.1,17.600000000000001,14.3,26.9,4.9000000000000004,297.60000000000002,100,-197.6,-197.6,{"$f":"IF(U180*inverz!U180<=0,\"hiteles\",\"hiteltelen\")","v":"hiteltelen"}]
["O22",8.1999999999999993,26.9,16.5,23.1,5.5,18.7,12.6,11.5,19.2,1.1000000000000001,3.3,3.3,21.4,17.600000000000001,1.6,10.4,11,212,100,-112,-112,{"$f":"IF(U181*inverz!U181<=0,\"hiteles\",\"hiteltelen\")","v":"hiteltelen"}]
["O23",20.3,7.1,24.7,23.1,17,25.3,23.1,11.5,9.3000000000000007,19.8,12.1,26.9,24.2,6.6,14.3,10.4,4.9000000000000004,280.60000000000002,100,-180.6,-180.6,{"$f":"IF(U182*inverz!U182<=0,\"hiteles\",\"hiteltelen\")","v":"hiteltelen"}]
["O24",26.9,26.9,16.5,9.9,17,18.7,26.9,26.9,26.9,26.9,26.9,26.9,7.7,26.9,26.9,26.9,4.9000000000000004,370.7,100,-270.7,-270.7,{"$f":"IF(U183*inverz!U183<=0,\"hiteles\",\"hiteltelen\")","v":"hiteltelen"}]
["O25",20.3,26.9,16.5,23.1,26.9,18.7,4.4000000000000004,11.5,19.2,10.4,12.1,14.3,7.7,17.600000000000001,14.3,26.9,26.9,297.60000000000002,100,-197.6,-197.6,{"$f":"IF(U184*inverz!U184<=0,\"hiteles\",\"hiteltelen\")","v":"hiteltelen"}]
["O26",20.3,26.9,22,23.1,26.9,18.7,12.6,26.9,9.3000000000000007,26.9,12.1,14.3,24.2,26.9,23.6,26.9,11,352.6,100,-252.6,-252.6,{"$f":"IF(U185*inverz!U185<=0,\"hiteles\",\"hiteltelen\")","v":"hiteltelen"}]
["O27",20.3,7.1,24.7,23.1,17,25.3,6.6,11.5,19.2,10.4,3.3,14.3,17,6.6,23.6,10.4,26.9,267.39999999999998,100,-167.4,-167.4,{"$f":"IF(U186*inverz!U186<=0,\"hiteles\",\"hiteltelen\")","v":"hiteltelen"}]
["O28",20.3,7.1,22,23.1,26.9,18.7,12.6,5.5,19.2,19.8,12.1,26.9,21.4,17.600000000000001,23.6,10.4,26.9,314.10000000000002,100,-214.1,-214.1,{"$f":"IF(U187*inverz!U187<=0,\"hiteles\",\"hiteltelen\")","v":"hiteltelen"}]
["O29",8.1999999999999993,26.9,16.5,9.9,26.9,18.7,6.6,21.4,26.9,19.8,12.1,14.3,21.4,17.600000000000001,23.6,26.9,26.9,324.5,100,-224.5,-224.5,{"$f":"IF(U188*inverz!U188<=0,\"hiteles\",\"hiteltelen\")","v":"hiteltelen"}]
["O30",20.3,26.9,16.5,23.1,17,18.7,12.6,17,19.2,19.8,26.9,14.3,17,6.6,23.6,10.4,26.9,316.89999999999998,100,-216.9,-216.9,{"$f":"IF(U189*inverz!U189<=0,\"hiteles\",\"hiteltelen\")","v":"hiteltelen"}]
["O31",26.9,26.9,16.5,9.9,17,18.7,26.9,26.9,26.9,26.9,26.9,26.9,7.7,26.9,26.9,26.9,4.9000000000000004,370.7,100,-270.7,-270.7,{"$f":"IF(U190*inverz!U190<=0,\"hiteles\",\"hiteltelen\")","v":"hiteltelen"}]
["O32",8.1999999999999993,26.9,16.5,23.1,26.9,25.3,23.1,21.4,26.9,26.9,26.9,26.9,26.9,17.600000000000001,14.3,26.9,4.9000000000000004,369.6,100,-269.60000000000002,-269.60000000000002,{"$f":"IF(U191*inverz!U191<=0,\"hiteles\",\"hiteltelen\")","v":"hiteltelen"}]
["O33",8.1999999999999993,26.9,16.5,23.1,17,18.7,4.4000000000000004,17,9.3000000000000007,19.8,26.9,26.9,7.7,26.9,14.3,26.9,12.6,303.10000000000002,100,-203.1,-203.1,{"$f":"IF(U192*inverz!U192<=0,\"hiteles\",\"hiteltelen\")","v":"hiteltelen"}]
["O34",20.3,26.9,16.5,9.9,5.5,26.9,17,26.9,19.2,19.8,26.9,14.3,21.4,26.9,23.6,26.9,4.9000000000000004,333.9,100,-233.9,-233.9,{"$f":"IF(U193*inverz!U193<=0,\"hiteles\",\"hiteltelen\")","v":"hiteltelen"}]
["O35",26.9,7.1,16.5,9.9,17,18.7,23.1,11.5,19.2,26.9,26.9,26.9,17,6.6,23.6,1.6,26.9,306.39999999999998,100,-206.4,-206.4,{"$f":"IF(U194*inverz!U194<=0,\"hiteles\",\"hiteltelen\")","v":"hiteltelen"}]
["O36",0.5,26.9,16.5,9.9,2.2000000000000002,25.3,17,11.5,19.2,10.4,12.1,14.3,17,26.9,14.3,10.4,26.9,261.39999999999998,100,-161.4,-161.4,{"$f":"IF(U195*inverz!U195<=0,\"hiteles\",\"hiteltelen\")","v":"hiteltelen"}]
["O37",26.9,7.1,22,9.9,2.2000000000000002,26.9,26.9,26.9,19.2,10.4,26.9,26.9,17,6.6,23.6,26.9,26.9,333.3,100,-233.3,-233.3,{"$f":"IF(U196*inverz!U196<=0,\"hiteles\",\"hiteltelen\")","v":"hiteltelen"}]
["O38",26.9,26.9,16.5,9.9,26.9,18.7,23.1,26.9,26.9,26.9,26.9,26.9,7.7,17.600000000000001,26.9,26.9,11,373.4,100,-273.39999999999998,-273.39999999999998,{"$f":"IF(U197*inverz!U197<=0,\"hiteles\",\"hiteltelen\")","v":"hiteltelen"}]
["O39",20.3,26.9,16.5,23.1,26.9,18.7,23.1,21.4,19.2,19.8,26.9,14.3,17,17.600000000000001,23.6,26.9,6,348.2,100,-248.2,-248.2,{"$f":"IF(U198*inverz!U198<=0,\"hiteles\",\"hiteltelen\")","v":"hiteltelen"}]
["O40",20.3,26.9,26.9,9.9,26.9,18.7,23.1,26.9,0.5,10.4,3.3,26.9,26.9,17.600000000000001,23.6,26.9,26.9,342.7,100,-242.7,-242.7,{"$f":"IF(U199*inverz!U199<=0,\"hiteles\",\"hiteltelen\")","v":"hiteltelen"}]
["O41",26.9,26.9,24.7,23.1,17,25.3,17,26.9,9.3000000000000007,19.8,26.9,26.9,21.4,6.6,14.3,10.4,11,334.4,100,-234.4,-234.4,{"$f":"IF(U200*inverz!U200<=0,\"hiteles\",\"hiteltelen\")","v":"hiteltelen"}]
["O42",20.3,7.1,22,26.9,17,25.3,17,17,9.3000000000000007,10.4,12.1,14.3,17,17.600000000000001,23.6,10.4,11,278.39999999999998,100,-178.4,-178.4,{"$f":"IF(U201*inverz!U201<=0,\"hiteles\",\"hiteltelen\")","v":"hiteltelen"}]
["O43",20.3,7.1,22,23.1,5.5,18.7,26.9,21.4,9.3000000000000007,26.9,12.1,14.3,17,17.600000000000001,14.3,1.6,12.6,270.7,100,-170.7,-170.7,{"$f":"IF(U202*inverz!U202<=0,\"hiteles\",\"hiteltelen\")","v":"hiteltelen"}]
["O44",8.1999999999999993,26.9,16.5,9.9,17,18.7,12.6,17,9.3000000000000007,10.4,26.9,14.3,17,17.600000000000001,14.3,26.9,16.5,280.10000000000002,100,-180.1,-180.1,{"$f":"IF(U203*inverz!U203<=0,\"hiteles\",\"hiteltelen\")","v":"hiteltelen"}]
["O45",0.5,0.5,26.9,23.1,26.9,25.3,26.9,2.2000000000000002,19.2,10.4,0,3.3,26.9,6.6,23.6,10.4,26.9,259.7,100,-159.69999999999999,-159.69999999999999,{"$f":"IF(U204*inverz!U204<=0,\"hiteles\",\"hiteltelen\")","v":"hiteltelen"}]
["O46",8.1999999999999993,7.1,16.5,26.9,26.9,18.7,17,11.5,26.9,19.8,26.9,26.9,17,17.600000000000001,14.3,10.4,16.5,309.2,100,-209.2,-209.2,{"$f":"IF(U205*inverz!U205<=0,\"hiteles\",\"hiteltelen\")","v":"hiteltelen"}]
["O47",20.3,26.9,16.5,23.1,26.9,18.7,4.4000000000000004,5.5,19.2,19.8,26.9,14.3,26.9,6.6,23.6,26.9,26.9,333.3,100,-233.3,-233.3,{"$f":"IF(U206*inverz!U206<=0,\"hiteles\",\"hiteltelen\")","v":"hiteltelen"}]
["O48",8.1999999999999993,7.1,24.7,23.1,17,18.7,26.9,11.5,9.3000000000000007,19.8,12.1,26.9,17,17.600000000000001,23.6,26.9,16.5,307,100,-207,-207,{"$f":"IF(U207*inverz!U207<=0,\"hiteles\",\"hiteltelen\")","v":"hiteltelen"}]
["O49",20.3,26.9,24.7,9.9,2.2000000000000002,18.7,17,17,19.2,1.1000000000000001,12.1,14.3,21.4,17.600000000000001,14.3,26.9,11,274.60000000000002,100,-174.6,-174.6,{"$f":"IF(U208*inverz!U208<=0,\"hiteles\",\"hiteltelen\")","v":"hiteltelen"}]
["O50",26.9,26.9,26.9,9.9,26.9,18.7,4.4000000000000004,26.9,26.9,26.9,26.9,26.9,26.9,26.9,26.9,26.9,26.9,409.7,100,-309.7,-309.7,{"$f":"IF(U209*inverz!U209<=0,\"hiteles\",\"hiteltelen\")","v":"hiteltelen"}]
[null,{"$f":"SUM(B160:B209)/8500","v":0.1041411764705882},{"$f":"SUM(C160:C209)/8500","v":0.12401176470588232},0.11324705882352941,0.10950588235294119,0.10374117647058821,0.12221176470588239,9.2117647058823526E-2,9.1847058823529379E-2,0.10258823529411763,0.10192941176470581,0.11022352941176469,0.10915294117647052,9.7399999999999973E-2,0.10452941176470593,0.10563529411764705,0.11527058823529404,9.6988235294117597E-2]

{"sheet":"inverz","index":8,"n_rows":209,"n_cols":22,"rows_kept":209,"cut":false,"hidden":false,"merged":[]}
["Azonosító:","Teszt","Objektumok:",50,"Attribútumok:",17,"Lepcsők:",50,"Eltolás:",0,"Leírás:","COCO Y0: Teszt"]
[]
["Rangsor","X(A1)","X(A2)","X(A3)","X(A4)","X(A5)","X(A6)","X(A7)","X(A8)","X(A9)","X(A10)","X(A11)","X(A12)","X(A13)","X(A14)","X(A15)","X(A16)","X(A17)","Y(A18)"]
["O1",17,15,1,1,12,1,33,41,19,21,24,8,16,34,45,21,1,1000000]
["O2",39,15,1,20,33,1,1,6,37,4,24,28,1,34,28,21,1,1000000]
["O3",17,15,1,20,1,1,25,12,3,38,2,8,16,34,5,21,25,1000000]
["O4",39,15,1,1,33,1,25,23,3,38,24,28,1,34,5,21,32,1000000]
["O5",17,15,1,20,12,1,14,23,3,21,24,28,16,14,5,21,25,1000000]
["O6",17,15,1,20,33,1,1,23,37,38,8,1,1,14,5,21,13,1000000]
["O7",17,3,32,20,12,36,44,6,3,4,8,28,41,2,5,5,13,1000000]
["O8",17,15,1,1,33,1,1,1,37,4,24,28,1,34,5,21,32,1000000]
["O9",3,15,1,44,12,1,33,33,3,4,24,28,1,34,5,5,1,1000000]
["O10",17,3,1,44,6,1,33,6,3,21,8,8,1,2,1,5,22,1000000]
["O11",3,1,32,44,12,36,14,1,1,1,3,1,16,2,1,5,11,1000000]
["O12",39,15,1,1,33,1,14,6,3,21,24,28,41,34,45,21,32,1000000]
["O13",39,15,1,1,12,36,14,23,37,38,24,8,16,34,5,21,25,1000000]
["O14",17,15,1,1,1,1,14,12,37,4,24,28,1,34,5,1,1,1000000]
["O15",39,3,47,44,12,1,1,1,3,21,24,28,1,2,5,1,32,1000000]
["O16",3,15,1,44,12,36,14,33,19,4,8,8,33,14,5,5,25,1000000]
["O17",3,15,32,20,12,36,33,33,19,4,8,1,16,1,1,21,32,1000000]
["O18",3,15,32,20,12,1,10,12,19,4,8,8,33,34,28,21,32,1000000]
["O19",3,15,1,1,33,48,33,33,37,21,24,1,1,14,28,21,32,1000000]
["O20",3,15,1,20,6,1,1,1,37,38,3,1,1,14,5,5,13,1000000]
["O21",17,15,32,20,6,1,10,23,19,4,24,8,41,14,5,21,1,1000000]
["O22",3,15,1,20,6,1,14,12,19,1,3,1,33,14,1,5,13,1000000]
["O23",17,3,42,20,12,36,33,12,3,21,8,28,44,2,5,5,1,1000000]
["O24",39,15,1,1,12,1,44,41,37,38,24,28,1,34,45,21,1,1000000]
["O25",17,15,1,20,33,1,1,12,19,4,8,8,1,14,5,21,32,1000000]
["O26",17,15,32,20,33,1,14,41,3,38,8,8,44,34,28,21,13,1000000]
["O27",17,3,42,20,12,36,10,12,19,4,3,8,16,2,28,5,32,1000000]
["O28",17,3,32,20,33,1,14,6,19,21,8,28,33,14,28,5,32,1000000]
["O29",3,15,1,1,33,1,10,33,37,21,8,8,33,14,28,21,32,1000000]
["O30",17,15,1,20,12,1,14,23,19,21,24,8,16,2,28,5,32,1000000]
["O31",39,15,1,1,12,1,44,41,37,38,24,28,1,34,45,21,1,1000000]
["O32",3,15,1,20,33,36,33,33,37,38,24,28,46,14,5,21,1,1000000]
["O33",3,15,1,20,12,1,1,23,3,21,24,28,1,34,5,21,22,1000000]
["O34",17,15,1,1,6,48,25,41,19,21,24,8,33,34,28,21,1,1000000]
["O35",39,3,1,1,12,1,33,12,19,38,24,28,16,2,28,1,32,1000000]
["O36",1,15,1,1,3,36,25,12,19,4,8,8,16,34,5,5,32,1000000]
["O37",39,3,32,1,3,48,44,41,19,4,24,28,16,2,28,21,32,1000000]
["O38",39,15,1,1,33,1,33,41,37,38,24,28,1,14,45,21,13,1000000]
["O39",17,15,1,20,33,1,33,33,19,21,24,8,16,14,28,21,11,1000000]
["O40",17,15,47,1,33,1,33,41,1,4,3,28,46,14,28,21,32,1000000]
["O41",39,15,42,20,12,36,25,41,3,21,24,28,33,2,5,5,13,1000000]
["O42",17,3,32,44,12,36,25,23,3,4,8,8,16,14,28,5,13,1000000]
["O43",17,3,32,20,6,1,44,33,3,38,8,8,16,14,5,1,22,1000000]
["O44",3,15,1,1,12,1,14,23,3,4,24,8,16,14,5,21,25,1000000]
["O45",1,2,47,20,33,36,44,1,19,4,1,1,46,2,28,5,32,1000000]
["O46",3,3,1,44,33,1,25,12,37,21,24,28,16,14,5,5,25,1000000]
["O47",17,15,1,20,33,1,1,6,19,21,24,8,46,2,28,21,32,1000000]
["O48",3,3,42,20,12,1,44,12,3,21,8,28,16,14,28,21,25,1000000]
["O49",17,15,42,1,3,1,25,23,19,1,8,8,33,14,5,21,13,1000000]
["O50",39,15,47,1,33,1,1,41,37,38,24,28,46,34,45,21,32,1000000]
[]
["Lépcsők(1)","X(A1)","X(A2)","X(A3)","X(A4)","X(A5)","X(A6)","X(A7)","X(A8)","X(A9)","X(A10)","X(A11)","X(A12)","X(A13)","X(A14)","X(A15)","X(A16)","X(A17)"]
["S1","(0+26.9)/(1)=26.9","(0+26.9)/(1)=26.9","(0+26.9)/(1)=26.9","(0+26.9)/(1)=26.9","(0+26.9)/(1)=26.9","(0+26.9)/(1)=26.9","(0+26.9)/(1)=26.9","(0+26.9)/(1)=26.9","(0+26.9)/(1)=26.9","(0+26.9)/(1)=26.9","(0+26.9)/(1)=26.9","(0+26.9)/(1)=26.9","(0+26.9)/(1)=26.9","(0+26.9)/(1)=26.9","(0+26.9)/(1)=26.9","(0+26.9)/(1)=26.9","(0+26.9)/(1)=26.9"]
["S2","(0+26.4)/(1)=26.4","(0+26.4)/(1)=26.4","(0+26.4)/(1)=26.4","(0+26.4)/(1)=26.4","(0+26.4)/(1)=26.4","(0+26.4)/(1)=26.4","(0+26.4)/(1)=26.4","(0+26.4)/(1)=26.4","(0+26.4)/(1)=26.4","(0+26.4)/(1)=26.4","(0+26.4)/(1)=26.4","(0+26.4)/(1)=26.4","(0+26.4)/(1)=26.4","(0+26.4)/(1)=26.4","(0+26.4)/(1)=26.4","(0+26.4)/(1)=26.4","(0+26.4)/(1)=26.4"]
["S3","(0+25.8)/(1)=25.8","(0+25.8)/(1)=25.8","(0+25.8)/(1)=25.8","(0+25.8)/(1)=25.8","(0+25.8)/(1)=25.8","(0+25.8)/(1)=25.8","(0+25.8)/(1)=25.8","(0+25.8)/(1)=25.8","(0+25.8)/(1)=25.8","(0+25.8)/(1)=25.8","(0+25.8)/(1)=25.8","(0+25.8)/(1)=25.8","(0+25.8)/(1)=25.8","(0+25.8)/(1)=25.8","(0+25.8)/(1)=25.8","(0+25.8)/(1)=25.8","(0+25.8)/(1)=25.8"]
["S4","(0+25.3)/(1)=25.3","(0+25.3)/(1)=25.3","(0+25.3)/(1)=25.3","(0+25.3)/(1)=25.3","(0+25.3)/(1)=25.3","(0+25.3)/(1)=25.3","(0+25.3)/(1)=25.3","(0+25.3)/(1)=25.3","(0+25.3)/(1)=25.3","(0+25.3)/(1)=25.3","(0+25.3)/(1)=25.3","(0+25.3)/(1)=25.3","(0+25.3)/(1)=25.3","(0+25.3)/(1)=25.3","(0+25.3)/(1)=25.3","(0+25.3)/(1)=25.3","(0+25.3)/(1)=25.3"]
["S5","(0+24.7)/(1)=24.7","(0+24.7)/(1)=24.7","(0+24.7)/(1)=24.7","(0+24.7)/(1)=24.7","(0+24.7)/(1)=24.7","(0+24.7)/(1)=24.7","(0+24.7)/(1)=24.7","(0+24.7)/(1)=24.7","(0+24.7)/(1)=24.7","(0+24.7)/(1)=24.7","(0+24.7)/(1)=24.7","(0+24.7)/(1)=24.7","(0+24.7)/(1)=24.7","(0+24.7)/(1)=24.7","(0+24.7)/(1)=24.7","(0+24.7)/(1)=24.7","(0+24.7)/(1)=24.7"]
["S6","(0+24.2)/(1)=24.2","(0+24.2)/(1)=24.2","(0+24.2)/(1)=24.2","(0+24.2)/(1)=24.2","(0+24.2)/(1)=24.2","(0+24.2)/(1)=24.2","(0+24.2)/(1)=24.2","(0+24.2)/(1)=24.2","(0+24.2)/(1)=24.2","(0+24.2)/(1)=24.2","(0+24.2)/(1)=24.2","(0+24.2)/(1)=24.2","(0+24.2)/(1)=24.2","(0+24.2)/(1)=24.2","(0+24.2)/(1)=24.2","(0+24.2)/(1)=24.2","(0+24.2)/(1)=24.2"]
["S7","(0+23.6)/(1)=23.6","(0+23.6)/(1)=23.6","(0+23.6)/(1)=23.6","(0+23.6)/(1)=23.6","(0+23.6)/(1)=23.6","(0+23.6)/(1)=23.6","(0+23.6)/(1)=23.6","(0+23.6)/(1)=23.6","(0+23.6)/(1)=23.6","(0+23.6)/(1)=23.6","(0+23.6)/(1)=23.6","(0+23.6)/(1)=23.6","(0+23.6)/(1)=23.6","(0+23.6)/(1)=23.6","(0+23.6)/(1)=23.6","(0+23.6)/(1)=23.6","(0+23.6)/(1)=23.6"]
["S8","(0+23.1)/(1)=23.1","(0+23.1)/(1)=23.1","(0+23.1)/(1)=23.1","(0+23.1)/(1)=23.1","(0+23.1)/(1)=23.1","(0+23.1)/(1)=23.1","(0+23.1)/(1)=23.1","(0+23.1)/(1)=23.1","(0+23.1)/(1)=23.1","(0+23.1)/(1)=23.1","(0+23.1)/(1)=23.1","(0+23.1)/(1)=23.1","(0+23.1)/(1)=23.1","(0+23.1)/(1)=23.1","(0+23.1)/(1)=23.1","(0+23.1)/(1)=23.1","(0+23.1)/(1)=23.1"]
["S9","(0+22.5)/(1)=22.5","(0+22.5)/(1)=22.5","(0+22.5)/(1)=22.5","(0+22.5)/(1)=22.5","(0+22.5)/(1)=22.5","(0+22.5)/(1)=22.5","(0+22.5)/(1)=22.5","(0+22.5)/(1)=22.5","(0+22.5)/(1)=22.5","(0+22.5)/(1)=22.5","(0+22.5)/(1)=22.5","(0+22.5)/(1)=22.5","(0+22.5)/(1)=22.5","(0+22.5)/(1)=22.5","(0+22.5)/(1)=22.5","(0+22.5)/(1)=22.5","(0+22.5)/(1)=22.5"]
["S10","(0+22)/(1)=22","(0+22)/(1)=22","(0+22)/(1)=22","(0+22)/(1)=22","(0+22)/(1)=22","(0+22)/(1)=22","(0+22)/(1)=22","(0+22)/(1)=22","(0+22)/(1)=22","(0+22)/(1)=22","(0+22)/(1)=22","(0+22)/(1)=22","(0+22)/(1)=22","(0+22)/(1)=22","(0+22)/(1)=22","(0+22)/(1)=22","(0+22)/(1)=22"]
["S11","(0+21.4)/(1)=21.4","(0+21.4)/(1)=21.4","(0+21.4)/(1)=21.4","(0+21.4)/(1)=21.4","(0+21.4)/(1)=21.4","(0+21.4)/(1)=21.4","(0+21.4)/(1)=21.4","(0+21.4)/(1)=21.4","(0+21.4)/(1)=21.4","(0+21.4)/(1)=21.4","(0+21.4)/(1)=21.4","(0+21.4)/(1)=21.4","(0+21.4)/(1)=21.4","(0+21.4)/(1)=21.4","(0+21.4)/(1)=21.4","(0+21.4)/(1)=21.4","(0+21.4)/(1)=21.4"]
["S12","(0+20.9)/(1)=20.9","(0+20.9)/(1)=20.9","(0+20.9)/(1)=20.9","(0+20.9)/(1)=20.9","(0+20.9)/(1)=20.9","(0+20.9)/(1)=20.9","(0+20.9)/(1)=20.9","(0+20.9)/(1)=20.9","(0+20.9)/(1)=20.9","(0+20.9)/(1)=20.9","(0+20.9)/(1)=20.9","(0+20.9)/(1)=20.9","(0+20.9)/(1)=20.9","(0+20.9)/(1)=20.9","(0+20.9)/(1)=20.9","(0+20.9)/(1)=20.9","(0+20.9)/(1)=20.9"]
["S13","(0+20.3)/(1)=20.3","(0+20.3)/(1)=20.3","(0+20.3)/(1)=20.3","(0+20.3)/(1)=20.3","(0+20.3)/(1)=20.3","(0+20.3)/(1)=20.3","(0+20.3)/(1)=20.3","(0+20.3)/(1)=20.3","(0+20.3)/(1)=20.3","(0+20.3)/(1)=20.3","(0+20.3)/(1)=20.3","(0+20.3)/(1)=20.3","(0+20.3)/(1)=20.3","(0+20.3)/(1)=20.3","(0+20.3)/(1)=20.3","(0+20.3)/(1)=20.3","(0+20.3)/(1)=20.3"]
["S14","(0+19.8)/(1)=19.8","(0+19.8)/(1)=19.8","(0+19.8)/(1)=19.8","(0+19.8)/(1)=19.8","(0+19.8)/(1)=19.8","(0+19.8)/(1)=19.8","(0+19.8)/(1)=19.8","(0+19.8)/(1)=19.8","(0+19.8)/(1)=19.8","(0+19.8)/(1)=19.8","(0+19.8)/(1)=19.8","(0+19.8)/(1)=19.8","(0+19.8)/(1)=19.8","(0+19.8)/(1)=19.8","(0+19.8)/(1)=19.8","(0+19.8)/(1)=19.8","(0+19.8)/(1)=19.8"]
["S15","(0+19.2)/(1)=19.2","(0+19.2)/(1)=19.2","(0+19.2)/(1)=19.2","(0+19.2)/(1)=19.2","(0+19.2)/(1)=19.2","(0+19.2)/(1)=19.2","(0+19.2)/(1)=19.2","(0+19.2)/(1)=19.2","(0+19.2)/(1)=19.2","(0+19.2)/(1)=19.2","(0+19.2)/(1)=19.2","(0+19.2)/(1)=19.2","(0+19.2)/(1)=19.2","(0+19.2)/(1)=19.2","(0+19.2)/(1)=19.2","(0+19.2)/(1)=19.2","(0+19.2)/(1)=19.2"]
["S16","(0+18.7)/(1)=18.7","(0+18.7)/(1)=18.7","(0+18.7)/(1)=18.7","(0+18.7)/(1)=18.7","(0+18.7)/(1)=18.7","(0+18.7)/(1)=18.7","(0+18.7)/(1)=18.7","(0+18.7)/(1)=18.7","(0+18.7)/(1)=18.7","(0+18.7)/(1)=18.7","(0+18.7)/(1)=18.7","(0+18.7)/(1)=18.7","(0+18.7)/(1)=18.7","(0+18.7)/(1)=18.7","(0+18.7)/(1)=18.7","(0+18.7)/(1)=18.7","(0+18.7)/(1)=18.7"]
["S17","(0+18.1)/(1)=18.1","(0+18.1)/(1)=18.1","(0+18.1)/(1)=18.1","(0+18.1)/(1)=18.1","(0+18.1)/(1)=18.1","(0+18.1)/(1)=18.1","(0+18.1)/(1)=18.1","(0+18.1)/(1)=18.1","(0+18.1)/(1)=18.1","(0+18.1)/(1)=18.1","(0+18.1)/(1)=18.1","(0+18.1)/(1)=18.1","(0+18.1)/(1)=18.1","(0+18.1)/(1)=18.1","(0+18.1)/(1)=18.1","(0+18.1)/(1)=18.1","(0+18.1)/(1)=18.1"]
["S18","(0+17.6)/(1)=17.6","(0+17.6)/(1)=17.6","(0+17.6)/(1)=17.6","(0+17.6)/(1)=17.6","(0+17.6)/(1)=17.6","(0+17.6)/(1)=17.6","(0+17.6)/(1)=17.6","(0+17.6)/(1)=17.6","(0+17.6)/(1)=17.6","(0+17.6)/(1)=17.6","(0+17.6)/(1)=17.6","(0+17.6)/(1)=17.6","(0+17.6)/(1)=17.6","(0+17.6)/(1)=17.6","(0+17.6)/(1)=17.6","(0+17.6)/(1)=17.6","(0+17.6)/(1)=17.6"]
["S19","(0+17)/(1)=17","(0+17)/(1)=17","(0+17)/(1)=17","(0+17)/(1)=17","(0+17)/(1)=17","(0+17)/(1)=17","(0+17)/(1)=17","(0+17)/(1)=17","(0+17)/(1)=17","(0+17)/(1)=17","(0+17)/(1)=17","(0+17)/(1)=17","(0+17)/(1)=17","(0+17)/(1)=17","(0+17)/(1)=17","(0+17)/(1)=17","(0+17)/(1)=17"]
["S20","(0+16.5)/(1)=16.5","(0+16.5)/(1)=16.5","(0+16.5)/(1)=16.5","(0+16.5)/(1)=16.5","(0+16.5)/(1)=16.5","(0+16.5)/(1)=16.5","(0+16.5)/(1)=16.5","(0+16.5)/(1)=16.5","(0+16.5)/(1)=16.5","(0+16.5)/(1)=16.5","(0+16.5)/(1)=16.5","(0+16.5)/(1)=16.5","(0+16.5)/(1)=16.5","(0+16.5)/(1)=16.5","(0+16.5)/(1)=16.5","(0+16.5)/(1)=16.5","(0+16.5)/(1)=16.5"]
["S21","(0+15.9)/(1)=15.9","(0+15.9)/(1)=15.9","(0+15.9)/(1)=15.9","(0+15.9)/(1)=15.9","(0+15.9)/(1)=15.9","(0+15.9)/(1)=15.9","(0+15.9)/(1)=15.9","(0+15.9)/(1)=15.9","(0+15.9)/(1)=15.9","(0+15.9)/(1)=15.9","(0+15.9)/(1)=15.9","(0+15.9)/(1)=15.9","(0+15.9)/(1)=15.9","(0+15.9)/(1)=15.9","(0+15.9)/(1)=15.9","(0+15.9)/(1)=15.9","(0+15.9)/(1)=15.9"]
["S22","(0+15.4)/(1)=15.4","(0+15.4)/(1)=15.4","(0+15.4)/(1)=15.4","(0+15.4)/(1)=15.4","(0+15.4)/(1)=15.4","(0+15.4)/(1)=15.4","(0+15.4)/(1)=15.4","(0+15.4)/(1)=15.4","(0+15.4)/(1)=15.4","(0+15.4)/(1)=15.4","(0+15.4)/(1)=15.4","(0+15.4)/(1)=15.4","(0+15.4)/(1)=15.4","(0+15.4)/(1)=15.4","(0+15.4)/(1)=15.4","(0+15.4)/(1)=15.4","(0+15.4)/(1)=15.4"]
["S23","(0+14.8)/(1)=14.8","(0+14.8)/(1)=14.8","(0+14.8)/(1)=14.8","(0+14.8)/(1)=14.8","(0+14.8)/(1)=14.8","(0+14.8)/(1)=14.8","(0+14.8)/(1)=14.8","(0+14.8)/(1)=14.8","(0+14.8)/(1)=14.8","(0+14.8)/(1)=14.8","(0+14.8)/(1)=14.8","(0+14.8)/(1)=14.8","(0+14.8)/(1)=14.8","(0+14.8)/(1)=14.8","(0+14.8)/(1)=14.8","(0+14.8)/(1)=14.8","(0+14.8)/(1)=14.8"]
["S24","(0+14.3)/(1)=14.3","(0+14.3)/(1)=14.3","(0+14.3)/(1)=14.3","(0+14.3)/(1)=14.3","(0+14.3)/(1)=14.3","(0+14.3)/(1)=14.3","(0+14.3)/(1)=14.3","(0+14.3)/(1)=14.3","(0+14.3)/(1)=14.3","(0+14.3)/(1)=14.3","(0+14.3)/(1)=14.3","(0+14.3)/(1)=14.3","(0+14.3)/(1)=14.3","(0+14.3)/(1)=14.3","(0+14.3)/(1)=14.3","(0+14.3)/(1)=14.3","(0+14.3)/(1)=14.3"]
["S25","(0+13.7)/(1)=13.7","(0+13.7)/(1)=13.7","(0+13.7)/(1)=13.7","(0+13.7)/(1)=13.7","(0+13.7)/(1)=13.7","(0+13.7)/(1)=13.7","(0+13.7)/(1)=13.7","(0+13.7)/(1)=13.7","(0+13.7)/(1)=13.7","(0+13.7)/(1)=13.7","(0+13.7)/(1)=13.7","(0+13.7)/(1)=13.7","(0+13.7)/(1)=13.7","(0+13.7)/(1)=13.7","(0+13.7)/(1)=13.7","(0+13.7)/(1)=13.7","(0+13.7)/(1)=13.7"]
["S26","(0+13.2)/(1)=13.2","(0+13.2)/(1)=13.2","(0+13.2)/(1)=13.2","(0+13.2)/(1)=13.2","(0+13.2)/(1)=13.2","(0+13.2)/(1)=13.2","(0+13.2)/(1)=13.2","(0+13.2)/(1)=13.2","(0+13.2)/(1)=13.2","(0+13.2)/(1)=13.2","(0+13.2)/(1)=13.2","(0+13.2)/(1)=13.2","(0+13.2)/(1)=13.2","(0+13.2)/(1)=13.2","(0+13.2)/(1)=13.2","(0+13.2)/(1)=13.2","(0+13.2)/(1)=13.2"]
["S27","(0+12.6)/(1)=12.6","(0+12.6)/(1)=12.6","(0+12.6)/(1)=12.6","(0+12.6)/(1)=12.6","(0+12.6)/(1)=12.6","(0+12.6)/(1)=12.6","(0+12.6)/(1)=12.6","(0+12.6)/(1)=12.6","(0+12.6)/(1)=12.6","(0+12.6)/(1)=12.6","(0+12.6)/(1)=12.6","(0+12.6)/(1)=12.6","(0+12.6)/(1)=12.6","(0+12.6)/(1)=12.6","(0+12.6)/(1)=12.6","(0+12.6)/(1)=12.6","(0+12.6)/(1)=12.6"]
["S28","(0+12.1)/(1)=12.1","(0+12.1)/(1)=12.1","(0+12.1)/(1)=12.1","(0+12.1)/(1)=12.1","(0+12.1)/(1)=12.1","(0+12.1)/(1)=12.1","(0+12.1)/(1)=12.1","(0+12.1)/(1)=12.1","(0+12.1)/(1)=12.1","(0+12.1)/(1)=12.1","(0+12.1)/(1)=12.1","(0+12.1)/(1)=12.1","(0+12.1)/(1)=12.1","(0+12.1)/(1)=12.1","(0+12.1)/(1)=12.1","(0+12.1)/(1)=12.1","(0+12.1)/(1)=12.1"]
["S29","(0+11.5)/(1)=11.5","(0+11.5)/(1)=11.5","(0+11.5)/(1)=11.5","(0+11.5)/(1)=11.5","(0+11.5)/(1)=11.5","(0+11.5)/(1)=11.5","(0+11.5)/(1)=11.5","(0+11.5)/(1)=11.5","(0+11.5)/(1)=11.5","(0+11.5)/(1)=11.5","(0+11.5)/(1)=11.5","(0+11.5)/(1)=11.5","(0+11.5)/(1)=11.5","(0+11.5)/(1)=11.5","(0+11.5)/(1)=11.5","(0+11.5)/(1)=11.5","(0+11.5)/(1)=11.5"]
["S30","(0+11)/(1)=11","(0+11)/(1)=11","(0+11)/(1)=11","(0+11)/(1)=11","(0+11)/(1)=11","(0+11)/(1)=11","(0+11)/(1)=11","(0+11)/(1)=11","(0+11)/(1)=11","(0+11)/(1)=11","(0+11)/(1)=11","(0+11)/(1)=11","(0+11)/(1)=11","(0+11)/(1)=11","(0+11)/(1)=11","(0+11)/(1)=11","(0+11)/(1)=11"]
["S31","(0+10.4)/(1)=10.4","(0+10.4)/(1)=10.4","(0+10.4)/(1)=10.4","(0+10.4)/(1)=10.4","(0+10.4)/(1)=10.4","(0+10.4)/(1)=10.4","(0+10.4)/(1)=10.4","(0+10.4)/(1)=10.4","(0+10.4)/(1)=10.4","(0+10.4)/(1)=10.4","(0+10.4)/(1)=10.4","(0+10.4)/(1)=10.4","(0+10.4)/(1)=10.4","(0+10.4)/(1)=10.4","(0+10.4)/(1)=10.4","(0+10.4)/(1)=10.4","(0+10.4)/(1)=10.4"]
["S32","(0+9.9)/(1)=9.9","(0+9.9)/(1)=9.9","(0+9.9)/(1)=9.9","(0+9.9)/(1)=9.9","(0+9.9)/(1)=9.9","(0+9.9)/(1)=9.9","(0+9.9)/(1)=9.9","(0+9.9)/(1)=9.9","(0+9.9)/(1)=9.9","(0+9.9)/(1)=9.9","(0+9.9)/(1)=9.9","(0+9.9)/(1)=9.9","(0+9.9)/(1)=9.9","(0+9.9)/(1)=9.9","(0+9.9)/(1)=9.9","(0+9.9)/(1)=9.9","(0+9.9)/(1)=9.9"]
["S33","(0+9.3)/(1)=9.3","(0+9.3)/(1)=9.3","(0+9.3)/(1)=9.3","(0+9.3)/(1)=9.3","(0+9.3)/(1)=9.3","(0+9.3)/(1)=9.3","(0+9.3)/(1)=9.3","(0+9.3)/(1)=9.3","(0+9.3)/(1)=9.3","(0+9.3)/(1)=9.3","(0+9.3)/(1)=9.3","(0+9.3)/(1)=9.3","(0+9.3)/(1)=9.3","(0+9.3)/(1)=9.3","(0+9.3)/(1)=9.3","(0+9.3)/(1)=9.3","(0+9.3)/(1)=9.3"]
["S34","(0+8.8)/(1)=8.8","(0+8.8)/(1)=8.8","(0+8.8)/(1)=8.8","(0+8.8)/(1)=8.8","(0+8.8)/(1)=8.8","(0+8.8)/(1)=8.8","(0+8.8)/(1)=8.8","(0+8.8)/(1)=8.8","(0+8.8)/(1)=8.8","(0+8.8)/(1)=8.8","(0+8.8)/(1)=8.8","(0+8.8)/(1)=8.8","(0+8.8)/(1)=8.8","(0+8.8)/(1)=8.8","(0+8.8)/(1)=8.8","(0+8.8)/(1)=8.8","(0+8.8)/(1)=8.8"]
["S35","(0+8.2)/(1)=8.2","(0+8.2)/(1)=8.2","(0+8.2)/(1)=8.2","(0+8.2)/(1)=8.2","(0+8.2)/(1)=8.2","(0+8.2)/(1)=8.2","(0+8.2)/(1)=8.2","(0+8.2)/(1)=8.2","(0+8.2)/(1)=8.2","(0+8.2)/(1)=8.2","(0+8.2)/(1)=8.2","(0+8.2)/(1)=8.2","(0+8.2)/(1)=8.2","(0+8.2)/(1)=8.2","(0+8.2)/(1)=8.2","(0+8.2)/(1)=8.2","(0+8.2)/(1)=8.2"]
["S36","(0+7.7)/(1)=7.7","(0+7.7)/(1)=7.7","(0+7.7)/(1)=7.7","(0+7.7)/(1)=7.7","(0+7.7)/(1)=7.7","(0+7.7)/(1)=7.7","(0+7.7)/(1)=7.7","(0+7.7)/(1)=7.7","(0+7.7)/(1)=7.7","(0+7.7)/(1)=7.7","(0+7.7)/(1)=7.7","(0+7.7)/(1)=7.7","(0+7.7)/(1)=7.7","(0+7.7)/(1)=7.7","(0+7.7)/(1)=7.7","(0+7.7)/(1)=7.7","(0+7.7)/(1)=7.7"]
["S37","(0+7.1)/(1)=7.1","(0+7.1)/(1)=7.1","(0+7.1)/(1)=7.1","(0+7.1)/(1)=7.1","(0+7.1)/(1)=7.1","(0+7.1)/(1)=7.1","(0+7.1)/(1)=7.1","(0+7.1)/(1)=7.1","(0+7.1)/(1)=7.1","(0+7.1)/(1)=7.1","(0+7.1)/(1)=7.1","(0+7.1)/(1)=7.1","(0+7.1)/(1)=7.1","(0+7.1)/(1)=7.1","(0+7.1)/(1)=7.1","(0+7.1)/(1)=7.1","(0+7.1)/(1)=7.1"]
["S38","(0+6.6)/(1)=6.6","(0+6.6)/(1)=6.6","(0+6.6)/(1)=6.6","(0+6.6)/(1)=6.6","(0+6.6)/(1)=6.6","(0+6.6)/(1)=6.6","(0+6.6)/(1)=6.6","(0+6.6)/(1)=6.6","(0+6.6)/(1)=6.6","(0+6.6)/(1)=6.6","(0+6.6)/(1)=6.6","(0+6.6)/(1)=6.6","(0+6.6)/(1)=6.6","(0+6.6)/(1)=6.6","(0+6.6)/(1)=6.6","(0+6.6)/(1)=6.6","(0+6.6)/(1)=6.6"]
["S39","(0+6)/(1)=6","(0+6)/(1)=6","(0+6)/(1)=6","(0+6)/(1)=6","(0+6)/(1)=6","(0+6)/(1)=6","(0+6)/(1)=6","(0+6)/(1)=6","(0+6)/(1)=6","(0+6)/(1)=6","(0+6)/(1)=6","(0+6)/(1)=6","(0+6)/(1)=6","(0+6)/(1)=6","(0+6)/(1)=6","(0+6)/(1)=6","(0+6)/(1)=6"]
["S40","(0+5.5)/(1)=5.5","(0+5.5)/(1)=5.5","(0+5.5)/(1)=5.5","(0+5.5)/(1)=5.5","(0+5.5)/(1)=5.5","(0+5.5)/(1)=5.5","(0+5.5)/(1)=5.5","(0+5.5)/(1)=5.5","(0+5.5)/(1)=5.5","(0+5.5)/(1)=5.5","(0+5.5)/(1)=5.5","(0+5.5)/(1)=5.5","(0+5.5)/(1)=5.5","(0+5.5)/(1)=5.5","(0+5.5)/(1)=5.5","(0+5.5)/(1)=5.5","(0+5.5)/(1)=5.5"]
["S41","(0+4.9)/(1)=4.9","(0+4.9)/(1)=4.9","(0+4.9)/(1)=4.9","(0+4.9)/(1)=4.9","(0+4.9)/(1)=4.9","(0+4.9)/(1)=4.9","(0+4.9)/(1)=4.9","(0+4.9)/(1)=4.9","(0+4.9)/(1)=4.9","(0+4.9)/(1)=4.9","(0+4.9)/(1)=4.9","(0+4.9)/(1)=4.9","(0+4.9)/(1)=4.9","(0+4.9)/(1)=4.9","(0+4.9)/(1)=4.9","(0+4.9)/(1)=4.9","(0+4.9)/(1)=4.9"]
["S42","(0+4.4)/(1)=4.4","(0+4.4)/(1)=4.4","(0+4.4)/(1)=4.4","(0+4.4)/(1)=4.4","(0+4.4)/(1)=4.4","(0+4.4)/(1)=4.4","(0+4.4)/(1)=4.4","(0+4.4)/(1)=4.4","(0+4.4)/(1)=4.4","(0+4.4)/(1)=4.4","(0+4.4)/(1)=4.4","(0+4.4)/(1)=4.4","(0+4.4)/(1)=4.4","(0+4.4)/(1)=4.4","(0+4.4)/(1)=4.4","(0+4.4)/(1)=4.4","(0+4.4)/(1)=4.4"]
["S43","(0+3.8)/(1)=3.8","(0+3.8)/(1)=3.8","(0+3.8)/(1)=3.8","(0+3.8)/(1)=3.8","(0+3.8)/(1)=3.8","(0+3.8)/(1)=3.8","(0+3.8)/(1)=3.8","(0+3.8)/(1)=3.8","(0+3.8)/(1)=3.8","(0+3.8)/(1)=3.8","(0+3.8)/(1)=3.8","(0+3.8)/(1)=3.8","(0+3.8)/(1)=3.8","(0+3.8)/(1)=3.8","(0+3.8)/(1)=3.8","(0+3.8)/(1)=3.8","(0+3.8)/(1)=3.8"]
["S44","(0+3.3)/(1)=3.3","(0+3.3)/(1)=3.3","(0+3.3)/(1)=3.3","(0+3.3)/(1)=3.3","(0+3.3)/(1)=3.3","(0+3.3)/(1)=3.3","(0+3.3)/(1)=3.3","(0+3.3)/(1)=3.3","(0+3.3)/(1)=3.3","(0+3.3)/(1)=3.3","(0+3.3)/(1)=3.3","(0+3.3)/(1)=3.3","(0+3.3)/(1)=3.3","(0+3.3)/(1)=3.3","(0+3.3)/(1)=3.3","(0+3.3)/(1)=3.3","(0+3.3)/(1)=3.3"]
["S45","(0+2.7)/(1)=2.7","(0+2.7)/(1)=2.7","(0+2.7)/(1)=2.7","(0+2.7)/(1)=2.7","(0+2.7)/(1)=2.7","(0+2.7)/(1)=2.7","(0+2.7)/(1)=2.7","(0+2.7)/(1)=2.7","(0+2.7)/(1)=2.7","(0+2.7)/(1)=2.7","(0+2.7)/(1)=2.7","(0+2.7)/(1)=2.7","(0+2.7)/(1)=2.7","(0+2.7)/(1)=2.7","(0+2.7)/(1)=2.7","(0+2.7)/(1)=2.7","(0+2.7)/(1)=2.7"]
["S46","(0+2.2)/(1)=2.2","(0+2.2)/(1)=2.2","(0+2.2)/(1)=2.2","(0+2.2)/(1)=2.2","(0+2.2)/(1)=2.2","(0+2.2)/(1)=2.2","(0+2.2)/(1)=2.2","(0+2.2)/(1)=2.2","(0+2.2)/(1)=2.2","(0+2.2)/(1)=2.2","(0+2.2)/(1)=2.2","(0+2.2)/(1)=2.2","(0+2.2)/(1)=2.2","(0+2.2)/(1)=2.2","(0+2.2)/(1)=2.2","(0+2.2)/(1)=2.2","(0+2.2)/(1)=2.2"]
["S47","(0+1.6)/(1)=1.6","(0+1.6)/(1)=1.6","(0+1.6)/(1)=1.6","(0+1.6)/(1)=1.6","(0+1.6)/(1)=1.6","(0+1.6)/(1)=1.6","(0+1.6)/(1)=1.6","(0+1.6)/(1)=1.6","(0+1.6)/(1)=1.6","(0+1.6)/(1)=1.6","(0+1.6)/(1)=1.6","(0+1.6)/(1)=1.6","(0+1.6)/(1)=1.6","(0+1.6)/(1)=1.6","(0+1.6)/(1)=1.6","(0+1.6)/(1)=1.6","(0+1.6)/(1)=1.6"]
["S48","(0+1.1)/(1)=1.1","(0+1.1)/(1)=1.1","(0+1.1)/(1)=1.1","(0+1.1)/(1)=1.1","(0+1.1)/(1)=1.1","(0+1.1)/(1)=1.1","(0+1.1)/(1)=1.1","(0+1.1)/(1)=1.1","(0+1.1)/(1)=1.1","(0+1.1)/(1)=1.1","(0+1.1)/(1)=1.1","(0+1.1)/(1)=1.1","(0+1.1)/(1)=1.1","(0+1.1)/(1)=1.1","(0+1.1)/(1)=1.1","(0+1.1)/(1)=1.1","(0+1.1)/(1)=1.1"]
["S49","(0+0.5)/(1)=0.5","(0+0.5)/(1)=0.5","(0+0.5)/(1)=0.5","(0+0.5)/(1)=0.5","(0+0.5)/(1)=0.5","(0+0.5)/(1)=0.5","(0+0.5)/(1)=0.5","(0+0.5)/(1)=0.5","(0+0.5)/(1)=0.5","(0+0.5)/(1)=0.5","(0+0.5)/(1)=0.5","(0+0.5)/(1)=0.5","(0+0.5)/(1)=0.5","(0+0.5)/(1)=0.5","(0+0.5)/(1)=0.5","(0+0.5)/(1)=0.5","(0+0.5)/(1)=0.5"]
["S50","(0+0)/(1)=0","(0+0)/(1)=0","(0+0)/(1)=0","(0+0)/(1)=0","(0+0)/(1)=0","(0+0)/(1)=0","(0+0)/(1)=0","(0+0)/(1)=0","(0+0)/(1)=0","(0+0)/(1)=0","(0+0)/(1)=0","(0+0)/(1)=0","(0+0)/(1)=0","(0+0)/(1)=0","(0+0)/(1)=0","(0+0)/(1)=0","(0+0)/(1)=0"]
[]
["Lépcsők(2)","X(A1)","X(A2)","X(A3)","X(A4)","X(A5)","X(A6)","X(A7)","X(A8)","X(A9)","X(A10)","X(A11)","X(A12)","X(A13)","X(A14)","X(A15)","X(A16)","X(A17)"]
["S1",26.9,26.9,26.9,26.9,26.9,26.9,26.9,26.9,26.9,26.9,26.9,26.9,26.9,26.9,26.9,26.9,26.9]
["S2",26.4,26.4,26.4,26.4,26.4,26.4,26.4,26.4,26.4,26.4,26.4,26.4,26.4,26.4,26.4,26.4,26.4]
["S3",25.8,25.8,25.8,25.8,25.8,25.8,25.8,25.8,25.8,25.8,25.8,25.8,25.8,25.8,25.8,25.8,25.8]
["S4",25.3,25.3,25.3,25.3,25.3,25.3,25.3,25.3,25.3,25.3,25.3,25.3,25.3,25.3,25.3,25.3,25.3]
["S5",24.7,24.7,24.7,24.7,24.7,24.7,24.7,24.7,24.7,24.7,24.7,24.7,24.7,24.7,24.7,24.7,24.7]
["S6",24.2,24.2,24.2,24.2,24.2,24.2,24.2,24.2,24.2,24.2,24.2,24.2,24.2,24.2,24.2,24.2,24.2]
["S7",23.6,23.6,23.6,23.6,23.6,23.6,23.6,23.6,23.6,23.6,23.6,23.6,23.6,23.6,23.6,23.6,23.6]
["S8",23.1,23.1,23.1,23.1,23.1,23.1,23.1,23.1,23.1,23.1,23.1,23.1,23.1,23.1,23.1,23.1,23.1]
["S9",22.5,22.5,22.5,22.5,22.5,22.5,22.5,22.5,22.5,22.5,22.5,22.5,22.5,22.5,22.5,22.5,22.5]
["S10",22,22,22,22,22,22,22,22,22,22,22,22,22,22,22,22,22]
["S11",21.4,21.4,21.4,21.4,21.4,21.4,21.4,21.4,21.4,21.4,21.4,21.4,21.4,21.4,21.4,21.4,21.4]
["S12",20.9,20.9,20.9,20.9,20.9,20.9,20.9,20.9,20.9,20.9,20.9,20.9,20.9,20.9,20.9,20.9,20.9]
["S13",20.3,20.3,20.3,20.3,20.3,20.3,20.3,20.3,20.3,20.3,20.3,20.3,20.3,20.3,20.3,20.3,20.3]
["S14",19.8,19.8,19.8,19.8,19.8,19.8,19.8,19.8,19.8,19.8,19.8,19.8,19.8,19.8,19.8,19.8,19.8]
["S15",19.2,19.2,19.2,19.2,19.2,19.2,19.2,19.2,19.2,19.2,19.2,19.2,19.2,19.2,19.2,19.2,19.2]
["S16",18.7,18.7,18.7,18.7,18.7,18.7,18.7,18.7,18.7,18.7,18.7,18.7,18.7,18.7,18.7,18.7,18.7]
["S17",18.100000000000001,18.100000000000001,18.100000000000001,18.100000000000001,18.100000000000001,18.100000000000001,18.100000000000001,18.100000000000001,18.100000000000001,18.100000000000001,18.100000000000001,18.100000000000001,18.100000000000001,18.100000000000001,18.100000000000001,18.100000000000001,18.100000000000001]
["S18",17.600000000000001,17.600000000000001,17.600000000000001,17.600000000000001,17.600000000000001,17.600000000000001,17.600000000000001,17.600000000000001,17.600000000000001,17.600000000000001,17.600000000000001,17.600000000000001,17.600000000000001,17.600000000000001,17.600000000000001,17.600000000000001,17.600000000000001]
["S19",17,17,17,17,17,17,17,17,17,17,17,17,17,17,17,17,17]
["S20",16.5,16.5,16.5,16.5,16.5,16.5,16.5,16.5,16.5,16.5,16.5,16.5,16.5,16.5,16.5,16.5,16.5]
["S21",15.9,15.9,15.9,15.9,15.9,15.9,15.9,15.9,15.9,15.9,15.9,15.9,15.9,15.9,15.9,15.9,15.9]
["S22",15.4,15.4,15.4,15.4,15.4,15.4,15.4,15.4,15.4,15.4,15.4,15.4,15.4,15.4,15.4,15.4,15.4]
["S23",14.8,14.8,14.8,14.8,14.8,14.8,14.8,14.8,14.8,14.8,14.8,14.8,14.8,14.8,14.8,14.8,14.8]
["S24",14.3,14.3,14.3,14.3,14.3,14.3,14.3,14.3,14.3,14.3,14.3,14.3,14.3,14.3,14.3,14.3,14.3]
["S25",13.7,13.7,13.7,13.7,13.7,13.7,13.7,13.7,13.7,13.7,13.7,13.7,13.7,13.7,13.7,13.7,13.7]
["S26",13.2,13.2,13.2,13.2,13.2,13.2,13.2,13.2,13.2,13.2,13.2,13.2,13.2,13.2,13.2,13.2,13.2]
["S27",12.6,12.6,12.6,12.6,12.6,12.6,12.6,12.6,12.6,12.6,12.6,12.6,12.6,12.6,12.6,12.6,12.6]
["S28",12.1,12.1,12.1,12.1,12.1,12.1,12.1,12.1,12.1,12.1,12.1,12.1,12.1,12.1,12.1,12.1,12.1]
["S29",11.5,11.5,11.5,11.5,11.5,11.5,11.5,11.5,11.5,11.5,11.5,11.5,11.5,11.5,11.5,11.5,11.5]
["S30",11,11,11,11,11,11,11,11,11,11,11,11,11,11,11,11,11]
["S31",10.4,10.4,10.4,10.4,10.4,10.4,10.4,10.4,10.4,10.4,10.4,10.4,10.4,10.4,10.4,10.4,10.4]
["S32",9.9,9.9,9.9,9.9,9.9,9.9,9.9,9.9,9.9,9.9,9.9,9.9,9.9,9.9,9.9,9.9,9.9]
["S33",9.3000000000000007,9.3000000000000007,9.3000000000000007,9.3000000000000007,9.3000000000000007,9.3000000000000007,9.3000000000000007,9.3000000000000007,9.3000000000000007,9.3000000000000007,9.3000000000000007,9.3000000000000007,9.3000000000000007,9.3000000000000007,9.3000000000000007,9.3000000000000007,9.3000000000000007]
["S34",8.8000000000000007,8.8000000000000007,8.8000000000000007,8.8000000000000007,8.8000000000000007,8.8000000000000007,8.8000000000000007,8.8000000000000007,8.8000000000000007,8.8000000000000007,8.8000000000000007,8.8000000000000007,8.8000000000000007,8.8000000000000007,8.8000000000000007,8.8000000000000007,8.8000000000000007]
["S35",8.1999999999999993,8.1999999999999993,8.1999999999999993,8.1999999999999993,8.1999999999999993,8.1999999999999993,8.1999999999999993,8.1999999999999993,8.1999999999999993,8.1999999999999993,8.1999999999999993,8.1999999999999993,8.1999999999999993,8.1999999999999993,8.1999999999999993,8.1999999999999993,8.1999999999999993]
["S36",7.7,7.7,7.7,7.7,7.7,7.7,7.7,7.7,7.7,7.7,7.7,7.7,7.7,7.7,7.7,7.7,7.7]
["S37",7.1,7.1,7.1,7.1,7.1,7.1,7.1,7.1,7.1,7.1,7.1,7.1,7.1,7.1,7.1,7.1,7.1]
["S38",6.6,6.6,6.6,6.6,6.6,6.6,6.6,6.6,6.6,6.6,6.6,6.6,6.6,6.6,6.6,6.6,6.6]
["S39",6,6,6,6,6,6,6,6,6,6,6,6,6,6,6,6,6]
["S40",5.5,5.5,5.5,5.5,5.5,5.5,5.5,5.5,5.5,5.5,5.5,5.5,5.5,5.5,5.5,5.5,5.5]
["S41",4.9000000000000004,4.9000000000000004,4.9000000000000004,4.9000000000000004,4.9000000000000004,4.9000000000000004,4.9000000000000004,4.9000000000000004,4.9000000000000004,4.9000000000000004,4.9000000000000004,4.9000000000000004,4.9000000000000004,4.9000000000000004,4.9000000000000004,4.9000000000000004,4.9000000000000004]
["S42",4.4000000000000004,4.4000000000000004,4.4000000000000004,4.4000000000000004,4.4000000000000004,4.4000000000000004,4.4000000000000004,4.4000000000000004,4.4000000000000004,4.4000000000000004,4.4000000000000004,4.4000000000000004,4.4000000000000004,4.4000000000000004,4.4000000000000004,4.4000000000000004,4.4000000000000004]
["S43",3.8,3.8,3.8,3.8,3.8,3.8,3.8,3.8,3.8,3.8,3.8,3.8,3.8,3.8,3.8,3.8,3.8]
["S44",3.3,3.3,3.3,3.3,3.3,3.3,3.3,3.3,3.3,3.3,3.3,3.3,3.3,3.3,3.3,3.3,3.3]
["S45",2.7,2.7,2.7,2.7,2.7,2.7,2.7,2.7,2.7,2.7,2.7,2.7,2.7,2.7,2.7,2.7,2.7]
["S46",2.2000000000000002,2.2000000000000002,2.2000000000000002,2.2000000000000002,2.2000000000000002,2.2000000000000002,2.2000000000000002,2.2000000000000002,2.2000000000000002,2.2000000000000002,2.2000000000000002,2.2000000000000002,2.2000000000000002,2.2000000000000002,2.2000000000000002,2.2000000000000002,2.2000000000000002]
["S47",1.6,1.6,1.6,1.6,1.6,1.6,1.6,1.6,1.6,1.6,1.6,1.6,1.6,1.6,1.6,1.6,1.6]
["S48",1.1000000000000001,1.1000000000000001,1.1000000000000001,1.1000000000000001,1.1000000000000001,1.1000000000000001,1.1000000000000001,1.1000000000000001,1.1000000000000001,1.1000000000000001,1.1000000000000001,1.1000000000000001,1.1000000000000001,1.1000000000000001,1.1000000000000001,1.1000000000000001,1.1000000000000001]
["S49",0.5,0.5,0.5,0.5,0.5,0.5,0.5,0.5,0.5,0.5,0.5,0.5,0.5,0.5,0.5,0.5,0.5]
["S50",0,0,0,0,0,0,0,0,0,0,0,0,0,0,0,0,0]
[]
["COCO:Y0","X(A1)","X(A2)","X(A3)","X(A4)","X(A5)","X(A6)","X(A7)","X(A8)","X(A9)","X(A10)","X(A11)","X(A12)","X(A13)","X(A14)","X(A15)","X(A16)","X(A17)","Becslés","Tény+0","Delta","Delta/Tény"]
["O1",18.100000000000001,19.2,26.9,26.9,20.9,26.9,9.3000000000000007,4.9000000000000004,17,15.9,14.3,23.1,18.7,8.8000000000000007,2.7,15.9,26.9,296.5,100,-196.5,-196.5]
["O2",6,19.2,26.9,16.5,9.3000000000000007,26.9,26.9,24.2,7.1,25.3,14.3,12.1,26.9,8.8000000000000007,12.1,15.9,26.9,305.3,100,-205.3,-205.3]
["O3",18.100000000000001,19.2,26.9,16.5,26.9,26.9,13.7,20.9,25.8,6.6,26.4,23.1,18.7,8.8000000000000007,24.7,15.9,13.7,332.8,100,-232.8,-232.8]
["O4",6,19.2,26.9,26.9,9.3000000000000007,26.9,13.7,14.8,25.8,6.6,14.3,12.1,26.9,8.8000000000000007,24.7,15.9,9.9,288.89999999999998,100,-188.9,-188.9]
["O5",18.100000000000001,19.2,26.9,16.5,20.9,26.9,19.8,14.8,25.8,15.9,14.3,12.1,18.7,19.8,24.7,15.9,13.7,324,100,-224,-224]
["O6",18.100000000000001,19.2,26.9,16.5,9.3000000000000007,26.9,26.9,14.8,7.1,6.6,23.1,26.9,26.9,19.8,24.7,15.9,20.3,330,100,-230,-230]
["O7",18.100000000000001,25.8,9.9,16.5,20.9,7.7,3.3,24.2,25.8,25.3,23.1,12.1,4.9000000000000004,26.4,24.7,24.7,20.3,313.60000000000002,100,-213.6,-213.6]
["O8",18.100000000000001,19.2,26.9,26.9,9.3000000000000007,26.9,26.9,26.9,7.1,25.3,14.3,12.1,26.9,8.8000000000000007,24.7,15.9,9.9,326.2,100,-226.2,-226.2]
["O9",25.8,19.2,26.9,3.3,20.9,26.9,9.3000000000000007,9.3000000000000007,25.8,25.3,14.3,12.1,26.9,8.8000000000000007,24.7,24.7,26.9,331.1,100,-231.1,-231.1]
["O10",18.100000000000001,25.8,26.9,3.3,24.2,26.9,9.3000000000000007,24.2,25.8,15.9,23.1,23.1,26.9,26.4,26.9,24.7,15.4,366.8,100,-266.8,-266.8]
["O11",25.8,26.9,9.9,3.3,20.9,7.7,19.8,26.9,26.9,26.9,25.8,26.9,18.7,26.4,26.9,24.7,21.4,365.7,100,-265.7,-265.7]
["O12",6,19.2,26.9,26.9,9.3000000000000007,26.9,19.8,24.2,25.8,15.9,14.3,12.1,4.9000000000000004,8.8000000000000007,2.7,15.9,9.9,269.60000000000002,100,-169.6,-169.6]
["O13",6,19.2,26.9,26.9,20.9,7.7,19.8,14.8,7.1,6.6,14.3,23.1,18.7,8.8000000000000007,24.7,15.9,13.7,275.10000000000002,100,-175.1,-175.1]
["O14",18.100000000000001,19.2,26.9,26.9,26.9,26.9,19.8,20.9,7.1,25.3,14.3,12.1,26.9,8.8000000000000007,24.7,26.9,26.9,358.6,100,-258.60000000000002,-258.60000000000002]
["O15",6,25.8,1.6,3.3,20.9,26.9,26.9,26.9,25.8,15.9,14.3,12.1,26.9,26.4,24.7,26.9,9.9,321.2,100,-221.2,-221.2]
["O16",25.8,19.2,26.9,3.3,20.9,7.7,19.8,9.3000000000000007,17,25.3,23.1,23.1,9.3000000000000007,19.8,24.7,24.7,13.7,313.60000000000002,100,-213.6,-213.6]
["O17",25.8,19.2,9.9,16.5,20.9,7.7,9.3000000000000007,9.3000000000000007,17,25.3,23.1,26.9,18.7,26.9,26.9,15.9,9.9,309.2,100,-209.2,-209.2]
["O18",25.8,19.2,9.9,16.5,20.9,26.9,22,20.9,17,25.3,23.1,23.1,9.3000000000000007,8.8000000000000007,12.1,15.9,9.9,306.39999999999998,100,-206.4,-206.4]
["O19",25.8,19.2,26.9,26.9,9.3000000000000007,1.1000000000000001,9.3000000000000007,9.3000000000000007,7.1,15.9,14.3,26.9,26.9,19.8,12.1,15.9,9.9,276.8,100,-176.8,-176.8]
["O20",25.8,19.2,26.9,16.5,24.2,26.9,26.9,26.9,7.1,6.6,25.8,26.9,26.9,19.8,24.7,24.7,20.3,376.2,100,-276.2,-276.2]
["O21",18.100000000000001,19.2,9.9,16.5,24.2,26.9,22,14.8,17,25.3,14.3,23.1,4.9000000000000004,19.8,24.7,15.9,26.9,323.39999999999998,100,-223.4,-223.4]
["O22",25.8,19.2,26.9,16.5,24.2,26.9,19.8,20.9,17,26.9,25.8,26.9,9.3000000000000007,19.8,26.9,24.7,20.3,377.8,100,-277.8,-277.8]
["O23",18.100000000000001,25.8,4.4000000000000004,16.5,20.9,7.7,9.3000000000000007,20.9,25.8,15.9,23.1,12.1,3.3,26.4,24.7,24.7,26.9,306.39999999999998,100,-206.4,-206.4]
["O24",6,19.2,26.9,26.9,20.9,26.9,3.3,4.9000000000000004,7.1,6.6,14.3,12.1,26.9,8.8000000000000007,2.7,15.9,26.9,256.5,100,-156.5,-156.5]
["O25",18.100000000000001,19.2,26.9,16.5,9.3000000000000007,26.9,26.9,20.9,17,25.3,23.1,23.1,26.9,19.8,24.7,15.9,9.9,350.4,100,-250.4,-250.4]
["O26",18.100000000000001,19.2,9.9,16.5,9.3000000000000007,26.9,19.8,4.9000000000000004,25.8,6.6,23.1,23.1,3.3,8.8000000000000007,12.1,15.9,20.3,263.60000000000002,100,-163.6,-163.6]
["O27",18.100000000000001,25.8,4.4000000000000004,16.5,20.9,7.7,22,20.9,17,25.3,25.8,23.1,18.7,26.4,12.1,24.7,9.9,319.10000000000002,100,-219.1,-219.1]
["O28",18.100000000000001,25.8,9.9,16.5,9.3000000000000007,26.9,19.8,24.2,17,15.9,23.1,12.1,9.3000000000000007,19.8,12.1,24.7,9.9,294.3,100,-194.3,-194.3]
["O29",25.8,19.2,26.9,26.9,9.3000000000000007,26.9,22,9.3000000000000007,7.1,15.9,23.1,23.1,9.3000000000000007,19.8,12.1,15.9,9.9,302.60000000000002,100,-202.6,-202.6]
["O30",18.100000000000001,19.2,26.9,16.5,20.9,26.9,19.8,14.8,17,15.9,14.3,23.1,18.7,26.4,12.1,24.7,9.9,325.10000000000002,100,-225.1,-225.1]
["O31",6,19.2,26.9,26.9,20.9,26.9,3.3,4.9000000000000004,7.1,6.6,14.3,12.1,26.9,8.8000000000000007,2.7,15.9,26.9,256.5,100,-156.5,-156.5]
["O32",25.8,19.2,26.9,16.5,9.3000000000000007,7.7,9.3000000000000007,9.3000000000000007,7.1,6.6,14.3,12.1,2.2000000000000002,19.8,24.7,15.9,26.9,253.7,100,-153.69999999999999,-153.69999999999999]
["O33",25.8,19.2,26.9,16.5,20.9,26.9,26.9,14.8,25.8,15.9,14.3,12.1,26.9,8.8000000000000007,24.7,15.9,15.4,337.7,100,-237.7,-237.7]
["O34",18.100000000000001,19.2,26.9,26.9,24.2,1.1000000000000001,13.7,4.9000000000000004,17,15.9,14.3,23.1,9.3000000000000007,8.8000000000000007,12.1,15.9,26.9,278.39999999999998,100,-178.4,-178.4]
["O35",6,25.8,26.9,26.9,20.9,26.9,9.3000000000000007,20.9,17,6.6,14.3,12.1,18.7,26.4,12.1,26.9,9.9,307.5,100,-207.5,-207.5]
["O36",26.9,19.2,26.9,26.9,25.8,7.7,13.7,20.9,17,25.3,23.1,23.1,18.7,8.8000000000000007,24.7,24.7,9.9,343.2,100,-243.2,-243.2]
["O37",6,25.8,9.9,26.9,25.8,1.1000000000000001,3.3,4.9000000000000004,17,25.3,14.3,12.1,18.7,26.4,12.1,15.9,9.9,255.4,100,-155.4,-155.4]
["O38",6,19.2,26.9,26.9,9.3000000000000007,26.9,9.3000000000000007,4.9000000000000004,7.1,6.6,14.3,12.1,26.9,19.8,2.7,15.9,20.3,255.4,100,-155.4,-155.4]
["O39",18.100000000000001,19.2,26.9,16.5,9.3000000000000007,26.9,9.3000000000000007,9.3000000000000007,17,15.9,14.3,23.1,18.7,19.8,12.1,15.9,21.4,293.8,100,-193.8,-193.8]
["O40",18.100000000000001,19.2,1.6,26.9,9.3000000000000007,26.9,9.3000000000000007,4.9000000000000004,26.9,25.3,25.8,12.1,2.2000000000000002,19.8,12.1,15.9,9.9,266.3,100,-166.3,-166.3]
["O41",6,19.2,4.4000000000000004,16.5,20.9,7.7,13.7,4.9000000000000004,25.8,15.9,14.3,12.1,9.3000000000000007,26.4,24.7,24.7,20.3,266.89999999999998,100,-166.9,-166.9]
["O42",18.100000000000001,25.8,9.9,3.3,20.9,7.7,13.7,14.8,25.8,25.3,23.1,23.1,18.7,19.8,12.1,24.7,20.3,307,100,-207,-207]
["O43",18.100000000000001,25.8,9.9,16.5,24.2,26.9,3.3,9.3000000000000007,25.8,6.6,23.1,23.1,18.7,19.8,24.7,26.9,15.4,318,100,-218,-218]
["O44",25.8,19.2,26.9,26.9,20.9,26.9,19.8,14.8,25.8,25.3,14.3,23.1,18.7,19.8,24.7,15.9,13.7,362.4,100,-262.39999999999998,-262.39999999999998]
["O45",26.9,26.4,1.6,16.5,9.3000000000000007,7.7,3.3,26.9,17,25.3,26.9,26.9,2.2000000000000002,26.4,12.1,24.7,9.9,289.89999999999998,100,-189.9,-189.9]
["O46",25.8,25.8,26.9,3.3,9.3000000000000007,26.9,13.7,20.9,7.1,15.9,14.3,12.1,18.7,19.8,24.7,24.7,13.7,303.7,100,-203.7,-203.7]
["O47",18.100000000000001,19.2,26.9,16.5,9.3000000000000007,26.9,26.9,24.2,17,15.9,14.3,23.1,2.2000000000000002,26.4,12.1,15.9,9.9,304.8,100,-204.8,-204.8]
["O48",25.8,25.8,4.4000000000000004,16.5,20.9,26.9,3.3,20.9,25.8,15.9,23.1,12.1,18.7,19.8,12.1,15.9,13.7,301.5,100,-201.5,-201.5]
["O49",18.100000000000001,19.2,4.4000000000000004,26.9,25.8,26.9,13.7,14.8,17,26.9,23.1,23.1,9.3000000000000007,19.8,24.7,15.9,20.3,330,100,-230,-230]
["O50",6,19.2,1.6,26.9,9.3000000000000007,26.9,26.9,4.9000000000000004,7.1,6.6,14.3,12.1,2.2000000000000002,8.8000000000000007,2.7,15.9,9.9,201.5,100,-101.5,-101.5]

{"sheet":"inverz1000000","index":9,"n_rows":213,"n_cols":22,"rows_kept":213,"cut":false,"hidden":false,"merged":[]}
[]
[]
[]
[]
["Azonosító:","Teszt","Objektumok:",50,"Attribútumok:",17,"Lepcsők:",50,"Eltolás:",0,"Leírás:","COCO Y0: Teszt"]
[]
["Rangsor","X(A1)","X(A2)","X(A3)","X(A4)","X(A5)","X(A6)","X(A7)","X(A8)","X(A9)","X(A10)","X(A11)","X(A12)","X(A13)","X(A14)","X(A15)","X(A16)","X(A17)","Y(A18)"]
["O1",17,15,1,1,12,1,33,41,19,21,24,8,16,34,45,21,1,1000000]
["O2",39,15,1,20,33,1,1,6,37,4,24,28,1,34,28,21,1,1000000]
["O3",17,15,1,20,1,1,25,12,3,38,2,8,16,34,5,21,25,1000000]
["O4",39,15,1,1,33,1,25,23,3,38,24,28,1,34,5,21,32,1000000]
["O5",17,15,1,20,12,1,14,23,3,21,24,28,16,14,5,21,25,1000000]
["O6",17,15,1,20,33,1,1,23,37,38,8,1,1,14,5,21,13,1000000]
["O7",17,3,32,20,12,36,44,6,3,4,8,28,41,2,5,5,13,1000000]
["O8",17,15,1,1,33,1,1,1,37,4,24,28,1,34,5,21,32,1000000]
["O9",3,15,1,44,12,1,33,33,3,4,24,28,1,34,5,5,1,1000000]
["O10",17,3,1,44,6,1,33,6,3,21,8,8,1,2,1,5,22,1000000]
["O11",3,1,32,44,12,36,14,1,1,1,3,1,16,2,1,5,11,1000000]
["O12",39,15,1,1,33,1,14,6,3,21,24,28,41,34,45,21,32,1000000]
["O13",39,15,1,1,12,36,14,23,37,38,24,8,16,34,5,21,25,1000000]
["O14",17,15,1,1,1,1,14,12,37,4,24,28,1,34,5,1,1,1000000]
["O15",39,3,47,44,12,1,1,1,3,21,24,28,1,2,5,1,32,1000000]
["O16",3,15,1,44,12,36,14,33,19,4,8,8,33,14,5,5,25,1000000]
["O17",3,15,32,20,12,36,33,33,19,4,8,1,16,1,1,21,32,1000000]
["O18",3,15,32,20,12,1,10,12,19,4,8,8,33,34,28,21,32,1000000]
["O19",3,15,1,1,33,48,33,33,37,21,24,1,1,14,28,21,32,1000000]
["O20",3,15,1,20,6,1,1,1,37,38,3,1,1,14,5,5,13,1000000]
["O21",17,15,32,20,6,1,10,23,19,4,24,8,41,14,5,21,1,1000000]
["O22",3,15,1,20,6,1,14,12,19,1,3,1,33,14,1,5,13,1000000]
["O23",17,3,42,20,12,36,33,12,3,21,8,28,44,2,5,5,1,1000000]
["O24",39,15,1,1,12,1,44,41,37,38,24,28,1,34,45,21,1,1000000]
["O25",17,15,1,20,33,1,1,12,19,4,8,8,1,14,5,21,32,1000000]
["O26",17,15,32,20,33,1,14,41,3,38,8,8,44,34,28,21,13,1000000]
["O27",17,3,42,20,12,36,10,12,19,4,3,8,16,2,28,5,32,1000000]
["O28",17,3,32,20,33,1,14,6,19,21,8,28,33,14,28,5,32,1000000]
["O29",3,15,1,1,33,1,10,33,37,21,8,8,33,14,28,21,32,1000000]
["O30",17,15,1,20,12,1,14,23,19,21,24,8,16,2,28,5,32,1000000]
["O31",39,15,1,1,12,1,44,41,37,38,24,28,1,34,45,21,1,1000000]
["O32",3,15,1,20,33,36,33,33,37,38,24,28,46,14,5,21,1,1000000]
["O33",3,15,1,20,12,1,1,23,3,21,24,28,1,34,5,21,22,1000000]
["O34",17,15,1,1,6,48,25,41,19,21,24,8,33,34,28,21,1,1000000]
["O35",39,3,1,1,12,1,33,12,19,38,24,28,16,2,28,1,32,1000000]
["O36",1,15,1,1,3,36,25,12,19,4,8,8,16,34,5,5,32,1000000]
["O37",39,3,32,1,3,48,44,41,19,4,24,28,16,2,28,21,32,1000000]
["O38",39,15,1,1,33,1,33,41,37,38,24,28,1,14,45,21,13,1000000]
["O39",17,15,1,20,33,1,33,33,19,21,24,8,16,14,28,21,11,1000000]
["O40",17,15,47,1,33,1,33,41,1,4,3,28,46,14,28,21,32,1000000]
["O41",39,15,42,20,12,36,25,41,3,21,24,28,33,2,5,5,13,1000000]
["O42",17,3,32,44,12,36,25,23,3,4,8,8,16,14,28,5,13,1000000]
["O43",17,3,32,20,6,1,44,33,3,38,8,8,16,14,5,1,22,1000000]
["O44",3,15,1,1,12,1,14,23,3,4,24,8,16,14,5,21,25,1000000]
["O45",1,2,47,20,33,36,44,1,19,4,1,1,46,2,28,5,32,1000000]
["O46",3,3,1,44,33,1,25,12,37,21,24,28,16,14,5,5,25,1000000]
["O47",17,15,1,20,33,1,1,6,19,21,24,8,46,2,28,21,32,1000000]
["O48",3,3,42,20,12,1,44,12,3,21,8,28,16,14,28,21,25,1000000]
["O49",17,15,42,1,3,1,25,23,19,1,8,8,33,14,5,21,13,1000000]
["O50",39,15,47,1,33,1,1,41,37,38,24,28,46,34,45,21,32,1000000]
[]
["Lépcsők(1)","X(A1)","X(A2)","X(A3)","X(A4)","X(A5)","X(A6)","X(A7)","X(A8)","X(A9)","X(A10)","X(A11)","X(A12)","X(A13)","X(A14)","X(A15)","X(A16)","X(A17)"]
["S1","(51+117)/(2)=84","(125+999388.5)/(2)=499756.75","(49+49)/(2)=49","(133+192)/(2)=162.5","(49+103)/(2)=76","(999259.5+49)/(2)=499654.25","(99+225)/(2)=162","(49+49)/(2)=49","(96+105)/(2)=100.5","(49+49)/(2)=49","(131+49)/(2)=90","(49+49)/(2)=49","(49+49)/(2)=49","(174+49)/(2)=111.5","(49+49)/(2)=49","(49+49)/(2)=49","(103+125)/(2)=114"]
["S2","(48+116)/(2)=82","(124+999387.5)/(2)=499755.75","(48+48)/(2)=48","(132+191)/(2)=161.5","(48+102)/(2)=75","(999258.5+48)/(2)=499653.25","(98+224)/(2)=161","(48+48)/(2)=48","(95+52)/(2)=73.5","(48+48)/(2)=48","(130+48)/(2)=89","(48+48)/(2)=48","(48+48)/(2)=48","(48+48)/(2)=48","(48+48)/(2)=48","(48+48)/(2)=48","(102+124)/(2)=113"]
["S3","(47+115)/(2)=81","(123+999386.5)/(2)=499754.75","(47+47)/(2)=47","(131+190)/(2)=160.5","(47+101)/(2)=74","(999257.5+47)/(2)=499652.25","(97+223)/(2)=160","(47+47)/(2)=47","(94+51)/(2)=72.5","(47+47)/(2)=47","(47+47)/(2)=47","(47+47)/(2)=47","(47+47)/(2)=47","(47+47)/(2)=47","(47+47)/(2)=47","(47+47)/(2)=47","(101+123)/(2)=112"]
["S4","(46+114)/(2)=80","(122+999385.5)/(2)=499753.75","(46+46)/(2)=46","(130+189)/(2)=159.5","(46+46)/(2)=46","(999256.5+46)/(2)=499651.25","(96+222)/(2)=159","(46+46)/(2)=46","(93+50)/(2)=71.5","(46+46)/(2)=46","(46+46)/(2)=46","(46+46)/(2)=46","(46+46)/(2)=46","(46+46)/(2)=46","(46+46)/(2)=46","(46+46)/(2)=46","(100+122)/(2)=111"]
["S5","(45+113)/(2)=79","(121+999384.5)/(2)=499752.75","(45+45)/(2)=45","(129+188)/(2)=158.5","(45+45)/(2)=45","(999255.5+45)/(2)=499650.25","(95+221)/(2)=158","(45+45)/(2)=45","(92+49)/(2)=70.5","(45+45)/(2)=45","(45+45)/(2)=45","(45+45)/(2)=45","(45+45)/(2)=45","(45+45)/(2)=45","(45+45)/(2)=45","(45+45)/(2)=45","(99+121)/(2)=110"]
["S6","(44+112)/(2)=78","(120+999383.5)/(2)=499751.75","(44+44)/(2)=44","(100+123)/(2)=111.5","(44+44)/(2)=44","(999254.5+44)/(2)=499649.25","(94+220)/(2)=157","(44+44)/(2)=44","(91+48)/(2)=69.5","(44+44)/(2)=44","(44+44)/(2)=44","(44+44)/(2)=44","(44+44)/(2)=44","(44+44)/(2)=44","(44+44)/(2)=44","(44+44)/(2)=44","(98+120)/(2)=109"]
["S7","(43+111)/(2)=77","(119+999382.5)/(2)=499750.75","(43+43)/(2)=43","(99+122)/(2)=110.5","(43+43)/(2)=43","(999253.5+43)/(2)=499648.25","(93+219)/(2)=156","(43+43)/(2)=43","(90+47)/(2)=68.5","(43+43)/(2)=43","(43+43)/(2)=43","(43+43)/(2)=43","(43+43)/(2)=43","(43+43)/(2)=43","(43+43)/(2)=43","(43+43)/(2)=43","(97+119)/(2)=108"]
["S8","(42+42)/(2)=42","(42+999357.5)/(2)=499699.75","(42+42)/(2)=42","(98+121)/(2)=109.5","(42+42)/(2)=42","(999252.5+42)/(2)=499647.25","(73+89)/(2)=81","(42+42)/(2)=42","(89+42)/(2)=65.5","(42+42)/(2)=42","(42+42)/(2)=42","(42+42)/(2)=42","(42+42)/(2)=42","(42+42)/(2)=42","(42+42)/(2)=42","(42+42)/(2)=42","(96+118)/(2)=107"]
["S9","(41+41)/(2)=41","(41+999356.5)/(2)=499698.75","(41+41)/(2)=41","(97+120)/(2)=108.5","(41+41)/(2)=41","(999251.5+41)/(2)=499646.25","(72+88)/(2)=80","(41+41)/(2)=41","(88+41)/(2)=64.5","(41+41)/(2)=41","(41+41)/(2)=41","(41+41)/(2)=41","(41+41)/(2)=41","(41+41)/(2)=41","(41+41)/(2)=41","(41+41)/(2)=41","(95+117)/(2)=106"]
["S10","(40+40)/(2)=40","(40+999355.5)/(2)=499697.75","(40+40)/(2)=40","(96+119)/(2)=107.5","(40+40)/(2)=40","(999250.5+40)/(2)=499645.25","(71+87)/(2)=79","(40+40)/(2)=40","(87+40)/(2)=63.5","(40+40)/(2)=40","(40+40)/(2)=40","(40+40)/(2)=40","(40+40)/(2)=40","(40+40)/(2)=40","(40+40)/(2)=40","(40+40)/(2)=40","(94+116)/(2)=105"]
["S11","(39+39)/(2)=39","(39+999354.5)/(2)=499696.75","(39+39)/(2)=39","(95+118)/(2)=106.5","(39+39)/(2)=39","(999249.5+39)/(2)=499644.25","(70+86)/(2)=78","(39+39)/(2)=39","(86+39)/(2)=62.5","(39+39)/(2)=39","(39+39)/(2)=39","(39+39)/(2)=39","(39+39)/(2)=39","(39+39)/(2)=39","(39+39)/(2)=39","(39+39)/(2)=39","(41+115)/(2)=78"]
["S12","(38+38)/(2)=38","(38+999353.5)/(2)=499695.75","(38+38)/(2)=38","(94+117)/(2)=105.5","(38+38)/(2)=38","(999248.5+38)/(2)=499643.25","(38+85)/(2)=61.5","(38+38)/(2)=38","(85+38)/(2)=61.5","(38+38)/(2)=38","(38+38)/(2)=38","(38+38)/(2)=38","(38+38)/(2)=38","(38+38)/(2)=38","(38+38)/(2)=38","(38+38)/(2)=38","(38+114)/(2)=76"]
["S13","(37+37)/(2)=37","(37+999352.5)/(2)=499694.75","(37+37)/(2)=37","(93+116)/(2)=104.5","(37+37)/(2)=37","(999247.5+37)/(2)=499642.25","(37+84)/(2)=60.5","(37+37)/(2)=37","(84+37)/(2)=60.5","(37+37)/(2)=37","(37+37)/(2)=37","(37+37)/(2)=37","(37+37)/(2)=37","(37+37)/(2)=37","(37+37)/(2)=37","(37+37)/(2)=37","(37+113)/(2)=75"]
["S14","(36+36)/(2)=36","(36+999351.5)/(2)=499693.75","(36+36)/(2)=36","(92+115)/(2)=103.5","(36+36)/(2)=36","(999246.5+36)/(2)=499641.25","(36+83)/(2)=59.5","(36+36)/(2)=36","(83+36)/(2)=59.5","(36+36)/(2)=36","(36+36)/(2)=36","(36+36)/(2)=36","(36+36)/(2)=36","(36+36)/(2)=36","(36+36)/(2)=36","(36+36)/(2)=36","(36+112)/(2)=74"]
["S15","(35+35)/(2)=35","(35+999350.5)/(2)=499692.75","(35+35)/(2)=35","(91+114)/(2)=102.5","(35+35)/(2)=35","(999245.5+35)/(2)=499640.25","(35+82)/(2)=58.5","(35+35)/(2)=35","(82+35)/(2)=58.5","(35+35)/(2)=35","(35+35)/(2)=35","(35+35)/(2)=35","(35+35)/(2)=35","(35+35)/(2)=35","(35+35)/(2)=35","(35+35)/(2)=35","(35+111)/(2)=73"]
["S16","(34+34)/(2)=34","(34+34)/(2)=34","(34+34)/(2)=34","(90+113)/(2)=101.5","(34+34)/(2)=34","(999244.5+34)/(2)=499639.25","(34+81)/(2)=57.5","(34+34)/(2)=34","(81+34)/(2)=57.5","(34+34)/(2)=34","(34+34)/(2)=34","(34+34)/(2)=34","(34+34)/(2)=34","(34+34)/(2)=34","(34+34)/(2)=34","(34+34)/(2)=34","(34+110)/(2)=72"]
["S17","(33+33)/(2)=33","(33+33)/(2)=33","(33+33)/(2)=33","(89+112)/(2)=100.5","(33+33)/(2)=33","(999243.5+33)/(2)=499638.25","(33+80)/(2)=56.5","(33+33)/(2)=33","(80+33)/(2)=56.5","(33+33)/(2)=33","(33+33)/(2)=33","(33+33)/(2)=33","(33+33)/(2)=33","(33+33)/(2)=33","(33+33)/(2)=33","(33+33)/(2)=33","(33+109)/(2)=71"]
["S18","(32+32)/(2)=32","(32+32)/(2)=32","(32+32)/(2)=32","(88+111)/(2)=99.5","(32+32)/(2)=32","(999242.5+32)/(2)=499637.25","(32+79)/(2)=55.5","(32+32)/(2)=32","(79+32)/(2)=55.5","(32+32)/(2)=32","(32+32)/(2)=32","(32+32)/(2)=32","(32+32)/(2)=32","(32+32)/(2)=32","(32+32)/(2)=32","(32+32)/(2)=32","(32+108)/(2)=70"]
["S19","(31+31)/(2)=31","(31+31)/(2)=31","(31+31)/(2)=31","(87+110)/(2)=98.5","(31+31)/(2)=31","(999241.5+31)/(2)=499636.25","(31+72)/(2)=51.5","(31+31)/(2)=31","(78+31)/(2)=54.5","(31+31)/(2)=31","(31+31)/(2)=31","(31+31)/(2)=31","(31+31)/(2)=31","(31+31)/(2)=31","(31+31)/(2)=31","(31+31)/(2)=31","(31+107)/(2)=69"]
["S20","(30+30)/(2)=30","(30+30)/(2)=30","(30+30)/(2)=30","(86+109)/(2)=97.5","(30+30)/(2)=30","(999240.5+30)/(2)=499635.25","(30+71)/(2)=50.5","(30+30)/(2)=30","(77+30)/(2)=53.5","(30+30)/(2)=30","(30+30)/(2)=30","(30+30)/(2)=30","(30+30)/(2)=30","(30+30)/(2)=30","(30+30)/(2)=30","(30+30)/(2)=30","(30+106)/(2)=68"]
["S21","(29+29)/(2)=29","(29+29)/(2)=29","(29+29)/(2)=29","(85+29)/(2)=57","(29+29)/(2)=29","(999239.5+29)/(2)=499634.25","(29+70)/(2)=49.5","(29+29)/(2)=29","(76+29)/(2)=52.5","(29+29)/(2)=29","(29+29)/(2)=29","(29+29)/(2)=29","(29+29)/(2)=29","(29+29)/(2)=29","(29+29)/(2)=29","(29+29)/(2)=29","(29+105)/(2)=67"]
["S22","(28+28)/(2)=28","(28+28)/(2)=28","(28+28)/(2)=28","(84+28)/(2)=56","(28+28)/(2)=28","(999238.5+28)/(2)=499633.25","(28+69)/(2)=48.5","(28+28)/(2)=28","(75+28)/(2)=51.5","(28+28)/(2)=28","(28+28)/(2)=28","(28+28)/(2)=28","(28+28)/(2)=28","(28+28)/(2)=28","(28+28)/(2)=28","(28+28)/(2)=28","(28+28)/(2)=28"]
["S23","(27+27)/(2)=27","(27+27)/(2)=27","(27+27)/(2)=27","(83+27)/(2)=55","(27+27)/(2)=27","(999237.5+27)/(2)=499632.25","(27+68)/(2)=47.5","(27+27)/(2)=27","(74+27)/(2)=50.5","(27+27)/(2)=27","(27+27)/(2)=27","(27+27)/(2)=27","(27+27)/(2)=27","(27+27)/(2)=27","(27+27)/(2)=27","(27+27)/(2)=27","(27+27)/(2)=27"]
["S24","(26+26)/(2)=26","(26+26)/(2)=26","(26+26)/(2)=26","(82+26)/(2)=54","(26+26)/(2)=26","(999236.5+26)/(2)=499631.25","(26+67)/(2)=46.5","(26+26)/(2)=26","(26+26)/(2)=26","(26+26)/(2)=26","(26+26)/(2)=26","(26+26)/(2)=26","(26+26)/(2)=26","(26+26)/(2)=26","(26+26)/(2)=26","(26+26)/(2)=26","(26+26)/(2)=26"]
["S25","(25+25)/(2)=25","(25+25)/(2)=25","(25+25)/(2)=25","(25+25)/(2)=25","(25+25)/(2)=25","(999235.5+25)/(2)=499630.25","(25+66)/(2)=45.5","(25+25)/(2)=25","(25+25)/(2)=25","(25+25)/(2)=25","(25+25)/(2)=25","(25+25)/(2)=25","(25+25)/(2)=25","(25+25)/(2)=25","(25+25)/(2)=25","(25+25)/(2)=25","(25+25)/(2)=25"]
["S26","(24+24)/(2)=24","(24+24)/(2)=24","(24+24)/(2)=24","(24+24)/(2)=24","(24+24)/(2)=24","(999234.5+24)/(2)=499629.25","(24+65)/(2)=44.5","(24+24)/(2)=24","(24+24)/(2)=24","(24+24)/(2)=24","(24+24)/(2)=24","(24+24)/(2)=24","(24+24)/(2)=24","(24+24)/(2)=24","(24+24)/(2)=24","(24+24)/(2)=24","(24+24)/(2)=24"]
["S27","(23+23)/(2)=23","(23+23)/(2)=23","(23+23)/(2)=23","(23+23)/(2)=23","(23+23)/(2)=23","(999233.5+23)/(2)=499628.25","(23+64)/(2)=43.5","(23+23)/(2)=23","(23+23)/(2)=23","(23+23)/(2)=23","(23+23)/(2)=23","(23+23)/(2)=23","(23+23)/(2)=23","(23+23)/(2)=23","(23+23)/(2)=23","(23+23)/(2)=23","(23+23)/(2)=23"]
["S28","(22+22)/(2)=22","(22+22)/(2)=22","(22+22)/(2)=22","(22+22)/(2)=22","(22+22)/(2)=22","(999232.5+22)/(2)=499627.25","(22+63)/(2)=42.5","(22+22)/(2)=22","(22+22)/(2)=22","(22+22)/(2)=22","(22+22)/(2)=22","(22+22)/(2)=22","(22+22)/(2)=22","(22+22)/(2)=22","(22+22)/(2)=22","(22+22)/(2)=22","(22+22)/(2)=22"]
["S29","(21+21)/(2)=21","(21+21)/(2)=21","(21+21)/(2)=21","(21+21)/(2)=21","(21+21)/(2)=21","(999231.5+21)/(2)=499626.25","(21+23)/(2)=22","(21+21)/(2)=21","(21+21)/(2)=21","(21+21)/(2)=21","(21+21)/(2)=21","(21+21)/(2)=21","(21+21)/(2)=21","(21+21)/(2)=21","(21+21)/(2)=21","(21+21)/(2)=21","(21+21)/(2)=21"]
["S30","(20+20)/(2)=20","(20+20)/(2)=20","(20+20)/(2)=20","(20+20)/(2)=20","(20+20)/(2)=20","(999230.5+20)/(2)=499625.25","(20+22)/(2)=21","(20+20)/(2)=20","(20+20)/(2)=20","(20+20)/(2)=20","(20+20)/(2)=20","(20+20)/(2)=20","(20+20)/(2)=20","(20+20)/(2)=20","(20+20)/(2)=20","(20+20)/(2)=20","(20+20)/(2)=20"]
["S31","(19+19)/(2)=19","(19+19)/(2)=19","(19+19)/(2)=19","(19+19)/(2)=19","(19+19)/(2)=19","(999229.5+19)/(2)=499624.25","(19+21)/(2)=20","(19+19)/(2)=19","(19+19)/(2)=19","(19+19)/(2)=19","(19+19)/(2)=19","(19+19)/(2)=19","(19+19)/(2)=19","(19+19)/(2)=19","(19+19)/(2)=19","(19+19)/(2)=19","(19+19)/(2)=19"]
["S32","(18+18)/(2)=18","(18+18)/(2)=18","(18+18)/(2)=18","(18+18)/(2)=18","(18+18)/(2)=18","(999228.5+18)/(2)=499623.25","(18+20)/(2)=19","(18+18)/(2)=18","(18+18)/(2)=18","(18+18)/(2)=18","(18+18)/(2)=18","(18+18)/(2)=18","(18+18)/(2)=18","(18+18)/(2)=18","(18+18)/(2)=18","(18+18)/(2)=18","(18+18)/(2)=18"]
["S33","(17+17)/(2)=17","(17+17)/(2)=17","(17+17)/(2)=17","(17+17)/(2)=17","(17+17)/(2)=17","(999227.5+17)/(2)=499622.25","(17+19)/(2)=18","(17+17)/(2)=17","(17+17)/(2)=17","(17+17)/(2)=17","(17+17)/(2)=17","(17+17)/(2)=17","(17+17)/(2)=17","(17+17)/(2)=17","(17+17)/(2)=17","(17+17)/(2)=17","(17+17)/(2)=17"]
["S34","(16+16)/(2)=16","(16+16)/(2)=16","(16+16)/(2)=16","(16+16)/(2)=16","(16+16)/(2)=16","(999226.5+16)/(2)=499621.25","(16+18)/(2)=17","(16+16)/(2)=16","(16+16)/(2)=16","(16+16)/(2)=16","(16+16)/(2)=16","(16+16)/(2)=16","(16+16)/(2)=16","(16+16)/(2)=16","(16+16)/(2)=16","(16+16)/(2)=16","(16+16)/(2)=16"]
["S35","(15+15)/(2)=15","(15+15)/(2)=15","(15+15)/(2)=15","(15+15)/(2)=15","(15+15)/(2)=15","(999225.5+15)/(2)=499620.25","(15+17)/(2)=16","(15+15)/(2)=15","(15+15)/(2)=15","(15+15)/(2)=15","(15+15)/(2)=15","(15+15)/(2)=15","(15+15)/(2)=15","(15+15)/(2)=15","(15+15)/(2)=15","(15+15)/(2)=15","(15+15)/(2)=15"]
["S36","(14+14)/(2)=14","(14+14)/(2)=14","(14+14)/(2)=14","(14+14)/(2)=14","(14+14)/(2)=14","(999224.5+14)/(2)=499619.25","(14+16)/(2)=15","(14+14)/(2)=14","(14+14)/(2)=14","(14+14)/(2)=14","(14+14)/(2)=14","(14+14)/(2)=14","(14+14)/(2)=14","(14+14)/(2)=14","(14+14)/(2)=14","(14+14)/(2)=14","(14+14)/(2)=14"]
["S37","(13+13)/(2)=13","(13+13)/(2)=13","(13+13)/(2)=13","(13+13)/(2)=13","(13+13)/(2)=13","(999223.5+13)/(2)=499618.25","(13+15)/(2)=14","(13+13)/(2)=13","(13+13)/(2)=13","(13+13)/(2)=13","(13+13)/(2)=13","(13+13)/(2)=13","(13+13)/(2)=13","(13+13)/(2)=13","(13+13)/(2)=13","(13+13)/(2)=13","(13+13)/(2)=13"]
["S38","(12+12)/(2)=12","(12+12)/(2)=12","(12+12)/(2)=12","(12+12)/(2)=12","(12+12)/(2)=12","(999222.5+12)/(2)=499617.25","(12+12)/(2)=12","(12+12)/(2)=12","(12+12)/(2)=12","(12+12)/(2)=12","(12+12)/(2)=12","(12+12)/(2)=12","(12+12)/(2)=12","(12+12)/(2)=12","(12+12)/(2)=12","(12+12)/(2)=12","(12+12)/(2)=12"]
["S39","(11+11)/(2)=11","(11+11)/(2)=11","(11+11)/(2)=11","(11+11)/(2)=11","(11+11)/(2)=11","(999221.5+11)/(2)=499616.25","(11+11)/(2)=11","(11+11)/(2)=11","(11+11)/(2)=11","(11+11)/(2)=11","(11+11)/(2)=11","(11+11)/(2)=11","(11+11)/(2)=11","(11+11)/(2)=11","(11+11)/(2)=11","(11+11)/(2)=11","(11+11)/(2)=11"]
["S40","(10+10)/(2)=10","(10+10)/(2)=10","(10+10)/(2)=10","(10+10)/(2)=10","(10+10)/(2)=10","(999220.5+10)/(2)=499615.25","(10+10)/(2)=10","(10+10)/(2)=10","(10+10)/(2)=10","(10+10)/(2)=10","(10+10)/(2)=10","(10+10)/(2)=10","(10+10)/(2)=10","(10+10)/(2)=10","(10+10)/(2)=10","(10+10)/(2)=10","(10+10)/(2)=10"]
["S41","(9+9)/(2)=9","(9+9)/(2)=9","(9+9)/(2)=9","(9+9)/(2)=9","(9+9)/(2)=9","(999219.5+9)/(2)=499614.25","(9+9)/(2)=9","(9+9)/(2)=9","(9+9)/(2)=9","(9+9)/(2)=9","(9+9)/(2)=9","(9+9)/(2)=9","(9+9)/(2)=9","(9+9)/(2)=9","(9+9)/(2)=9","(9+9)/(2)=9","(9+9)/(2)=9"]
["S42","(8+8)/(2)=8","(8+8)/(2)=8","(8+8)/(2)=8","(8+8)/(2)=8","(8+8)/(2)=8","(999218.5+8)/(2)=499613.25","(8+8)/(2)=8","(8+8)/(2)=8","(8+8)/(2)=8","(8+8)/(2)=8","(8+8)/(2)=8","(8+8)/(2)=8","(8+8)/(2)=8","(8+8)/(2)=8","(8+8)/(2)=8","(8+8)/(2)=8","(8+8)/(2)=8"]
["S43","(7+7)/(2)=7","(7+7)/(2)=7","(7+7)/(2)=7","(7+7)/(2)=7","(7+7)/(2)=7","(999217.5+7)/(2)=499612.25","(7+7)/(2)=7","(7+7)/(2)=7","(7+7)/(2)=7","(7+7)/(2)=7","(7+7)/(2)=7","(7+7)/(2)=7","(7+7)/(2)=7","(7+7)/(2)=7","(7+7)/(2)=7","(7+7)/(2)=7","(7+7)/(2)=7"]
["S44","(6+6)/(2)=6","(6+6)/(2)=6","(6+6)/(2)=6","(6+6)/(2)=6","(6+6)/(2)=6","(999216.5+6)/(2)=499611.25","(6+6)/(2)=6","(6+6)/(2)=6","(6+6)/(2)=6","(6+6)/(2)=6","(6+6)/(2)=6","(6+6)/(2)=6","(6+6)/(2)=6","(6+6)/(2)=6","(6+6)/(2)=6","(6+6)/(2)=6","(6+6)/(2)=6"]
["S45","(5+5)/(2)=5","(5+5)/(2)=5","(5+5)/(2)=5","(5+5)/(2)=5","(5+5)/(2)=5","(999215.5+5)/(2)=499610.25","(5+5)/(2)=5","(5+5)/(2)=5","(5+5)/(2)=5","(5+5)/(2)=5","(5+5)/(2)=5","(5+5)/(2)=5","(5+5)/(2)=5","(5+5)/(2)=5","(5+5)/(2)=5","(5+5)/(2)=5","(5+5)/(2)=5"]
["S46","(4+4)/(2)=4","(4+4)/(2)=4","(4+4)/(2)=4","(4+4)/(2)=4","(4+4)/(2)=4","(999214.5+4)/(2)=499609.25","(4+4)/(2)=4","(4+4)/(2)=4","(4+4)/(2)=4","(4+4)/(2)=4","(4+4)/(2)=4","(4+4)/(2)=4","(4+4)/(2)=4","(4+4)/(2)=4","(4+4)/(2)=4","(4+4)/(2)=4","(4+4)/(2)=4"]
["S47","(3+3)/(2)=3","(3+3)/(2)=3","(3+3)/(2)=3","(3+3)/(2)=3","(3+3)/(2)=3","(999213.5+3)/(2)=499608.25","(3+3)/(2)=3","(3+3)/(2)=3","(3+3)/(2)=3","(3+3)/(2)=3","(3+3)/(2)=3","(3+3)/(2)=3","(3+3)/(2)=3","(3+3)/(2)=3","(3+3)/(2)=3","(3+3)/(2)=3","(3+3)/(2)=3"]
["S48","(2+2)/(2)=2","(2+2)/(2)=2","(2+2)/(2)=2","(2+2)/(2)=2","(2+2)/(2)=2","(999212.5+2)/(2)=499607.25","(2+2)/(2)=2","(2+2)/(2)=2","(2+2)/(2)=2","(2+2)/(2)=2","(2+2)/(2)=2","(2+2)/(2)=2","(2+2)/(2)=2","(2+2)/(2)=2","(2+2)/(2)=2","(2+2)/(2)=2","(2+2)/(2)=2"]
["S49","(1+1)/(2)=1","(1+1)/(2)=1","(1+1)/(2)=1","(1+1)/(2)=1","(1+1)/(2)=1","(1+1)/(2)=1","(1+1)/(2)=1","(1+1)/(2)=1","(1+1)/(2)=1","(1+1)/(2)=1","(1+1)/(2)=1","(1+1)/(2)=1","(1+1)/(2)=1","(1+1)/(2)=1","(1+1)/(2)=1","(1+1)/(2)=1","(1+1)/(2)=1"]
["S50","(0+0)/(2)=0","(0+0)/(2)=0","(0+0)/(2)=0","(0+0)/(2)=0","(0+0)/(2)=0","(0+0)/(2)=0","(0+0)/(2)=0","(0+0)/(2)=0","(0+0)/(2)=0","(0+0)/(2)=0","(0+0)/(2)=0","(0+0)/(2)=0","(0+0)/(2)=0","(0+0)/(2)=0","(0+0)/(2)=0","(0+0)/(2)=0","(0+0)/(2)=0"]
[]
["Lépcsők(2)","X(A1)","X(A2)","X(A3)","X(A4)","X(A5)","X(A6)","X(A7)","X(A8)","X(A9)","X(A10)","X(A11)","X(A12)","X(A13)","X(A14)","X(A15)","X(A16)","X(A17)"]
["S1",84,499756.79999999999,49,162.5,76,499654.3,162,49,100.5,49,90,49,49,111.5,49,49,114]
["S2",82,499755.8,48,161.5,75,499653.3,161,48,73.5,48,89,48,48,48,48,48,113]
["S3",81,499754.8,47,160.5,74,499652.3,160,47,72.5,47,47,47,47,47,47,47,112]
["S4",80,499753.8,46,159.5,46,499651.3,159,46,71.5,46,46,46,46,46,46,46,111]
["S5",79,499752.8,45,158.5,45,499650.3,158,45,70.5,45,45,45,45,45,45,45,110]
["S6",78,499751.8,44,111.5,44,499649.3,157,44,69.5,44,44,44,44,44,44,44,109]
["S7",77,499750.8,43,110.5,43,499648.3,156,43,68.5,43,43,43,43,43,43,43,108]
["S8",42,499699.8,42,109.5,42,499647.3,81,42,65.5,42,42,42,42,42,42,42,107]
["S9",41,499698.8,41,108.5,41,499646.3,80,41,64.5,41,41,41,41,41,41,41,106]
["S10",40,499697.8,40,107.5,40,499645.3,79,40,63.5,40,40,40,40,40,40,40,105]
["S11",39,499696.8,39,106.5,39,499644.3,78,39,62.5,39,39,39,39,39,39,39,78]
["S12",38,499695.8,38,105.5,38,499643.3,61.5,38,61.5,38,38,38,38,38,38,38,76]
["S13",37,499694.8,37,104.5,37,499642.3,60.5,37,60.5,37,37,37,37,37,37,37,75]
["S14",36,499693.8,36,103.5,36,499641.3,59.5,36,59.5,36,36,36,36,36,36,36,74]
["S15",35,499692.79999999999,35,102.5,35,499640.3,58.5,35,58.5,35,35,35,35,35,35,35,73]
["S16",34,34,34,101.5,34,499639.3,57.5,34,57.5,34,34,34,34,34,34,34,72]
["S17",33,33,33,100.5,33,499638.3,56.5,33,56.5,33,33,33,33,33,33,33,71]
["S18",32,32,32,99.5,32,499637.3,55.5,32,55.5,32,32,32,32,32,32,32,70]
["S19",31,31,31,98.5,31,499636.3,51.5,31,54.5,31,31,31,31,31,31,31,69]
["S20",30,30,30,97.5,30,499635.3,50.5,30,53.5,30,30,30,30,30,30,30,68]
["S21",29,29,29,57,29,499634.3,49.5,29,52.5,29,29,29,29,29,29,29,67]
["S22",28,28,28,56,28,499633.3,48.5,28,51.5,28,28,28,28,28,28,28,28]
["S23",27,27,27,55,27,499632.3,47.5,27,50.5,27,27,27,27,27,27,27,27]
["S24",26,26,26,54,26,499631.3,46.5,26,26,26,26,26,26,26,26,26,26]
["S25",25,25,25,25,25,499630.3,45.5,25,25,25,25,25,25,25,25,25,25]
["S26",24,24,24,24,24,499629.3,44.5,24,24,24,24,24,24,24,24,24,24]
["S27",23,23,23,23,23,499628.3,43.5,23,23,23,23,23,23,23,23,23,23]
["S28",22,22,22,22,22,499627.3,42.5,22,22,22,22,22,22,22,22,22,22]
["S29",21,21,21,21,21,499626.3,22,21,21,21,21,21,21,21,21,21,21]
["S30",20,20,20,20,20,499625.3,21,20,20,20,20,20,20,20,20,20,20]
["S31",19,19,19,19,19,499624.3,20,19,19,19,19,19,19,19,19,19,19]
["S32",18,18,18,18,18,499623.3,19,18,18,18,18,18,18,18,18,18,18]
["S33",17,17,17,17,17,499622.3,18,17,17,17,17,17,17,17,17,17,17]
["S34",16,16,16,16,16,499621.3,17,16,16,16,16,16,16,16,16,16,16]
["S35",15,15,15,15,15,499620.3,16,15,15,15,15,15,15,15,15,15,15]
["S36",14,14,14,14,14,499619.3,15,14,14,14,14,14,14,14,14,14,14]
["S37",13,13,13,13,13,499618.3,14,13,13,13,13,13,13,13,13,13,13]
["S38",12,12,12,12,12,499617.3,12,12,12,12,12,12,12,12,12,12,12]
["S39",11,11,11,11,11,499616.3,11,11,11,11,11,11,11,11,11,11,11]
["S40",10,10,10,10,10,499615.3,10,10,10,10,10,10,10,10,10,10,10]
["S41",9,9,9,9,9,499614.3,9,9,9,9,9,9,9,9,9,9,9]
["S42",8,8,8,8,8,499613.3,8,8,8,8,8,8,8,8,8,8,8]
["S43",7,7,7,7,7,499612.3,7,7,7,7,7,7,7,7,7,7,7]
["S44",6,6,6,6,6,499611.3,6,6,6,6,6,6,6,6,6,6,6]
["S45",5,5,5,5,5,499610.3,5,5,5,5,5,5,5,5,5,5,5]
["S46",4,4,4,4,4,499609.3,4,4,4,4,4,4,4,4,4,4,4]
["S47",3,3,3,3,3,499608.3,3,3,3,3,3,3,3,3,3,3,3]
["S48",2,2,2,2,2,499607.3,2,2,2,2,2,2,2,2,2,2,2]
["S49",1,1,1,1,1,1,1,1,1,1,1,1,1,1,1,1,1]
["S50",0,0,0,0,0,0,0,0,0,0,0,0,0,0,0,0,0]
[]
["COCO:Y0","X(A1)","X(A2)","X(A3)","X(A4)","X(A5)","X(A6)","X(A7)","X(A8)","X(A9)","X(A10)","X(A11)","X(A12)","X(A13)","X(A14)","X(A15)","X(A16)","X(A17)","Becslés","Tény+0","Delta","Delta/Tény"]
["O1",33,499692.79999999999,49,162.5,38,499654.3,18,9,54.5,29,26,42,34,16,5,29,114,1000006.1,1000000,-6.1,0]
["O2",11,499692.79999999999,49,97.5,17,499654.3,162,44,13,46,26,22,49,16,22,29,114,1000064.6,1000000,-64.599999999999994,-0.01]
["O3",33,499692.79999999999,49,97.5,76,499654.3,45.5,38,72.5,12,89,42,34,16,45,29,25,1000050.6,1000000,-50.6,-0.01]
["O4",11,499692.79999999999,49,162.5,17,499654.3,45.5,27,72.5,12,26,22,49,16,45,29,18,999948.5,1000000,51.5,0.01]
["O5",33,499692.79999999999,49,97.5,38,499654.3,59.5,27,72.5,29,26,22,34,36,45,29,25,999969.5,1000000,30.5,0]
["O6",33,499692.79999999999,49,97.5,17,499654.3,162,27,13,12,42,49,49,36,45,29,75,1000082.6,1000000,-82.6,-0.01]
["O7",33,499754.8,18,97.5,38,499619.3,6,44,72.5,46,42,22,9,48,45,45,75,1000015.1,1000000,-15.1,0]
["O8",33,499692.79999999999,49,162.5,17,499654.3,162,49,13,46,26,22,49,16,45,29,18,1000083.6,1000000,-83.6,-0.01]
["O9",81,499692.79999999999,49,6,38,499654.3,18,17,72.5,46,26,22,49,16,45,45,114,999991.5,1000000,8.5,0]
["O10",33,499754.8,49,6,44,499654.3,18,44,72.5,29,42,42,49,48,49,45,28,1000007.6,1000000,-7.6,0]
["O11",81,499756.79999999999,18,6,38,499619.3,59.5,49,100.5,49,47,49,34,48,49,45,78,1000127.1,1000000,-127.1,-0.01]
["O12",11,499692.79999999999,49,162.5,17,499654.3,59.5,44,72.5,29,26,22,9,16,5,29,18,999916.5,1000000,83.5,0.01]
["O13",11,499692.79999999999,49,162.5,38,499619.3,59.5,27,13,12,26,42,34,16,45,29,25,999901,1000000,99,0.01]
["O14",33,499692.79999999999,49,162.5,76,499654.3,59.5,38,13,46,26,22,49,16,45,49,114,1000145.1,1000000,-145.1,-0.01]
["O15",11,499754.8,3,6,38,499654.3,162,49,72.5,29,26,22,49,48,45,49,18,1000036.6,1000000,-36.6,0]
["O16",81,499692.79999999999,49,6,38,499619.3,59.5,17,54.5,46,42,42,17,36,45,45,25,999915,1000000,85,0.01]
["O17",81,499692.79999999999,18,97.5,38,499619.3,18,17,54.5,46,42,49,34,111.5,49,29,18,1000014.6,1000000,-14.6,0]
["O18",81,499692.79999999999,18,97.5,38,499654.3,79,38,54.5,46,42,42,17,16,22,29,18,999985,1000000,15,0]
["O19",81,499692.79999999999,49,162.5,17,499607.3,18,17,13,29,26,49,49,36,22,29,18,999915.5,1000000,84.5,0.01]
["O20",81,499692.79999999999,49,97.5,44,499654.3,162,49,13,12,47,49,49,36,45,45,75,1000200.6,1000000,-200.6,-0.02]
["O21",33,499692.79999999999,18,97.5,44,499654.3,79,27,54.5,46,26,42,9,36,45,29,114,1000047.1,1000000,-47.1,0]
["O22",81,499692.79999999999,49,97.5,44,499654.3,59.5,38,54.5,49,47,49,17,36,49,45,75,1000137.6,1000000,-137.6,-0.01]
["O23",33,499754.8,8,97.5,38,499619.3,18,38,72.5,29,42,22,6,48,45,45,114,1000030.1,1000000,-30.1,0]
["O24",11,499692.79999999999,49,162.5,38,499654.3,6,9,13,12,26,22,49,16,5,29,114,999908.5,1000000,91.5,0.01]
["O25",33,499692.79999999999,49,97.5,17,499654.3,162,38,54.5,46,42,42,49,36,45,29,18,1000105.1,1000000,-105.1,-0.01]
["O26",33,499692.79999999999,18,97.5,17,499654.3,59.5,9,72.5,12,42,42,6,16,22,29,75,999897.5,1000000,102.5,0.01]
["O27",33,499754.8,8,97.5,38,499619.3,79,38,54.5,46,47,42,34,48,22,45,18,1000024.1,1000000,-24.1,0]
["O28",33,499754.8,18,97.5,17,499654.3,59.5,44,54.5,29,42,22,17,36,22,45,18,999963.5,1000000,36.5,0]
["O29",81,499692.79999999999,49,162.5,17,499654.3,79,17,13,29,42,42,17,36,22,29,18,1000000.6,1000000,-0.6,0]
["O30",33,499692.79999999999,49,97.5,38,499654.3,59.5,27,54.5,29,26,42,34,48,22,45,18,999969.5,1000000,30.5,0]
["O31",11,499692.79999999999,49,162.5,38,499654.3,6,9,13,12,26,22,49,16,5,29,114,999908.5,1000000,91.5,0.01]
["O32",81,499692.79999999999,49,97.5,17,499619.3,18,17,13,12,26,22,4,36,45,29,114,999892.5,1000000,107.5,0.01]
["O33",81,499692.79999999999,49,97.5,38,499654.3,162,27,72.5,29,26,22,49,16,45,29,28,1000118.1,1000000,-118.1,-0.01]
["O34",33,499692.79999999999,49,162.5,44,499607.3,45.5,9,54.5,29,26,42,17,16,22,29,114,999992.5,1000000,7.5,0]
["O35",11,499754.8,49,162.5,38,499654.3,18,38,54.5,12,26,22,34,48,22,49,18,1000011.1,1000000,-11.1,0]
["O36",84,499692.79999999999,49,162.5,74,499619.3,45.5,38,54.5,46,42,42,34,16,45,45,18,1000107.6,1000000,-107.6,-0.01]
["O37",11,499754.8,18,162.5,74,499607.3,6,9,54.5,46,26,22,34,48,22,29,18,999942,1000000,58,0.01]
["O38",11,499692.79999999999,49,162.5,17,499654.3,18,9,13,12,26,22,49,36,5,29,75,999880.5,1000000,119.5,0.01]
["O39",33,499692.79999999999,49,97.5,17,499654.3,18,17,54.5,29,26,42,34,36,22,29,78,999929,1000000,71,0.01]
["O40",33,499692.79999999999,3,162.5,17,499654.3,18,9,100.5,46,47,22,4,36,22,29,18,999914,1000000,86,0.01]
["O41",11,499692.79999999999,8,97.5,38,499619.3,45.5,9,72.5,29,26,22,17,48,45,45,75,999900.5,1000000,99.5,0.01]
["O42",33,499754.8,18,6,38,499619.3,45.5,27,72.5,46,42,42,34,36,22,45,75,999956,1000000,44,0]
["O43",33,499754.8,18,97.5,44,499654.3,6,17,72.5,12,42,42,34,36,45,49,28,999985,1000000,15,0]
["O44",81,499692.79999999999,49,162.5,38,499654.3,59.5,27,72.5,46,26,42,34,36,45,29,25,1000119.6,1000000,-119.6,-0.01]
["O45",84,499755.8,3,97.5,17,499619.3,6,49,54.5,46,90,49,4,48,22,45,18,1000008.1,1000000,-8.1,0]
["O46",81,499754.8,49,6,17,499654.3,45.5,38,13,29,26,22,34,36,45,45,25,999920.5,1000000,79.5,0.01]
["O47",33,499692.79999999999,49,97.5,17,499654.3,162,44,54.5,29,26,42,4,48,22,29,18,1000022.1,1000000,-22.1,0]
["O48",81,499754.8,8,97.5,38,499654.3,6,38,72.5,29,42,22,34,36,22,29,25,999989,1000000,11,0]
["O49",33,499692.79999999999,8,162.5,74,499654.3,45.5,27,54.5,49,42,42,17,36,45,29,75,1000086.6,1000000,-86.6,-0.01]
["O50",11,499692.79999999999,3,162.5,17,499654.3,162,9,13,12,26,22,4,16,5,29,18,999856.5,1000000,143.5,0.01]

{"sheet":"direkt1000000","index":10,"n_rows":213,"n_cols":23,"rows_kept":213,"cut":false,"hidden":false,"merged":[]}
[]
[]
[]
[]
["Azonosító:","Teszt","Objektumok:",50,"Attribútumok:",17,"Lepcsők:",50,"Eltolás:",0,"Leírás:","COCO Y0: Teszt"]
[]
["Rangsor","X(A1)","X(A2)","X(A3)","X(A4)","X(A5)","X(A6)","X(A7)","X(A8)","X(A9)","X(A10)","X(A11)","X(A12)","X(A13)","X(A14)","X(A15)","X(A16)","X(A17)","Y(A18)"]
["O1",13,1,20,32,19,16,8,1,15,14,1,24,19,1,1,1,41,1000000]
["O2",1,1,20,8,1,16,42,40,1,31,1,1,36,1,7,1,41,1000000]
["O3",13,1,20,8,49,16,19,29,33,1,49,24,19,1,24,1,20,1000000]
["O4",1,1,20,32,1,16,19,19,33,1,1,1,36,1,24,1,1,1000000]
["O5",13,1,20,8,19,16,27,19,33,14,1,1,19,18,24,1,20,1000000]
["O6",13,1,20,8,1,16,42,19,1,1,28,44,36,18,24,1,30,1000000]
["O7",13,37,10,8,19,4,1,40,33,31,28,1,8,38,24,31,30,1000000]
["O8",13,1,20,32,1,16,42,46,1,31,1,1,36,1,24,1,1,1000000]
["O9",35,1,20,1,19,16,8,11,33,31,1,1,36,1,24,31,41,1000000]
["O10",13,37,20,1,40,16,8,40,33,14,28,24,36,38,47,31,27,1000000]
["O11",35,50,10,1,19,4,27,46,49,48,44,44,19,38,47,31,39,1000000]
["O12",1,1,20,32,1,16,27,40,33,14,1,1,8,1,1,1,1,1000000]
["O13",1,1,20,32,19,4,27,19,1,1,1,24,19,1,24,1,20,1000000]
["O14",13,1,20,32,49,16,27,29,1,31,1,1,36,1,24,47,41,1000000]
["O15",1,37,1,1,19,16,42,46,33,14,1,1,36,38,24,47,1,1000000]
["O16",35,1,20,1,19,4,27,11,15,31,28,24,11,18,24,31,20,1000000]
["O17",35,1,10,8,19,4,8,11,15,31,28,44,19,50,47,1,1,1000000]
["O18",35,1,10,8,19,16,38,29,15,31,28,24,11,1,7,1,1,1000000]
["O19",35,1,20,32,1,1,8,11,1,14,1,44,36,18,7,1,1,1000000]
["O20",35,1,20,8,40,16,42,46,1,1,44,44,36,18,24,31,30,1000000]
["O21",13,1,10,8,40,16,38,19,15,31,1,24,8,18,24,1,41,1000000]
["O22",35,1,20,8,40,16,27,29,15,48,44,44,11,18,47,31,30,1000000]
["O23",13,37,5,8,19,4,8,29,33,14,28,1,6,38,24,31,41,1000000]
["O24",1,1,20,32,19,16,1,1,1,1,1,1,36,1,1,1,41,1000000]
["O25",13,1,20,8,1,16,42,29,15,31,28,24,36,18,24,1,1,1000000]
["O26",13,1,10,8,1,16,27,1,33,1,28,24,6,1,7,1,30,1000000]
["O27",13,37,5,8,19,4,38,29,15,31,44,24,19,38,7,31,1,1000000]
["O28",13,37,10,8,1,16,27,40,15,14,28,1,11,18,7,31,1,1000000]
["O29",35,1,20,32,1,16,38,11,1,14,28,24,11,18,7,1,1,1000000]
["O30",13,1,20,8,19,16,27,19,15,14,1,24,19,38,7,31,1,1000000]
["O31",1,1,20,32,19,16,1,1,1,1,1,1,36,1,1,1,41,1000000]
["O32",35,1,20,8,1,4,8,11,1,1,1,1,1,18,24,1,41,1000000]
["O33",35,1,20,8,19,16,42,19,33,14,1,1,36,1,24,1,27,1000000]
["O34",13,1,20,32,40,1,19,1,15,14,1,24,11,1,7,1,41,1000000]
["O35",1,37,20,32,19,16,8,29,15,1,1,1,19,38,7,47,1,1000000]
["O36",49,1,20,32,46,4,19,29,15,31,28,24,19,1,24,31,1,1000000]
["O37",1,37,10,32,46,1,1,1,15,31,1,1,19,38,7,1,1,1000000]
["O38",1,1,20,32,1,16,8,1,1,1,1,1,36,18,1,1,30,1000000]
["O39",13,1,20,8,1,16,8,11,15,14,1,24,19,18,7,1,39,1000000]
["O40",13,1,1,32,1,16,8,1,49,31,44,1,1,18,7,1,1,1000000]
["O41",1,1,5,8,19,4,19,1,33,14,1,1,11,38,24,31,30,1000000]
["O42",13,37,10,1,19,4,19,19,33,31,28,24,19,18,7,31,30,1000000]
["O43",13,37,10,8,40,16,1,11,33,1,28,24,19,18,24,47,27,1000000]
["O44",35,1,20,32,19,16,27,19,33,31,1,24,19,18,24,1,20,1000000]
["O45",49,49,1,8,1,4,1,46,15,31,50,44,1,38,7,31,1,1000000]
["O46",35,37,20,1,1,16,19,29,1,14,1,1,19,18,24,31,20,1000000]
["O47",13,1,20,8,1,16,42,40,15,14,1,24,1,38,7,1,1,1000000]
["O48",35,37,5,8,19,16,1,29,33,14,28,1,19,18,7,1,20,1000000]
["O49",13,1,5,32,46,16,19,19,15,48,28,24,11,18,24,1,30,1000000]
["O50",1,1,1,32,1,16,42,1,1,1,1,1,1,1,1,1,1,1000000]
[]
["Lépcsők(1)","X(A1)","X(A2)","X(A3)","X(A4)","X(A5)","X(A6)","X(A7)","X(A8)","X(A9)","X(A10)","X(A11)","X(A12)","X(A13)","X(A14)","X(A15)","X(A16)","X(A17)"]
["S1","(97+49)/(2)=73","(999060.7+106)/(2)=499583.35","(49+50)/(2)=49.5","(204+292)/(2)=248","(123+49)/(2)=86","(82+74)/(2)=78","(229+183)/(2)=206","(49+49)/(2)=49","(49+187)/(2)=118","(49+49)/(2)=49","(49+999069.7)/(2)=499559.35","(49+49)/(2)=49","(49+71)/(2)=60","(49+206)/(2)=127.5","(49+49)/(2)=49","(49+49)/(2)=49","(158+135)/(2)=146.5"]
["S2","(96+48)/(2)=72","(999059.7+105)/(2)=499582.35","(48+49)/(2)=48.5","(203+291)/(2)=247","(122+48)/(2)=85","(81+73)/(2)=77","(228+182)/(2)=205","(48+48)/(2)=48","(48+186)/(2)=117","(48+48)/(2)=48","(48+999068.7)/(2)=499558.35","(48+48)/(2)=48","(48+70)/(2)=59","(48+205)/(2)=126.5","(48+48)/(2)=48","(48+48)/(2)=48","(157+134)/(2)=145.5"]
["S3","(95+47)/(2)=71","(999058.7+104)/(2)=499581.35","(47+48)/(2)=47.5","(202+290)/(2)=246","(121+47)/(2)=84","(80+72)/(2)=76","(227+181)/(2)=204","(47+47)/(2)=47","(47+185)/(2)=116","(47+47)/(2)=47","(47+999067.7)/(2)=499557.35","(47+47)/(2)=47","(47+69)/(2)=58","(47+204)/(2)=125.5","(47+47)/(2)=47","(47+47)/(2)=47","(156+133)/(2)=144.5"]
["S4","(94+46)/(2)=70","(999057.7+103)/(2)=499580.35","(46+47)/(2)=46.5","(120+161)/(2)=140.5","(120+46)/(2)=83","(79+71)/(2)=75","(226+180)/(2)=203","(46+46)/(2)=46","(46+184)/(2)=115","(46+46)/(2)=46","(46+999066.7)/(2)=499556.35","(46+46)/(2)=46","(46+68)/(2)=57","(46+203)/(2)=124.5","(46+46)/(2)=46","(46+46)/(2)=46","(155+132)/(2)=143.5"]
["S5","(93+45)/(2)=69","(999056.7+102)/(2)=499579.35","(45+46)/(2)=45.5","(119+160)/(2)=139.5","(119+45)/(2)=82","(78+70)/(2)=74","(167+179)/(2)=173","(45+45)/(2)=45","(45+183)/(2)=114","(45+45)/(2)=45","(45+999065.7)/(2)=499555.35","(45+45)/(2)=45","(45+67)/(2)=56","(45+202)/(2)=123.5","(45+45)/(2)=45","(45+45)/(2)=45","(154+131)/(2)=142.5"]
["S6","(92+44)/(2)=68","(999055.7+101)/(2)=499578.35","(44+45)/(2)=44.5","(118+159)/(2)=138.5","(118+44)/(2)=81","(77+69)/(2)=73","(166+178)/(2)=172","(44+44)/(2)=44","(44+53)/(2)=48.5","(44+44)/(2)=44","(44+999064.7)/(2)=499554.35","(44+44)/(2)=44","(44+66)/(2)=55","(44+201)/(2)=122.5","(44+44)/(2)=44","(44+44)/(2)=44","(134+130)/(2)=132"]
["S7","(91+43)/(2)=67","(999054.7+100)/(2)=499577.35","(43+43)/(2)=43","(117+158)/(2)=137.5","(117+43)/(2)=80","(76+68)/(2)=72","(165+177)/(2)=171","(43+43)/(2)=43","(43+52)/(2)=47.5","(43+43)/(2)=43","(43+999063.7)/(2)=499553.35","(43+43)/(2)=43","(43+65)/(2)=54","(43+200)/(2)=121.5","(43+43)/(2)=43","(43+43)/(2)=43","(133+129)/(2)=131"]
["S8","(90+42)/(2)=66","(999053.7+99)/(2)=499576.35","(42+42)/(2)=42","(116+157)/(2)=136.5","(116+42)/(2)=79","(75+67)/(2)=71","(164+176)/(2)=170","(42+42)/(2)=42","(42+51)/(2)=46.5","(42+42)/(2)=42","(42+999062.7)/(2)=499552.35","(42+42)/(2)=42","(42+64)/(2)=53","(42+199)/(2)=120.5","(42+42)/(2)=42","(42+42)/(2)=42","(132+128)/(2)=130"]
["S9","(89+41)/(2)=65","(999052.7+98)/(2)=499575.35","(41+41)/(2)=41","(115+156)/(2)=135.5","(115+41)/(2)=78","(41+41)/(2)=41","(163+175)/(2)=169","(41+41)/(2)=41","(41+50)/(2)=45.5","(41+41)/(2)=41","(41+999061.7)/(2)=499551.35","(41+41)/(2)=41","(41+63)/(2)=52","(41+198)/(2)=119.5","(41+41)/(2)=41","(41+41)/(2)=41","(131+127)/(2)=129"]
["S10","(88+40)/(2)=64","(999051.7+97)/(2)=499574.35","(40+40)/(2)=40","(114+155)/(2)=134.5","(114+40)/(2)=77","(40+40)/(2)=40","(162+174)/(2)=168","(40+40)/(2)=40","(40+49)/(2)=44.5","(40+40)/(2)=40","(40+999060.7)/(2)=499550.35","(40+40)/(2)=40","(40+62)/(2)=51","(40+197)/(2)=118.5","(40+40)/(2)=40","(40+40)/(2)=40","(130+126)/(2)=128"]
["S11","(87+39)/(2)=63","(999050.7+96)/(2)=499573.35","(39+39)/(2)=39","(113+154)/(2)=133.5","(113+39)/(2)=76","(39+39)/(2)=39","(161+173)/(2)=167","(39+39)/(2)=39","(39+48)/(2)=43.5","(39+39)/(2)=39","(39+999059.7)/(2)=499549.35","(39+39)/(2)=39","(39+61)/(2)=50","(39+196)/(2)=117.5","(39+39)/(2)=39","(39+39)/(2)=39","(129+125)/(2)=127"]
["S12","(86+38)/(2)=62","(999049.7+95)/(2)=499572.35","(38+38)/(2)=38","(112+153)/(2)=132.5","(112+38)/(2)=75","(38+38)/(2)=38","(160+172)/(2)=166","(38+38)/(2)=38","(38+47)/(2)=42.5","(38+38)/(2)=38","(38+999058.7)/(2)=499548.35","(38+38)/(2)=38","(38+60)/(2)=49","(38+195)/(2)=116.5","(38+38)/(2)=38","(38+38)/(2)=38","(128+124)/(2)=126"]
["S13","(85+37)/(2)=61","(999048.7+94)/(2)=499571.35","(37+37)/(2)=37","(37+37)/(2)=37","(111+37)/(2)=74","(37+37)/(2)=37","(132+171)/(2)=151.5","(37+37)/(2)=37","(37+46)/(2)=41.5","(37+37)/(2)=37","(37+999057.7)/(2)=499547.35","(37+37)/(2)=37","(37+59)/(2)=48","(37+194)/(2)=115.5","(37+37)/(2)=37","(37+37)/(2)=37","(127+123)/(2)=125"]
["S14","(84+36)/(2)=60","(999047.7+93)/(2)=499570.35","(36+36)/(2)=36","(36+36)/(2)=36","(110+36)/(2)=73","(36+36)/(2)=36","(131+170)/(2)=150.5","(36+36)/(2)=36","(36+45)/(2)=40.5","(36+36)/(2)=36","(36+999056.7)/(2)=499546.35","(36+36)/(2)=36","(36+58)/(2)=47","(36+193)/(2)=114.5","(36+36)/(2)=36","(36+36)/(2)=36","(126+122)/(2)=124"]
["S15","(83+35)/(2)=59","(999046.7+92)/(2)=499569.35","(35+35)/(2)=35","(35+35)/(2)=35","(109+35)/(2)=72","(35+35)/(2)=35","(130+169)/(2)=149.5","(35+35)/(2)=35","(35+44)/(2)=39.5","(35+35)/(2)=35","(35+999055.7)/(2)=499545.35","(35+35)/(2)=35","(35+57)/(2)=46","(35+192)/(2)=113.5","(35+35)/(2)=35","(35+35)/(2)=35","(125+121)/(2)=123"]
["S16","(82+34)/(2)=58","(999045.7+91)/(2)=499568.35","(34+34)/(2)=34","(34+34)/(2)=34","(108+34)/(2)=71","(34+34)/(2)=34","(129+168)/(2)=148.5","(34+34)/(2)=34","(34+43)/(2)=38.5","(34+34)/(2)=34","(34+999054.7)/(2)=499544.35","(34+34)/(2)=34","(34+56)/(2)=45","(34+191)/(2)=112.5","(34+34)/(2)=34","(34+34)/(2)=34","(124+120)/(2)=122"]
["S17","(81+33)/(2)=57","(999044.7+90)/(2)=499567.35","(33+33)/(2)=33","(33+33)/(2)=33","(107+33)/(2)=70","(33+33)/(2)=33","(128+167)/(2)=147.5","(33+33)/(2)=33","(33+42)/(2)=37.5","(33+33)/(2)=33","(33+999053.7)/(2)=499543.35","(33+33)/(2)=33","(33+55)/(2)=44","(33+190)/(2)=111.5","(33+33)/(2)=33","(33+33)/(2)=33","(123+119)/(2)=121"]
["S18","(32+32)/(2)=32","(999043.7+89)/(2)=499566.35","(32+32)/(2)=32","(32+32)/(2)=32","(106+32)/(2)=69","(32+32)/(2)=32","(127+166)/(2)=146.5","(32+32)/(2)=32","(32+41)/(2)=36.5","(32+32)/(2)=32","(32+999052.7)/(2)=499542.35","(32+32)/(2)=32","(32+54)/(2)=43","(32+189)/(2)=110.5","(32+32)/(2)=32","(32+32)/(2)=32","(122+118)/(2)=120"]
["S19","(31+31)/(2)=31","(999042.7+88)/(2)=499565.35","(31+31)/(2)=31","(31+31)/(2)=31","(105+31)/(2)=68","(31+31)/(2)=31","(126+165)/(2)=145.5","(31+31)/(2)=31","(31+40)/(2)=35.5","(31+31)/(2)=31","(31+999051.7)/(2)=499541.35","(31+31)/(2)=31","(31+53)/(2)=42","(31+188)/(2)=109.5","(31+31)/(2)=31","(31+31)/(2)=31","(121+117)/(2)=119"]
["S20","(30+30)/(2)=30","(999041.7+87)/(2)=499564.35","(30+30)/(2)=30","(30+30)/(2)=30","(104+30)/(2)=67","(30+30)/(2)=30","(125+164)/(2)=144.5","(30+30)/(2)=30","(30+30)/(2)=30","(30+30)/(2)=30","(30+999050.7)/(2)=499540.35","(30+30)/(2)=30","(30+52)/(2)=41","(30+187)/(2)=108.5","(30+30)/(2)=30","(30+30)/(2)=30","(120+116)/(2)=118"]
["S21","(29+29)/(2)=29","(999040.7+86)/(2)=499563.35","(29+29)/(2)=29","(29+29)/(2)=29","(103+29)/(2)=66","(29+29)/(2)=29","(124+163)/(2)=143.5","(29+29)/(2)=29","(29+29)/(2)=29","(29+29)/(2)=29","(29+999049.7)/(2)=499539.35","(29+29)/(2)=29","(29+51)/(2)=40","(29+186)/(2)=107.5","(29+29)/(2)=29","(29+29)/(2)=29","(119+115)/(2)=117"]
["S22","(28+28)/(2)=28","(999039.7+85)/(2)=499562.35","(28+28)/(2)=28","(28+28)/(2)=28","(102+28)/(2)=65","(28+28)/(2)=28","(123+162)/(2)=142.5","(28+28)/(2)=28","(28+28)/(2)=28","(28+28)/(2)=28","(28+999048.7)/(2)=499538.35","(28+28)/(2)=28","(28+50)/(2)=39","(28+185)/(2)=106.5","(28+28)/(2)=28","(28+28)/(2)=28","(118+114)/(2)=116"]
["S23","(27+27)/(2)=27","(999038.7+84)/(2)=499561.35","(27+27)/(2)=27","(27+27)/(2)=27","(101+27)/(2)=64","(27+27)/(2)=27","(122+161)/(2)=141.5","(27+27)/(2)=27","(27+27)/(2)=27","(27+27)/(2)=27","(27+999047.7)/(2)=499537.35","(27+27)/(2)=27","(27+49)/(2)=38","(27+184)/(2)=105.5","(27+27)/(2)=27","(27+27)/(2)=27","(117+113)/(2)=115"]
["S24","(26+26)/(2)=26","(999037.7+83)/(2)=499560.35","(26+26)/(2)=26","(26+26)/(2)=26","(100+26)/(2)=63","(26+26)/(2)=26","(121+160)/(2)=140.5","(26+26)/(2)=26","(26+26)/(2)=26","(26+26)/(2)=26","(26+999046.7)/(2)=499536.35","(26+26)/(2)=26","(26+26)/(2)=26","(26+183)/(2)=104.5","(26+26)/(2)=26","(26+26)/(2)=26","(116+112)/(2)=114"]
["S25","(25+25)/(2)=25","(999036.7+82)/(2)=499559.35","(25+25)/(2)=25","(25+25)/(2)=25","(99+25)/(2)=62","(25+25)/(2)=25","(120+159)/(2)=139.5","(25+25)/(2)=25","(25+25)/(2)=25","(25+25)/(2)=25","(25+999045.7)/(2)=499535.35","(25+25)/(2)=25","(25+25)/(2)=25","(25+182)/(2)=103.5","(25+25)/(2)=25","(25+25)/(2)=25","(115+111)/(2)=113"]
["S26","(24+24)/(2)=24","(999035.7+81)/(2)=499558.35","(24+24)/(2)=24","(24+24)/(2)=24","(98+24)/(2)=61","(24+24)/(2)=24","(119+158)/(2)=138.5","(24+24)/(2)=24","(24+24)/(2)=24","(24+24)/(2)=24","(24+999044.7)/(2)=499534.35","(24+24)/(2)=24","(24+24)/(2)=24","(24+181)/(2)=102.5","(24+24)/(2)=24","(24+24)/(2)=24","(114+110)/(2)=112"]
["S27","(23+23)/(2)=23","(999034.7+80)/(2)=499557.35","(23+23)/(2)=23","(23+23)/(2)=23","(97+23)/(2)=60","(23+23)/(2)=23","(118+157)/(2)=137.5","(23+23)/(2)=23","(23+23)/(2)=23","(23+23)/(2)=23","(23+999043.7)/(2)=499533.35","(23+23)/(2)=23","(23+23)/(2)=23","(23+180)/(2)=101.5","(23+23)/(2)=23","(23+23)/(2)=23","(113+109)/(2)=111"]
["S28","(22+22)/(2)=22","(999033.7+79)/(2)=499556.35","(22+22)/(2)=22","(22+22)/(2)=22","(96+22)/(2)=59","(22+22)/(2)=22","(117+156)/(2)=136.5","(22+22)/(2)=22","(22+22)/(2)=22","(22+22)/(2)=22","(22+999042.7)/(2)=499532.35","(22+22)/(2)=22","(22+22)/(2)=22","(22+179)/(2)=100.5","(22+22)/(2)=22","(22+22)/(2)=22","(66+108)/(2)=87"]
["S29","(21+21)/(2)=21","(999032.7+78)/(2)=499555.35","(21+21)/(2)=21","(21+21)/(2)=21","(95+21)/(2)=58","(21+21)/(2)=21","(116+155)/(2)=135.5","(21+21)/(2)=21","(21+21)/(2)=21","(21+21)/(2)=21","(21+999041.7)/(2)=499531.35","(21+21)/(2)=21","(21+21)/(2)=21","(21+178)/(2)=99.5","(21+21)/(2)=21","(21+21)/(2)=21","(65+107)/(2)=86"]
["S30","(20+20)/(2)=20","(999031.7+77)/(2)=499554.35","(20+20)/(2)=20","(20+20)/(2)=20","(94+20)/(2)=57","(20+20)/(2)=20","(115+154)/(2)=134.5","(20+20)/(2)=20","(20+20)/(2)=20","(20+20)/(2)=20","(20+999040.7)/(2)=499530.35","(20+20)/(2)=20","(20+20)/(2)=20","(20+177)/(2)=98.5","(20+20)/(2)=20","(20+20)/(2)=20","(64+106)/(2)=85"]
["S31","(19+19)/(2)=19","(999030.7+76)/(2)=499553.35","(19+19)/(2)=19","(19+19)/(2)=19","(93+19)/(2)=56","(19+19)/(2)=19","(114+153)/(2)=133.5","(19+19)/(2)=19","(19+19)/(2)=19","(19+19)/(2)=19","(19+999039.7)/(2)=499529.35","(19+19)/(2)=19","(19+19)/(2)=19","(19+176)/(2)=97.5","(19+19)/(2)=19","(19+19)/(2)=19","(63+105)/(2)=84"]
["S32","(18+18)/(2)=18","(999029.7+75)/(2)=499552.35","(18+18)/(2)=18","(18+18)/(2)=18","(92+18)/(2)=55","(18+18)/(2)=18","(113+152)/(2)=132.5","(18+18)/(2)=18","(18+18)/(2)=18","(18+18)/(2)=18","(18+999038.7)/(2)=499528.35","(18+18)/(2)=18","(18+18)/(2)=18","(18+175)/(2)=96.5","(18+18)/(2)=18","(18+18)/(2)=18","(62+104)/(2)=83"]
["S33","(17+17)/(2)=17","(999028.7+17)/(2)=499522.85","(17+17)/(2)=17","(17+17)/(2)=17","(91+17)/(2)=54","(17+17)/(2)=17","(112+151)/(2)=131.5","(17+17)/(2)=17","(17+17)/(2)=17","(17+17)/(2)=17","(17+999037.7)/(2)=499527.35","(17+17)/(2)=17","(17+17)/(2)=17","(17+174)/(2)=95.5","(17+17)/(2)=17","(17+17)/(2)=17","(61+103)/(2)=82"]
["S34","(16+16)/(2)=16","(999027.7+16)/(2)=499521.85","(16+16)/(2)=16","(16+16)/(2)=16","(90+16)/(2)=53","(16+16)/(2)=16","(111+150)/(2)=130.5","(16+16)/(2)=16","(16+16)/(2)=16","(16+16)/(2)=16","(16+999036.7)/(2)=499526.35","(16+16)/(2)=16","(16+16)/(2)=16","(16+173)/(2)=94.5","(16+16)/(2)=16","(16+16)/(2)=16","(60+102)/(2)=81"]
["S35","(15+15)/(2)=15","(999026.7+15)/(2)=499520.85","(15+15)/(2)=15","(15+15)/(2)=15","(89+15)/(2)=52","(15+15)/(2)=15","(110+149)/(2)=129.5","(15+15)/(2)=15","(15+15)/(2)=15","(15+15)/(2)=15","(15+999035.7)/(2)=499525.35","(15+15)/(2)=15","(15+15)/(2)=15","(15+172)/(2)=93.5","(15+15)/(2)=15","(15+15)/(2)=15","(59+101)/(2)=80"]
["S36","(14+14)/(2)=14","(999025.7+14)/(2)=499519.85","(14+14)/(2)=14","(14+14)/(2)=14","(88+14)/(2)=51","(14+14)/(2)=14","(109+77)/(2)=93","(14+14)/(2)=14","(14+14)/(2)=14","(14+14)/(2)=14","(14+999034.7)/(2)=499524.35","(14+14)/(2)=14","(14+14)/(2)=14","(14+171)/(2)=92.5","(14+14)/(2)=14","(14+14)/(2)=14","(58+100)/(2)=79"]
["S37","(13+13)/(2)=13","(999024.7+13)/(2)=499518.85","(13+13)/(2)=13","(13+13)/(2)=13","(87+13)/(2)=50","(13+13)/(2)=13","(108+76)/(2)=92","(13+13)/(2)=13","(13+13)/(2)=13","(13+13)/(2)=13","(13+999033.7)/(2)=499523.35","(13+13)/(2)=13","(13+13)/(2)=13","(13+170)/(2)=91.5","(13+13)/(2)=13","(13+13)/(2)=13","(57+99)/(2)=78"]
["S38","(12+12)/(2)=12","(999023.7+12)/(2)=499517.85","(12+12)/(2)=12","(12+12)/(2)=12","(86+12)/(2)=49","(12+12)/(2)=12","(107+75)/(2)=91","(12+12)/(2)=12","(12+12)/(2)=12","(12+12)/(2)=12","(12+999032.7)/(2)=499522.35","(12+12)/(2)=12","(12+12)/(2)=12","(12+169)/(2)=90.5","(12+12)/(2)=12","(12+12)/(2)=12","(56+98)/(2)=77"]
["S39","(11+11)/(2)=11","(999022.7+11)/(2)=499516.85","(11+11)/(2)=11","(11+11)/(2)=11","(85+11)/(2)=48","(11+11)/(2)=11","(11+11)/(2)=11","(11+11)/(2)=11","(11+11)/(2)=11","(11+11)/(2)=11","(11+999031.7)/(2)=499521.35","(11+11)/(2)=11","(11+11)/(2)=11","(11+11)/(2)=11","(11+11)/(2)=11","(11+11)/(2)=11","(36+97)/(2)=66.5"]
["S40","(10+10)/(2)=10","(999021.7+10)/(2)=499515.85","(10+10)/(2)=10","(10+10)/(2)=10","(84+10)/(2)=47","(10+10)/(2)=10","(10+10)/(2)=10","(10+10)/(2)=10","(10+10)/(2)=10","(10+10)/(2)=10","(10+999030.7)/(2)=499520.35","(10+10)/(2)=10","(10+10)/(2)=10","(10+10)/(2)=10","(10+10)/(2)=10","(10+10)/(2)=10","(10+10)/(2)=10"]
["S41","(9+9)/(2)=9","(999020.7+9)/(2)=499514.85","(9+9)/(2)=9","(9+9)/(2)=9","(83+9)/(2)=46","(9+9)/(2)=9","(9+9)/(2)=9","(9+9)/(2)=9","(9+9)/(2)=9","(9+9)/(2)=9","(9+999029.7)/(2)=499519.35","(9+9)/(2)=9","(9+9)/(2)=9","(9+9)/(2)=9","(9+9)/(2)=9","(9+9)/(2)=9","(9+9)/(2)=9"]
["S42","(8+8)/(2)=8","(999019.7+8)/(2)=499513.85","(8+8)/(2)=8","(8+8)/(2)=8","(82+8)/(2)=45","(8+8)/(2)=8","(8+8)/(2)=8","(8+8)/(2)=8","(8+8)/(2)=8","(8+8)/(2)=8","(8+999028.7)/(2)=499518.35","(8+8)/(2)=8","(8+8)/(2)=8","(8+8)/(2)=8","(8+8)/(2)=8","(8+8)/(2)=8","(8+8)/(2)=8"]
["S43","(7+7)/(2)=7","(999018.7+7)/(2)=499512.85","(7+7)/(2)=7","(7+7)/(2)=7","(81+7)/(2)=44","(7+7)/(2)=7","(7+7)/(2)=7","(7+7)/(2)=7","(7+7)/(2)=7","(7+7)/(2)=7","(7+999027.7)/(2)=499517.35","(7+7)/(2)=7","(7+7)/(2)=7","(7+7)/(2)=7","(7+7)/(2)=7","(7+7)/(2)=7","(7+7)/(2)=7"]
["S44","(6+6)/(2)=6","(999017.7+6)/(2)=499511.85","(6+6)/(2)=6","(6+6)/(2)=6","(80+6)/(2)=43","(6+6)/(2)=6","(6+6)/(2)=6","(6+6)/(2)=6","(6+6)/(2)=6","(6+6)/(2)=6","(6+999026.7)/(2)=499516.35","(6+6)/(2)=6","(6+6)/(2)=6","(6+6)/(2)=6","(6+6)/(2)=6","(6+6)/(2)=6","(6+6)/(2)=6"]
["S45","(5+5)/(2)=5","(999016.7+5)/(2)=499510.85","(5+5)/(2)=5","(5+5)/(2)=5","(79+5)/(2)=42","(5+5)/(2)=5","(5+5)/(2)=5","(5+5)/(2)=5","(5+5)/(2)=5","(5+5)/(2)=5","(5+999025.7)/(2)=499515.35","(5+5)/(2)=5","(5+5)/(2)=5","(5+5)/(2)=5","(5+5)/(2)=5","(5+5)/(2)=5","(5+5)/(2)=5"]
["S46","(4+4)/(2)=4","(999015.7+4)/(2)=499509.85","(4+4)/(2)=4","(4+4)/(2)=4","(4+4)/(2)=4","(4+4)/(2)=4","(4+4)/(2)=4","(4+4)/(2)=4","(4+4)/(2)=4","(4+4)/(2)=4","(4+999024.7)/(2)=499514.35","(4+4)/(2)=4","(4+4)/(2)=4","(4+4)/(2)=4","(4+4)/(2)=4","(4+4)/(2)=4","(4+4)/(2)=4"]
["S47","(3+3)/(2)=3","(999014.7+3)/(2)=499508.85","(3+3)/(2)=3","(3+3)/(2)=3","(3+3)/(2)=3","(3+3)/(2)=3","(3+3)/(2)=3","(3+3)/(2)=3","(3+3)/(2)=3","(3+3)/(2)=3","(3+999023.7)/(2)=499513.35","(3+3)/(2)=3","(3+3)/(2)=3","(3+3)/(2)=3","(3+3)/(2)=3","(3+3)/(2)=3","(3+3)/(2)=3"]
["S48","(2+2)/(2)=2","(999013.7+2)/(2)=499507.85","(2+2)/(2)=2","(2+2)/(2)=2","(2+2)/(2)=2","(2+2)/(2)=2","(2+2)/(2)=2","(2+2)/(2)=2","(2+2)/(2)=2","(2+2)/(2)=2","(2+999022.7)/(2)=499512.35","(2+2)/(2)=2","(2+2)/(2)=2","(2+2)/(2)=2","(2+2)/(2)=2","(2+2)/(2)=2","(2+2)/(2)=2"]
["S49","(1+1)/(2)=1","(999012.7+1)/(2)=499506.85","(1+1)/(2)=1","(1+1)/(2)=1","(1+1)/(2)=1","(1+1)/(2)=1","(1+1)/(2)=1","(1+1)/(2)=1","(1+1)/(2)=1","(1+1)/(2)=1","(1+998965.7)/(2)=499483.35","(1+1)/(2)=1","(1+1)/(2)=1","(1+1)/(2)=1","(1+1)/(2)=1","(1+1)/(2)=1","(1+1)/(2)=1"]
["S50","(0+0)/(2)=0","(999011.7+0)/(2)=499505.85","(0+0)/(2)=0","(0+0)/(2)=0","(0+0)/(2)=0","(0+0)/(2)=0","(0+0)/(2)=0","(0+0)/(2)=0","(0+0)/(2)=0","(0+0)/(2)=0","(0+998964.7)/(2)=499482.35","(0+0)/(2)=0","(0+0)/(2)=0","(0+0)/(2)=0","(0+0)/(2)=0","(0+0)/(2)=0","(0+0)/(2)=0"]
[]
["Lépcsők(2)","X(A1)","X(A2)","X(A3)","X(A4)","X(A5)","X(A6)","X(A7)","X(A8)","X(A9)","X(A10)","X(A11)","X(A12)","X(A13)","X(A14)","X(A15)","X(A16)","X(A17)"]
["S1",73,499583.3,49.5,248,86,78,206,49,118,49,499559.3,49,60,127.5,49,49,146.5]
["S2",72,499582.3,48.5,247,85,77,205,48,117,48,499558.3,48,59,126.5,48,48,145.5]
["S3",71,499581.3,47.5,246,84,76,204,47,116,47,499557.3,47,58,125.5,47,47,144.5]
["S4",70,499580.3,46.5,140.5,83,75,203,46,115,46,499556.3,46,57,124.5,46,46,143.5]
["S5",69,499579.3,45.5,139.5,82,74,173,45,114,45,499555.3,45,56,123.5,45,45,142.5]
["S6",68,499578.3,44.5,138.5,81,73,172,44,48.5,44,499554.3,44,55,122.5,44,44,132]
["S7",67,499577.3,43,137.5,80,72,171,43,47.5,43,499553.3,43,54,121.5,43,43,131]
["S8",66,499576.3,42,136.5,79,71,170,42,46.5,42,499552.3,42,53,120.5,42,42,130]
["S9",65,499575.3,41,135.5,78,41,169,41,45.5,41,499551.3,41,52,119.5,41,41,129]
["S10",64,499574.3,40,134.5,77,40,168,40,44.5,40,499550.3,40,51,118.5,40,40,128]
["S11",63,499573.3,39,133.5,76,39,167,39,43.5,39,499549.3,39,50,117.5,39,39,127]
["S12",62,499572.3,38,132.5,75,38,166,38,42.5,38,499548.3,38,49,116.5,38,38,126]
["S13",61,499571.3,37,37,74,37,151.5,37,41.5,37,499547.3,37,48,115.5,37,37,125]
["S14",60,499570.3,36,36,73,36,150.5,36,40.5,36,499546.3,36,47,114.5,36,36,124]
["S15",59,499569.3,35,35,72,35,149.5,35,39.5,35,499545.3,35,46,113.5,35,35,123]
["S16",58,499568.3,34,34,71,34,148.5,34,38.5,34,499544.3,34,45,112.5,34,34,122]
["S17",57,499567.3,33,33,70,33,147.5,33,37.5,33,499543.3,33,44,111.5,33,33,121]
["S18",32,499566.3,32,32,69,32,146.5,32,36.5,32,499542.3,32,43,110.5,32,32,120]
["S19",31,499565.3,31,31,68,31,145.5,31,35.5,31,499541.3,31,42,109.5,31,31,119]
["S20",30,499564.3,30,30,67,30,144.5,30,30,30,499540.3,30,41,108.5,30,30,118]
["S21",29,499563.3,29,29,66,29,143.5,29,29,29,499539.3,29,40,107.5,29,29,117]
["S22",28,499562.3,28,28,65,28,142.5,28,28,28,499538.3,28,39,106.5,28,28,116]
["S23",27,499561.3,27,27,64,27,141.5,27,27,27,499537.3,27,38,105.5,27,27,115]
["S24",26,499560.3,26,26,63,26,140.5,26,26,26,499536.3,26,26,104.5,26,26,114]
["S25",25,499559.3,25,25,62,25,139.5,25,25,25,499535.3,25,25,103.5,25,25,113]
["S26",24,499558.3,24,24,61,24,138.5,24,24,24,499534.3,24,24,102.5,24,24,112]
["S27",23,499557.3,23,23,60,23,137.5,23,23,23,499533.3,23,23,101.5,23,23,111]
["S28",22,499556.3,22,22,59,22,136.5,22,22,22,499532.3,22,22,100.5,22,22,87]
["S29",21,499555.3,21,21,58,21,135.5,21,21,21,499531.3,21,21,99.5,21,21,86]
["S30",20,499554.3,20,20,57,20,134.5,20,20,20,499530.3,20,20,98.5,20,20,85]
["S31",19,499553.3,19,19,56,19,133.5,19,19,19,499529.3,19,19,97.5,19,19,84]
["S32",18,499552.3,18,18,55,18,132.5,18,18,18,499528.3,18,18,96.5,18,18,83]
["S33",17,499522.8,17,17,54,17,131.5,17,17,17,499527.3,17,17,95.5,17,17,82]
["S34",16,499521.8,16,16,53,16,130.5,16,16,16,499526.3,16,16,94.5,16,16,81]
["S35",15,499520.8,15,15,52,15,129.5,15,15,15,499525.3,15,15,93.5,15,15,80]
["S36",14,499519.8,14,14,51,14,93,14,14,14,499524.3,14,14,92.5,14,14,79]
["S37",13,499518.8,13,13,50,13,92,13,13,13,499523.3,13,13,91.5,13,13,78]
["S38",12,499517.8,12,12,49,12,91,12,12,12,499522.3,12,12,90.5,12,12,77]
["S39",11,499516.8,11,11,48,11,11,11,11,11,499521.3,11,11,11,11,11,66.5]
["S40",10,499515.8,10,10,47,10,10,10,10,10,499520.3,10,10,10,10,10,10]
["S41",9,499514.8,9,9,46,9,9,9,9,9,499519.3,9,9,9,9,9,9]
["S42",8,499513.8,8,8,45,8,8,8,8,8,499518.3,8,8,8,8,8,8]
["S43",7,499512.8,7,7,44,7,7,7,7,7,499517.3,7,7,7,7,7,7]
["S44",6,499511.8,6,6,43,6,6,6,6,6,499516.3,6,6,6,6,6,6]
["S45",5,499510.8,5,5,42,5,5,5,5,5,499515.3,5,5,5,5,5,5]
["S46",4,499509.8,4,4,4,4,4,4,4,4,499514.3,4,4,4,4,4,4]
["S47",3,499508.8,3,3,3,3,3,3,3,3,499513.3,3,3,3,3,3,3]
["S48",2,499507.8,2,2,2,2,2,2,2,2,499512.3,2,2,2,2,2,2]
["S49",1,499506.8,1,1,1,1,1,1,1,1,499483.3,1,1,1,1,1,1]
["S50",0,499505.8,0,0,0,0,0,0,0,0,499482.3,0,0,0,0,0,0]
[]
["COCO:Y0",{"$f":"'sorszám-inverz'!B2","v":"alkalmazkodás"},{"$f":"'sorszám-inverz'!C2","v":"becsületesség"},{"$f":"'sorszám-inverz'!D2","v":"családi élet"},{"$f":"'sorszám-inverz'!E2","v":"csapatjáték"},{"$f":"'sorszám-inverz'!F2","v":"döntésképesség"},{"$f":"'sorszám-inverz'!G2","v":"hűség"},{"$f":"'sorszám-inverz'!H2","v":"karrierfejlesztés"},{"$f":"'sorszám-inverz'!I2","v":"képzés, továbbképzés"},{"$f":"'sorszám-inverz'!J2","v":"kezdeményezőkészség"},{"$f":"'sorszám-inverz'!K2","v":"konfliktuskezelés"},{"$f":"'sorszám-inverz'!L2","v":"nyitottság"},{"$f":"'sorszám-inverz'!M2","v":"önállóság"},{"$f":"'sorszám-inverz'!N2","v":"párkapcsolat"},{"$f":"'sorszám-inverz'!O2","v":"pontosság"},{"$f":"'sorszám-inverz'!P2","v":"rátermettség"},{"$f":"'sorszám-inverz'!Q2","v":"segítőkészség"},{"$f":"'sorszám-inverz'!R2","v":"vallás"},"Becslés","Tény+0","Delta","Delta/Tény","ellenőrzés"]
[{"$f":"'sorszám-inverz'!A3","v":"tesztalany 1"},61,499583.3,30,18,68,34,170,49,39.5,36,499559.3,26,42,127.5,49,49,9,999950.7,1000000,49.3,0,{"$f":"IF(U164*inverz1000000!U164<0,\"hiteles\",\"hiteltelen\")","v":"hiteles"}]
[{"$f":"'sorszám-inverz'!A4","v":"tesztalany 10"},73,499583.3,30,136.5,86,34,8,10,118,19,499559.3,49,14,127.5,43,49,9,999948.7,1000000,51.3,0.01,{"$f":"IF(U165*inverz1000000!U165<0,\"hiteles\",\"hiteltelen\")","v":"hiteles"}]
[{"$f":"'sorszám-inverz'!A5","v":"tesztalany 11"},61,499583.3,30,136.5,1,34,145.5,21,17,49,499483.3,26,42,127.5,26,49,118,999950.2,1000000,49.8,0,{"$f":"IF(U166*inverz1000000!U166<0,\"hiteles\",\"hiteltelen\")","v":"hiteles"}]
[{"$f":"'sorszám-inverz'!A6","v":"tesztalany 12"},73,499583.3,30,18,86,34,145.5,31,17,49,499559.3,49,14,127.5,26,49,146.5,1000038.2,1000000,-38.200000000000003,0,{"$f":"IF(U167*inverz1000000!U167<0,\"hiteles\",\"hiteltelen\")","v":"hiteles"}]
[{"$f":"'sorszám-inverz'!A7","v":"tesztalany 13"},61,499583.3,30,136.5,68,34,137.5,31,17,36,499559.3,49,42,110.5,26,49,118,1000088.2,1000000,-88.2,-0.01,{"$f":"IF(U168*inverz1000000!U168<0,\"hiteles\",\"hiteltelen\")","v":"hiteles"}]
[{"$f":"'sorszám-inverz'!A8","v":"tesztalany 14"},61,499583.3,30,136.5,86,34,8,31,118,49,499532.3,6,14,110.5,26,49,85,999959.7,1000000,40.299999999999997,0,{"$f":"IF(U169*inverz1000000!U169<0,\"hiteles\",\"hiteltelen\")","v":"hiteles"}]
[{"$f":"'sorszám-inverz'!A9","v":"tesztalany 15"},61,499518.8,40,136.5,68,75,206,10,17,19,499532.3,49,53,90.5,26,19,85,1000006.2,1000000,-6.2,0,{"$f":"IF(U170*inverz1000000!U170<0,\"hiteles\",\"hiteltelen\")","v":"hiteltelen"}]
[{"$f":"'sorszám-inverz'!A10","v":"tesztalany 16"},61,499583.3,30,18,86,34,8,4,118,19,499559.3,49,14,127.5,26,49,146.5,999932.7,1000000,67.3,0.01,{"$f":"IF(U171*inverz1000000!U171<0,\"hiteles\",\"hiteltelen\")","v":"hiteles"}]
[{"$f":"'sorszám-inverz'!A11","v":"tesztalany 17"},15,499583.3,30,248,68,34,170,39,17,19,499559.3,49,14,127.5,26,19,9,1000027.2,1000000,-27.2,0,{"$f":"IF(U172*inverz1000000!U172<0,\"hiteles\",\"hiteltelen\")","v":"hiteles"}]
[{"$f":"'sorszám-inverz'!A12","v":"tesztalany 18"},61,499518.8,30,248,47,34,170,10,17,36,499532.3,26,14,90.5,3,19,111,999967.7,1000000,32.299999999999997,0,{"$f":"IF(U173*inverz1000000!U173<0,\"hiteles\",\"hiteltelen\")","v":"hiteles"}]
[{"$f":"'sorszám-inverz'!A13","v":"tesztalany 19"},15,499505.8,40,248,68,75,137.5,4,1,2,499516.3,6,42,90.5,3,19,66.5,999839.7,1000000,160.30000000000001,0.02,{"$f":"IF(U174*inverz1000000!U174<0,\"hiteles\",\"hiteltelen\")","v":"hiteles"}]
[{"$f":"'sorszám-inverz'!A14","v":"tesztalany 2"},73,499583.3,30,18,86,34,137.5,10,17,36,499559.3,49,53,127.5,49,49,146.5,1000058.2,1000000,-58.2,-0.01,{"$f":"IF(U175*inverz1000000!U175<0,\"hiteles\",\"hiteltelen\")","v":"hiteles"}]
[{"$f":"'sorszám-inverz'!A15","v":"tesztalany 20"},73,499583.3,30,18,68,75,137.5,31,118,49,499559.3,26,42,127.5,26,49,118,1000130.7,1000000,-130.69999999999999,-0.01,{"$f":"IF(U176*inverz1000000!U176<0,\"hiteles\",\"hiteltelen\")","v":"hiteles"}]
[{"$f":"'sorszám-inverz'!A16","v":"tesztalany 21"},61,499583.3,30,18,1,34,137.5,21,118,19,499559.3,49,14,127.5,26,3,9,999810.7,1000000,189.3,0.02,{"$f":"IF(U177*inverz1000000!U177<0,\"hiteles\",\"hiteltelen\")","v":"hiteles"}]
[{"$f":"'sorszám-inverz'!A17","v":"tesztalany 22"},73,499518.8,49.5,248,68,34,8,4,17,36,499559.3,49,14,90.5,26,3,146.5,999944.7,1000000,55.3,0.01,{"$f":"IF(U178*inverz1000000!U178<0,\"hiteles\",\"hiteltelen\")","v":"hiteles"}]
[{"$f":"'sorszám-inverz'!A18","v":"tesztalany 23"},15,499583.3,30,248,68,75,137.5,39,39.5,19,499532.3,26,50,110.5,26,19,118,1000136.2,1000000,-136.19999999999999,-0.01,{"$f":"IF(U179*inverz1000000!U179<0,\"hiteles\",\"hiteltelen\")","v":"hiteles"}]
[{"$f":"'sorszám-inverz'!A19","v":"tesztalany 24"},15,499583.3,40,136.5,68,75,170,39,39.5,19,499532.3,6,42,0,3,49,146.5,999964.2,1000000,35.799999999999997,0,{"$f":"IF(U180*inverz1000000!U180<0,\"hiteles\",\"hiteltelen\")","v":"hiteles"}]
[{"$f":"'sorszám-inverz'!A20","v":"tesztalany 25"},15,499583.3,40,136.5,68,34,91,21,39.5,19,499532.3,26,50,127.5,43,49,146.5,1000021.7,1000000,-21.7,0,{"$f":"IF(U181*inverz1000000!U181<0,\"hiteles\",\"hiteltelen\")","v":"hiteles"}]
[{"$f":"'sorszám-inverz'!A21","v":"tesztalany 26"},15,499583.3,30,18,86,78,170,39,118,36,499559.3,6,14,110.5,43,49,146.5,1000101.7,1000000,-101.7,-0.01,{"$f":"IF(U182*inverz1000000!U182<0,\"hiteles\",\"hiteltelen\")","v":"hiteles"}]
[{"$f":"'sorszám-inverz'!A22","v":"tesztalany 27"},15,499583.3,30,136.5,47,34,8,4,118,49,499516.3,6,14,110.5,26,19,85,999801.7,1000000,198.3,0.02,{"$f":"IF(U183*inverz1000000!U183<0,\"hiteles\",\"hiteltelen\")","v":"hiteles"}]
[{"$f":"'sorszám-inverz'!A23","v":"tesztalany 28"},61,499583.3,40,136.5,47,34,91,31,39.5,19,499559.3,26,53,110.5,26,49,9,999915.2,1000000,84.8,0.01,{"$f":"IF(U184*inverz1000000!U184<0,\"hiteles\",\"hiteltelen\")","v":"hiteles"}]
[{"$f":"'sorszám-inverz'!A24","v":"tesztalany 29"},15,499583.3,30,136.5,47,34,137.5,21,39.5,2,499516.3,6,50,110.5,3,19,85,999835.7,1000000,164.3,0.02,{"$f":"IF(U185*inverz1000000!U185<0,\"hiteles\",\"hiteltelen\")","v":"hiteles"}]
[{"$f":"'sorszám-inverz'!A25","v":"tesztalany 3"},61,499518.8,45.5,136.5,68,75,170,21,17,36,499532.3,49,55,90.5,26,19,9,999929.7,1000000,70.3,0.01,{"$f":"IF(U186*inverz1000000!U186<0,\"hiteles\",\"hiteltelen\")","v":"hiteles"}]
[{"$f":"'sorszám-inverz'!A26","v":"tesztalany 30"},73,499583.3,30,18,68,34,206,49,118,49,499559.3,49,14,127.5,49,49,9,1000085.2,1000000,-85.2,-0.01,{"$f":"IF(U187*inverz1000000!U187<0,\"hiteles\",\"hiteltelen\")","v":"hiteles"}]
[{"$f":"'sorszám-inverz'!A27","v":"tesztalany 31"},61,499583.3,30,136.5,86,34,8,21,39.5,19,499532.3,26,14,110.5,26,49,146.5,999922.7,1000000,77.3,0.01,{"$f":"IF(U188*inverz1000000!U188<0,\"hiteles\",\"hiteltelen\")","v":"hiteles"}]
[{"$f":"'sorszám-inverz'!A28","v":"tesztalany 32"},61,499583.3,40,136.5,86,34,137.5,49,17,49,499532.3,26,55,127.5,43,49,85,1000111.2,1000000,-111.2,-0.01,{"$f":"IF(U189*inverz1000000!U189<0,\"hiteles\",\"hiteltelen\")","v":"hiteles"}]
[{"$f":"'sorszám-inverz'!A29","v":"tesztalany 33"},61,499518.8,45.5,136.5,68,75,91,21,39.5,19,499516.3,26,42,90.5,43,19,146.5,999958.7,1000000,41.3,0,{"$f":"IF(U190*inverz1000000!U190<0,\"hiteles\",\"hiteltelen\")","v":"hiteles"}]
[{"$f":"'sorszám-inverz'!A30","v":"tesztalany 34"},61,499518.8,40,136.5,86,34,137.5,10,39.5,36,499532.3,49,50,110.5,43,19,146.5,1000049.7,1000000,-49.7,0,{"$f":"IF(U191*inverz1000000!U191<0,\"hiteles\",\"hiteltelen\")","v":"hiteles"}]
[{"$f":"'sorszám-inverz'!A31","v":"tesztalany 35"},15,499583.3,30,18,86,34,91,39,118,36,499532.3,26,50,110.5,43,49,146.5,1000007.7,1000000,-7.7,0,{"$f":"IF(U192*inverz1000000!U192<0,\"hiteles\",\"hiteltelen\")","v":"hiteltelen"}]
[{"$f":"'sorszám-inverz'!A32","v":"tesztalany 36"},61,499583.3,30,136.5,68,34,137.5,31,39.5,36,499559.3,26,42,90.5,43,19,146.5,1000083.2,1000000,-83.2,-0.01,{"$f":"IF(U193*inverz1000000!U193<0,\"hiteles\",\"hiteltelen\")","v":"hiteles"}]
[{"$f":"'sorszám-inverz'!A33","v":"tesztalany 37"},73,499583.3,30,18,68,34,206,49,118,49,499559.3,49,14,127.5,49,49,9,1000085.2,1000000,-85.2,-0.01,{"$f":"IF(U194*inverz1000000!U194<0,\"hiteles\",\"hiteltelen\")","v":"hiteles"}]
[{"$f":"'sorszám-inverz'!A34","v":"tesztalany 38"},15,499583.3,30,136.5,86,75,170,39,118,49,499559.3,49,60,110.5,26,49,9,1000164.7,1000000,-164.7,-0.02,{"$f":"IF(U195*inverz1000000!U195<0,\"hiteles\",\"hiteltelen\")","v":"hiteles"}]
[{"$f":"'sorszám-inverz'!A35","v":"tesztalany 39"},15,499583.3,30,136.5,68,34,8,31,17,36,499559.3,49,14,127.5,26,49,111,999894.7,1000000,105.3,0.01,{"$f":"IF(U196*inverz1000000!U196<0,\"hiteles\",\"hiteltelen\")","v":"hiteles"}]
[{"$f":"'sorszám-inverz'!A36","v":"tesztalany 4"},61,499583.3,30,18,47,78,145.5,49,39.5,36,499559.3,26,50,127.5,43,49,9,999951.2,1000000,48.8,0,{"$f":"IF(U197*inverz1000000!U197<0,\"hiteles\",\"hiteltelen\")","v":"hiteltelen"}]
[{"$f":"'sorszám-inverz'!A37","v":"tesztalany 40"},73,499518.8,30,18,68,34,170,21,39.5,49,499559.3,49,42,90.5,43,3,146.5,999954.7,1000000,45.3,0,{"$f":"IF(U198*inverz1000000!U198<0,\"hiteles\",\"hiteltelen\")","v":"hiteles"}]
[{"$f":"'sorszám-inverz'!A38","v":"tesztalany 41"},1,499583.3,30,18,4,75,145.5,21,39.5,19,499532.3,26,42,127.5,26,19,146.5,999855.7,1000000,144.30000000000001,0.01,{"$f":"IF(U199*inverz1000000!U199<0,\"hiteles\",\"hiteltelen\")","v":"hiteles"}]
[{"$f":"'sorszám-inverz'!A39","v":"tesztalany 42"},73,499518.8,40,18,4,78,206,49,39.5,19,499559.3,49,42,90.5,43,49,146.5,1000024.7,1000000,-24.7,0,{"$f":"IF(U200*inverz1000000!U200<0,\"hiteles\",\"hiteltelen\")","v":"hiteles"}]
[{"$f":"'sorszám-inverz'!A40","v":"tesztalany 43"},73,499583.3,30,18,86,34,170,49,118,49,499559.3,49,14,110.5,49,49,85,1000126.2,1000000,-126.2,-0.01,{"$f":"IF(U201*inverz1000000!U201<0,\"hiteles\",\"hiteltelen\")","v":"hiteles"}]
[{"$f":"'sorszám-inverz'!A41","v":"tesztalany 44"},61,499583.3,30,136.5,86,34,170,39,39.5,36,499559.3,26,42,110.5,43,49,66.5,1000111.7,1000000,-111.7,-0.01,{"$f":"IF(U202*inverz1000000!U202<0,\"hiteles\",\"hiteltelen\")","v":"hiteles"}]
[{"$f":"'sorszám-inverz'!A42","v":"tesztalany 45"},61,499583.3,49.5,18,86,34,170,49,1,19,499516.3,49,60,110.5,43,49,146.5,1000045.2,1000000,-45.2,0,{"$f":"IF(U203*inverz1000000!U203<0,\"hiteles\",\"hiteltelen\")","v":"hiteles"}]
[{"$f":"'sorszám-inverz'!A43","v":"tesztalany 46"},73,499583.3,45.5,136.5,68,75,145.5,49,17,36,499559.3,49,50,90.5,26,19,85,1000107.7,1000000,-107.7,-0.01,{"$f":"IF(U204*inverz1000000!U204<0,\"hiteles\",\"hiteltelen\")","v":"hiteles"}]
[{"$f":"'sorszám-inverz'!A44","v":"tesztalany 47"},61,499518.8,40,248,68,75,145.5,31,17,19,499532.3,26,42,110.5,43,19,85,1000081.2,1000000,-81.2,-0.01,{"$f":"IF(U205*inverz1000000!U205<0,\"hiteles\",\"hiteltelen\")","v":"hiteles"}]
[{"$f":"'sorszám-inverz'!A45","v":"tesztalany 48"},61,499518.8,40,136.5,47,34,206,39,17,49,499532.3,26,42,110.5,26,3,111,999999.2,1000000,0.8,0,{"$f":"IF(U206*inverz1000000!U206<0,\"hiteles\",\"hiteltelen\")","v":"hiteltelen"}]
[{"$f":"'sorszám-inverz'!A46","v":"tesztalany 49"},15,499583.3,30,18,68,34,137.5,31,17,19,499559.3,26,42,110.5,26,49,118,999883.7,1000000,116.3,0.01,{"$f":"IF(U207*inverz1000000!U207<0,\"hiteles\",\"hiteltelen\")","v":"hiteles"}]
[{"$f":"'sorszám-inverz'!A47","v":"tesztalany 5"},1,499506.8,49.5,136.5,86,75,206,4,39.5,19,499482.3,6,60,90.5,43,19,146.5,999970.7,1000000,29.3,0,{"$f":"IF(U208*inverz1000000!U208<0,\"hiteles\",\"hiteltelen\")","v":"hiteles"}]
[{"$f":"'sorszám-inverz'!A48","v":"tesztalany 50"},15,499518.8,30,248,86,34,145.5,21,118,36,499559.3,49,42,110.5,26,19,118,1000176.2,1000000,-176.2,-0.02,{"$f":"IF(U209*inverz1000000!U209<0,\"hiteles\",\"hiteltelen\")","v":"hiteles"}]
[{"$f":"'sorszám-inverz'!A49","v":"tesztalany 6"},61,499583.3,30,136.5,86,34,8,10,39.5,36,499559.3,26,60,90.5,43,49,146.5,999998.7,1000000,1.3,0,{"$f":"IF(U210*inverz1000000!U210<0,\"hiteles\",\"hiteltelen\")","v":"hiteles"}]
[{"$f":"'sorszám-inverz'!A50","v":"tesztalany 7"},15,499518.8,45.5,136.5,68,34,206,21,17,36,499532.3,49,42,110.5,43,49,118,1000041.7,1000000,-41.7,0,{"$f":"IF(U211*inverz1000000!U211<0,\"hiteles\",\"hiteltelen\")","v":"hiteles"}]
[{"$f":"'sorszám-inverz'!A51","v":"tesztalany 8"},61,499583.3,45.5,18,4,34,145.5,31,39.5,2,499532.3,26,50,110.5,26,49,85,999842.7,1000000,157.30000000000001,0.02,{"$f":"IF(U212*inverz1000000!U212<0,\"hiteles\",\"hiteltelen\")","v":"hiteles"}]
[{"$f":"'sorszám-inverz'!A52","v":"tesztalany 9"},73,499583.3,49.5,18,86,34,8,49,118,49,499559.3,49,60,127.5,49,49,146.5,1000108.2,1000000,-108.2,-0.01,{"$f":"IF(U213*inverz1000000!U213<0,\"hiteles\",\"hiteltelen\")","v":"hiteles"}]