{"text_format":"1","workbook":"xlsx","n_sheets":13,"sheets":["alapadatok","Munka4","Munka5","Munka6","Munka7","Munka8","Munka9","ismetlodes","pivotalap","surites","reszeredmeny","2. futtatas","vegeredmeny"],"not_rendered":{"charts":0,"images":0,"macros":0,"external_links":0,"defined_names":3,"comments":0,"pivot_tables":1},"unopened":[],"bounds":{"document_bytes":16777216,"sheet_cells":100000,"rows_first":2000,"rows_last":500,"rows_between":2000,"halvings":0,"cell_chars":16384,"cell_head_chars":4096},"cells_cut":0,"cells_raw":0,"read":"whole","date_system":"1900"}

{"sheet":"alapadatok","index":0,"n_rows":40,"n_cols":20,"rows_kept":40,"cut":false,"hidden":false,"merged":[[4,1,21,1],[22,1,39,1]]}
["sorszám","típus","paraméter","mértékegység","Zátony Nyomda","Sziget Nyomda","Hegy Nyomda","Óceán Nyomda","Völgy Nyomda","Sivatag Nyomda","szórás","irány",null,{"$f":"E1","v":"Zátony Nyomda"},{"$f":"F1","v":"Sziget Nyomda"},"Hegy Nyomda","Óceán Nyomda","Völgy Nyomda","Sivatag Nyomda"]
[1,"Cégadat 1","Cég tőkeerőssége (saját tőke/forrás)","%",89,112,91,145,67,88,{"$f":"STDEV(E2:J2)","v":26.807959017177478},0,null,{"$f":"RANK(E2,$E2:$J2,$L2)","v":4},{"$f":"RANK(F2,$E2:$J2,$L2)","v":2},{"$f":"RANK(G2,$E2:$J2,$L2)","v":3},{"$f":"RANK(H2,$E2:$J2,$L2)","v":1},{"$f":"RANK(I2,$E2:$J2,$L2)","v":6},{"$f":"RANK(J2,$E2:$J2,$L2)","v":5},{"$f":"C2","v":"Cég tőkeerőssége (saját tőke/forrás)"}]
[2,"Cégadat 2","Cég nettó árbevétele a tavalyi évben","millió Ft",15,2.5,34,83,16,5,{"$f":"STDEV(E3:J3)","v":30.090557765961513},0,null,{"$f":"RANK(E3,$E3:$J3,$L3)","v":4},6,2,1,3,5,{"$f":"C3","v":"Cég nettó árbevétele a tavalyi évben"}]
[3,"Cégadat 3","Referenciák száma a tavalyi évben (100.000Ft feletti össz.értékű teljesült szerződések)","db",8,6,15,31,22,11,9.4815610529068479,0,null,5,6,3,1,2,4,"Referenciák száma a tavalyi évben (100.000Ft feletti össz.értékű teljesült szerződések)"]
[4,"Árak","1.000db prospektus (műnyomó 150g/m2, 99*210mm, 4+4 színnyomás) legyártásának nettó ára","Ft/db",3.8,3.8,3.61,4.45,6.61,4.4539999999999997,1.1149995515694155,1,null,2,2,1,4,6,5,"1.000db prospektus (műnyomó 150g/m2, 99*210mm, 4+4 színnyomás) legyártásának nettó ára"]
[5,null,"5.000db prospektus (műnyomó 150g/m2, 99*210mm, 4+4 színnyomás) legyártásának nettó ára","Ft/db",2.8,2.75,2.6219999999999999,3.25,5.6219999999999999,3.4088000000000003,1.1266925756389796,1,null,3,2,1,4,6,5,"5.000db prospektus (műnyomó 150g/m2, 99*210mm, 4+4 színnyomás) legyártásának nettó ára"]
[6,null,"10.000db prospektus (műnyomó 150g/m2, 99*210mm, 4+4 színnyomás) legyártásának nettó ára","Ft/db",2.5,2.25,2.3529,2.4,5.3529,2.9711600000000002,1.1935843574712257,1,null,4,1,2,3,6,5,"10.000db prospektus (műnyomó 150g/m2, 99*210mm, 4+4 színnyomás) legyártásának nettó ára"]
[7,null,"100db plakát (műnyomó 250g/m2, 420*594mm, 4+0 színnyomás) legyártásának nettó ára","Ft/db",16,17.2,17.7744,16.7,20.7744,17.68976,1.6490570900972115,1,null,1,3,5,2,6,4,"100db plakát (műnyomó 250g/m2, 420*594mm, 4+0 színnyomás) legyártásának nettó ára"]
[8,null,"500db plakát (műnyomó 250g/m2, 420*594mm, 4+0 színnyomás) legyártásának nettó ára","Ft/db",12.3,12.5,13.754,12.5,16.753999999999998,13.561599999999999,1.6777400990618418,1,null,1,2,5,2,6,4,"500db plakát (műnyomó 250g/m2, 420*594mm, 4+0 színnyomás) legyártásának nettó ára"]
[9,null,"1.000db plakát (műnyomó 250g/m2, 420*594mm, 4+0 színnyomás) legyártásának nettó ára","Ft/db",9,8.9,10.267200000000001,9.8000000000000007,13.267200000000001,10.246880000000001,1.593188187754347,1,null,2,1,5,3,6,4,"1.000db plakát (műnyomó 250g/m2, 420*594mm, 4+0 színnyomás) legyártásának nettó ára"]
[10,null,"500db ajánlati szerződés (idem 56g/m2, 3 példányos, A4, 1+0 színnyomás) legyártásának nettó ára","Ft/db",20,25.45,27.521000000000001,24,29.321000000000002,29.8584,3.7021200016567217,1,null,1,3,4,2,5,6,"500db ajánlati szerződés (idem 56g/m2, 3 példányos, A4, 1+0 színnyomás) legyártásának nettó ára"]
[11,null,"1.000db ajánlati szerződés (idem 56g/m2, 3 példányos, A4, 1+0 színnyomás) legyártásának nettó ára","Ft/db",18.5,24,23.8,21,26.2,25,2.8315484574110186,1,null,1,4,3,2,6,5,"1.000db ajánlati szerződés (idem 56g/m2, 3 példányos, A4, 1+0 színnyomás) legyártásának nettó ára"]
[12,null,"2.000db ajánlati szerződés (idem 56g/m2, 3 példányos, A4, 1+0 színnyomás) legyártásának nettó ára","Ft/db",17,22.55,20.079000000000001,18,23.079000000000001,20.1416,2.4036942068407932,1,null,1,5,3,2,6,4,"2.000db ajánlati szerződés (idem 56g/m2, 3 példányos, A4, 1+0 színnyomás) legyártásának nettó ára"]
[13,null,"500db feltétel füzet (ofszet 80g/m2, A4, 1+1 színnyomás, irkatűzés) legyártásának nettó ára","Ft/oldal",13.3,14.9,14.706200000000001,13.8,17.706200000000003,14.882480000000005,1.5284490261699728,1,null,1,5,3,2,6,4,"500db feltétel füzet (ofszet 80g/m2, A4, 1+1 színnyomás, irkatűzés) legyártásának nettó ára"]
[14,null,"1.000db feltétel füzet (ofszet 80g/m2, A4, 1+1 színnyomás, irkatűzés) legyártásának nettó ára","Ft/oldal",12.7,10,10.908899999999999,10.7,13.908899999999999,11.643559999999999,1.4407741705069612,1,null,5,1,3,2,6,4,"1.000db feltétel füzet (ofszet 80g/m2, A4, 1+1 színnyomás, irkatűzés) legyártásának nettó ára"]
{"$rows_left_out":26}
{"sheet":"Munka4","index":1,"n_rows":5,"n_cols":8,"rows_kept":5,"cut":false,"hidden":false,"merged":[]}
["OAM","Zátony Nyomda","Sziget Nyomda","Hegy Nyomda","Óceán Nyomda","Völgy Nyomda","Sivatag Nyomda","Attribútum"]
[30,3,3,3,3,1,1,"5.000db bejelentőlap (ofszet 80g/m2, A4, 2+2 színnyomás, perforáció) leszállítási határideje"]
[26,3,3,3,3,1,1,"500db ajánlati szerződés (idem 56g/m2, 3 példányos, A4, 1+0 színnyomás) leszállítási határideje"]
[24,3,3,3,3,1,1,"100db plakát (műnyomó 250g/m2, 420*594mm, 4+0 színnyomás) leszállítási határideje"]
[22,3,3,3,3,1,1,"1.000db prospektus (műnyomó 150g/m2, 99*210mm, 4+4 színnyomás) leszállítási határideje"]

{"sheet":"Munka5","index":2,"n_rows":3,"n_cols":8,"rows_kept":3,"cut":false,"hidden":false,"merged":[]}
["OAM","Zátony Nyomda","Sziget Nyomda","Hegy Nyomda","Óceán Nyomda","Völgy Nyomda","Sivatag Nyomda","Attribútum"]
[29,1,3,1,3,3,3,"2.000db feltétel füzet (ofszet 80g/m2, A4, 1+1 színnyomás, irkatűzés) legyártása - Ft/oldal"]
[28,1,3,1,3,3,3,"1.000db feltétel füzet (ofszet 80g/m2, A4, 1+1 színnyomás, irkatűzés) legyártása - Ft/oldal"]

{"sheet":"Munka6","index":3,"n_rows":5,"n_cols":8,"rows_kept":5,"cut":false,"hidden":false,"merged":[]}
["OAM","Zátony Nyomda","Sziget Nyomda","Hegy Nyomda","Óceán Nyomda","Völgy Nyomda","Sivatag Nyomda","Attribútum"]
[33,1,3,1,6,3,3,"20.000db levélpapír (ofszet 80g/m2, A4 kifutó méret, 2+0 színnyomás) leszállítási határideje"]
[31,1,3,1,6,3,3,"20.000db bejelentőlap (ofszet 80g/m2, A4, 2+2 színnyomás, perforáció) leszállítási határideje"]
[27,1,3,1,6,3,3,"2.000db ajánlati szerződés (idem 56g/m2, 3 példányos, A4, 1+0 színnyomás) leszállítási határideje"]
[23,1,3,1,6,3,3,"10.000db prospektus (műnyomó 150g/m2, 99*210mm, 4+4 színnyomás) leszállítási határideje"]

{"sheet":"Munka7","index":4,"n_rows":3,"n_cols":8,"rows_kept":3,"cut":false,"hidden":false,"merged":[]}
["OAM","Zátony Nyomda","Sziget Nyomda","Hegy Nyomda","Óceán Nyomda","Völgy Nyomda","Sivatag Nyomda","Attribútum"]
[13,1,5,3,2,6,4,"500db feltétel füzet (ofszet 80g/m2, A4, 1+1 színnyomás, irkatűzés) legyártásának nettó ára"]
[12,1,5,3,2,6,4,"2.000db ajánlati szerződés (idem 56g/m2, 3 példányos, A4, 1+0 színnyomás) legyártásának nettó ára"]

{"sheet":"Munka8","index":5,"n_rows":3,"n_cols":8,"rows_kept":3,"cut":false,"hidden":false,"merged":[]}
["OAM","Zátony Nyomda","Sziget Nyomda","Hegy Nyomda","Óceán Nyomda","Völgy Nyomda","Sivatag Nyomda","Attribútum"]
[21,2,1,4,2,6,5,"20.000db levélpapír (ofszet 80g/m2, A4 kifutó méret, 2+0 színnyomás) legyártásának nettó ára"]
[15,2,1,4,2,6,5,"2.000db feltétel füzet (ofszet 80g/m2, A4, 1+1 színnyomás, irkatűzés) legyártásának nettó ára"]

{"sheet":"Munka9","index":6,"n_rows":3,"n_cols":8,"rows_kept":3,"cut":false,"hidden":false,"merged":[]}
["OAM","Zátony Nyomda","Sziget Nyomda","Hegy Nyomda","Óceán Nyomda","Völgy Nyomda","Sivatag Nyomda","Attribútum"]
[20,3,1,4,2,6,5,"10.000db levélpapír (ofszet 80g/m2, A4 kifutó méret, 2+0 színnyomás) legyártásának nettó ára"]
[19,3,1,4,2,6,5,"5.000db levélpapír (ofszet 80g/m2, A4 kifutó méret, 2+0 színnyomás) legyártásának nettó ára"]

{"sheet":"ismetlodes","index":7,"n_rows":28,"n_cols":7,"rows_kept":28,"cut":false,"hidden":false,"merged":[]}
[]
[]
["Darab / OAM"]
["Sivatag Nyomda","Zátony Nyomda","Völgy Nyomda","Óceán Nyomda","Hegy Nyomda","Sziget Nyomda","Összesen"]
[1,1,1,6,1,1,1]
[null,3,1,3,3,3,4]
[3,1,3,3,1,3,2]
[null,null,null,6,1,3,4]
[null,3,3,6,1,1,1]
[4,1,6,2,3,5,2]
[null,null,null,null,5,2,1]
[null,null,null,null,null,3,1]
[null,2,6,3,5,1,1]
[null,3,5,2,1,6,1]
[null,5,2,1,3,6,1]
{"$rows_left_out":14}
{"sheet":"pivotalap","index":8,"n_rows":71,"n_cols":26,"rows_kept":71,"cut":false,"hidden":false,"merged":[]}
[]
["OAM",{"$f":"alapadatok!N1","v":"Zátony Nyomda"},{"$f":"alapadatok!O1","v":"Sziget Nyomda"},{"$f":"alapadatok!P1","v":"Hegy Nyomda"},{"$f":"alapadatok!Q1","v":"Óceán Nyomda"},{"$f":"alapadatok!R1","v":"Völgy Nyomda"},{"$f":"alapadatok!S1","v":"Sivatag Nyomda"},"Attribútum","surites"]
[1,4,2,3,1,6,5,"Cég tőkeerőssége (saját tőke/forrás)",{"$f":"IF(ISERROR(VLOOKUP(A3,surites!$D$27:$E$42,2,0)),\"i\",VLOOKUP(A3,surites!$D$27:$E$42,2,0))","v":"i"}]
[2,4,6,2,1,3,5,"Cég nettó árbevétele a tavalyi évben",{"$f":"IF(ISERROR(VLOOKUP(A4,surites!$D$27:$E$42,2,0)),\"i\",VLOOKUP(A4,surites!$D$27:$E$42,2,0))","v":"i"}]
[3,5,6,3,1,2,4,"Referenciák száma a tavalyi évben (100.000Ft feletti össz.értékű teljesült szerződések)",{"$f":"IF(ISERROR(VLOOKUP(A5,surites!$D$27:$E$42,2,0)),\"i\",VLOOKUP(A5,surites!$D$27:$E$42,2,0))","v":"i"}]
[4,2,2,1,4,6,5,"1.000db prospektus (műnyomó 150g/m2, 99*210mm, 4+4 színnyomás) legyártásának nettó ára",{"$f":"IF(ISERROR(VLOOKUP(A6,surites!$D$27:$E$42,2,0)),\"i\",VLOOKUP(A6,surites!$D$27:$E$42,2,0))","v":"i"}]
[5,3,2,1,4,6,5,"5.000db prospektus (műnyomó 150g/m2, 99*210mm, 4+4 színnyomás) legyártásának nettó ára",{"$f":"IF(ISERROR(VLOOKUP(A7,surites!$D$27:$E$42,2,0)),\"i\",VLOOKUP(A7,surites!$D$27:$E$42,2,0))","v":"i"}]
[6,4,1,2,3,6,5,"10.000db prospektus (műnyomó 150g/m2, 99*210mm, 4+4 színnyomás) legyártásának nettó ára",{"$f":"IF(ISERROR(VLOOKUP(A8,surites!$D$27:$E$42,2,0)),\"i\",VLOOKUP(A8,surites!$D$27:$E$42,2,0))","v":"i"}]
[7,1,3,5,2,6,4,"100db plakát (műnyomó 250g/m2, 420*594mm, 4+0 színnyomás) legyártásának nettó ára",{"$f":"IF(ISERROR(VLOOKUP(A9,surites!$D$27:$E$42,2,0)),\"i\",VLOOKUP(A9,surites!$D$27:$E$42,2,0))","v":"i"}]
[8,1,2,5,2,6,4,"500db plakát (műnyomó 250g/m2, 420*594mm, 4+0 színnyomás) legyártásának nettó ára",{"$f":"IF(ISERROR(VLOOKUP(A10,surites!$D$27:$E$42,2,0)),\"i\",VLOOKUP(A10,surites!$D$27:$E$42,2,0))","v":"i"}]
[9,2,1,5,3,6,4,"1.000db plakát (műnyomó 250g/m2, 420*594mm, 4+0 színnyomás) legyártásának nettó ára",{"$f":"IF(ISERROR(VLOOKUP(A11,surites!$D$27:$E$42,2,0)),\"i\",VLOOKUP(A11,surites!$D$27:$E$42,2,0))","v":"i"}]
[10,1,3,4,2,5,6,"500db ajánlati szerződés (idem 56g/m2, 3 példányos, A4, 1+0 színnyomás) legyártásának nettó ára",{"$f":"IF(ISERROR(VLOOKUP(A12,surites!$D$27:$E$42,2,0)),\"i\",VLOOKUP(A12,surites!$D$27:$E$42,2,0))","v":"i"}]
[11,1,4,3,2,6,5,"1.000db ajánlati szerződés (idem 56g/m2, 3 példányos, A4, 1+0 színnyomás) legyártásának nettó ára",{"$f":"IF(ISERROR(VLOOKUP(A13,surites!$D$27:$E$42,2,0)),\"i\",VLOOKUP(A13,surites!$D$27:$E$42,2,0))","v":"i"}]
[12,1,5,3,2,6,4,"2.000db ajánlati szerződés (idem 56g/m2, 3 példányos, A4, 1+0 színnyomás) legyártásának nettó ára",{"$f":"IF(ISERROR(VLOOKUP(A14,surites!$D$27:$E$42,2,0)),\"i\",VLOOKUP(A14,surites!$D$27:$E$42,2,0))","v":"n"}]
[13,1,5,3,2,6,4,"500db feltétel füzet (ofszet 80g/m2, A4, 1+1 színnyomás, irkatűzés) legyártásának nettó ára",{"$f":"IF(ISERROR(VLOOKUP(A15,surites!$D$27:$E$42,2,0)),\"i\",VLOOKUP(A15,surites!$D$27:$E$42,2,0))","v":"i"}]
{"$rows_left_out":57}
{"sheet":"surites","index":9,"n_rows":42,"n_cols":10,"rows_kept":42,"cut":false,"hidden":false,"merged":[]}
["OAM","Zátony Nyomda","Sziget Nyomda","Hegy Nyomda","Óceán Nyomda","Völgy Nyomda","Sivatag Nyomda","Attribútum","kell","Oszlop1"]
[30,3,3,3,3,1,1,"5.000db bejelentőlap (ofszet 80g/m2, A4, 2+2 színnyomás, perforáció) leszállítási határideje","i",{"$f":"Táblázat18[[#This Row],[Attribútum]]&H3&H4&H5","v":"5.000db bejelentőlap (ofszet 80g/m2, A4, 2+2 színnyomás, perforáció) leszállítási határideje500db ajánlati szerződés (idem 56g/m2, 3 példányos, A4, 1+0 színnyomás) leszállítási határideje100db plakát (műnyomó 250g/m2, 420*594mm, 4+0 színnyomás) leszállítási határideje1.000db prospektus (műnyomó 150g/m2, 99*210mm, 4+4 színnyomás) leszállítási határideje"}]
[26,3,3,3,3,1,1,"500db ajánlati szerződés (idem 56g/m2, 3 példányos, A4, 1+0 színnyomás) leszállítási határideje","n",{"$f":"Táblázat18[[#This Row],[Attribútum]]&H4&H5&H6","v":"500db ajánlati szerződés (idem 56g/m2, 3 példányos, A4, 1+0 színnyomás) leszállítási határideje100db plakát (műnyomó 250g/m2, 420*594mm, 4+0 színnyomás) leszállítási határideje1.000db prospektus (műnyomó 150g/m2, 99*210mm, 4+4 színnyomás) leszállítási határidejeAttribútum"}]
[24,3,3,3,3,1,1,"100db plakát (műnyomó 250g/m2, 420*594mm, 4+0 színnyomás) leszállítási határideje","n",{"$f":"Táblázat18[[#This Row],[Attribútum]]&H5&H6&H7","v":"100db plakát (műnyomó 250g/m2, 420*594mm, 4+0 színnyomás) leszállítási határideje1.000db prospektus (műnyomó 150g/m2, 99*210mm, 4+4 színnyomás) leszállítási határidejeAttribútum2.000db feltétel füzet (ofszet 80g/m2, A4, 1+1 színnyomás, irkatűzés) legyártása - Ft/oldal"}]
[22,3,3,3,3,1,1,"1.000db prospektus (műnyomó 150g/m2, 99*210mm, 4+4 színnyomás) leszállítási határideje","n",{"$f":"Táblázat18[[#This Row],[Attribútum]]&H6&H7&H8","v":"1.000db prospektus (műnyomó 150g/m2, 99*210mm, 4+4 színnyomás) leszállítási határidejeAttribútum2.000db feltétel füzet (ofszet 80g/m2, A4, 1+1 színnyomás, irkatűzés) legyártása - Ft/oldal1.000db feltétel füzet (ofszet 80g/m2, A4, 1+1 színnyomás, irkatűzés) legyártása - Ft/oldal"}]
["OAM","Zátony Nyomda","Sziget Nyomda","Hegy Nyomda","Óceán Nyomda","Völgy Nyomda","Sivatag Nyomda","Attribútum","n","Oszlop1"]
[29,1,3,1,3,3,3,"2.000db feltétel füzet (ofszet 80g/m2, A4, 1+1 színnyomás, irkatűzés) legyártása - Ft/oldal","i",{"$f":"Táblázat29[[#This Row],[Attribútum]]&H8","v":"2.000db feltétel füzet (ofszet 80g/m2, A4, 1+1 színnyomás, irkatűzés) legyártása - Ft/oldal1.000db feltétel füzet (ofszet 80g/m2, A4, 1+1 színnyomás, irkatűzés) legyártása - Ft/oldal"}]
[28,1,3,1,3,3,3,"1.000db feltétel füzet (ofszet 80g/m2, A4, 1+1 színnyomás, irkatűzés) legyártása - Ft/oldal","n",{"$f":"Táblázat29[[#This Row],[Attribútum]]&H9","v":"1.000db feltétel füzet (ofszet 80g/m2, A4, 1+1 színnyomás, irkatűzés) legyártása - Ft/oldalAttribútum"}]
["OAM","Zátony Nyomda","Sziget Nyomda","Hegy Nyomda","Óceán Nyomda","Völgy Nyomda","Sivatag Nyomda","Attribútum","n","Oszlop1"]
[33,1,3,1,6,3,3,"20.000db levélpapír (ofszet 80g/m2, A4 kifutó méret, 2+0 színnyomás) leszállítási határideje","i",{"$f":"Táblázat310[[#This Row],[Attribútum]]&H11&H12&H13","v":"20.000db levélpapír (ofszet 80g/m2, A4 kifutó méret, 2+0 színnyomás) leszállítási határideje20.000db bejelentőlap (ofszet 80g/m2, A4, 2+2 színnyomás, perforáció) leszállítási határideje2.000db ajánlati szerződés (idem 56g/m2, 3 példányos, A4, 1+0 színnyomás) leszállítási határideje10.000db prospektus (műnyomó 150g/m2, 99*210mm, 4+4 színnyomás) leszállítási határideje"}]
[31,1,3,1,6,3,3,"20.000db bejelentőlap (ofszet 80g/m2, A4, 2+2 színnyomás, perforáció) leszállítási határideje","n",{"$f":"Táblázat310[[#This Row],[Attribútum]]&H12&H13&H14","v":"20.000db bejelentőlap (ofszet 80g/m2, A4, 2+2 színnyomás, perforáció) leszállítási határideje2.000db ajánlati szerződés (idem 56g/m2, 3 példányos, A4, 1+0 színnyomás) leszállítási határideje10.000db prospektus (műnyomó 150g/m2, 99*210mm, 4+4 színnyomás) leszállítási határidejeAttribútum"}]
[27,1,3,1,6,3,3,"2.000db ajánlati szerződés (idem 56g/m2, 3 példányos, A4, 1+0 színnyomás) leszállítási határideje","n",{"$f":"Táblázat310[[#This Row],[Attribútum]]&H13&H14&H15","v":"2.000db ajánlati szerződés (idem 56g/m2, 3 példányos, A4, 1+0 színnyomás) leszállítási határideje10.000db prospektus (műnyomó 150g/m2, 99*210mm, 4+4 színnyomás) leszállítási határidejeAttribútum500db feltétel füzet (ofszet 80g/m2, A4, 1+1 színnyomás, irkatűzés) legyártásának nettó ára"}]
[23,1,3,1,6,3,3,"10.000db prospektus (műnyomó 150g/m2, 99*210mm, 4+4 színnyomás) leszállítási határideje","n",{"$f":"Táblázat310[[#This Row],[Attribútum]]&H14&H15&H16","v":"10.000db prospektus (műnyomó 150g/m2, 99*210mm, 4+4 színnyomás) leszállítási határidejeAttribútum500db feltétel füzet (ofszet 80g/m2, A4, 1+1 színnyomás, irkatűzés) legyártásának nettó ára2.000db ajánlati szerződés (idem 56g/m2, 3 példányos, A4, 1+0 színnyomás) legyártásának nettó ára"}]
["OAM","Zátony Nyomda","Sziget Nyomda","Hegy Nyomda","Óceán Nyomda","Völgy Nyomda","Sivatag Nyomda","Attribútum","n","Oszlop1"]
[13,1,5,3,2,6,4,"500db feltétel füzet (ofszet 80g/m2, A4, 1+1 színnyomás, irkatűzés) legyártásának nettó ára","i",{"$f":"Táblázat411[[#This Row],[Attribútum]]&H16","v":"500db feltétel füzet (ofszet 80g/m2, A4, 1+1 színnyomás, irkatűzés) legyártásának nettó ára2.000db ajánlati szerződés (idem 56g/m2, 3 példányos, A4, 1+0 színnyomás) legyártásának nettó ára"}]
{"$rows_left_out":28}
{"sheet":"reszeredmeny","index":10,"n_rows":38,"n_cols":28,"rows_kept":38,"cut":false,"hidden":false,"merged":[]}
["Azonosító","Teszt"]
["Objektumok",6]
["Attribútumok",23]
["Lepcsők",6]
["Eltolás",0]
["Leírás","COCO Y0: Teszt"]
[]
["Rangsor","X(A1)","X(A2)","X(A3)","X(A4)","X(A5)","X(A6)","X(A7)","X(A8)","X(A9)","X(A10)","X(A11)","X(A12)","X(A13)","X(A14)","X(A15)","X(A16)","X(A17)","X(A18)","X(A19)","X(A20)","X(A21)","X(A22)","X(A23)","Y(A24)"]
["O1",4,4,5,2,3,4,1,1,2,1,1,1,5,3,3,2,3,2,3,1,3,1,1,1000]
["O2",2,6,6,2,2,1,3,2,1,3,4,5,1,6,6,4,1,1,1,3,3,1,3,1000]
["O3",3,2,3,1,1,2,5,5,5,4,3,3,3,1,1,1,4,4,1,1,3,1,1,1000]
["O4",1,1,1,4,4,3,2,2,3,2,2,2,2,2,2,3,2,2,6,3,3,6,6,1000]
["O5",6,3,2,6,6,6,6,6,6,5,6,6,6,4,5,6,6,6,3,3,1,1,3,1000]
["O6",5,5,4,5,5,5,4,4,4,6,5,4,4,5,4,5,5,5,3,3,1,1,3,1000]
[]
{"$rows_left_out":24}
{"sheet":"2. futtatas","index":11,"n_rows":56,"n_cols":21,"rows_kept":56,"cut":false,"hidden":false,"merged":[]}
["OAM","Zátony Nyomda","Sziget Nyomda","Hegy Nyomda","Óceán Nyomda","Völgy Nyomda","Sivatag Nyomda","1 futtatás"]
["Cég tőkeerőssége (saját tőke/forrás)",4,2,3,1,6,5,5]
["Cég nettó árbevétele a tavalyi évben",4,6,2,1,3,5,5]
["Referenciák száma a tavalyi évben (100.000Ft feletti össz.értékű teljesült szerződések)",5,6,3,1,2,4,931]
["1.000db prospektus (műnyomó 150g/m2, 99*210mm, 4+4 színnyomás) legyártásának nettó ára",2,2,1,4,6,5,5]
["5.000db prospektus (műnyomó 150g/m2, 99*210mm, 4+4 színnyomás) legyártásának nettó ára",3,2,1,4,6,5,5]
["10.000db prospektus (műnyomó 150g/m2, 99*210mm, 4+4 színnyomás) legyártásának nettó ára",4,1,2,3,6,5,934]
["100db plakát (műnyomó 250g/m2, 420*594mm, 4+0 színnyomás) legyártásának nettó ára",1,3,5,2,6,4,923]
["500db plakát (műnyomó 250g/m2, 420*594mm, 4+0 színnyomás) legyártásának nettó ára",1,2,5,2,6,4,5]
["1.000db plakát (műnyomó 250g/m2, 420*594mm, 4+0 színnyomás) legyártásának nettó ára",2,1,5,3,6,4,5]
["500db ajánlati szerződés (idem 56g/m2, 3 példányos, A4, 1+0 színnyomás) legyártásának nettó ára",1,3,4,2,5,6,5]
["1.000db ajánlati szerződés (idem 56g/m2, 3 példányos, A4, 1+0 színnyomás) legyártásának nettó ára",1,4,3,2,6,5,5]
["500db feltétel füzet (ofszet 80g/m2, A4, 1+1 színnyomás, irkatűzés) legyártásának nettó ára",1,5,3,2,6,4,5]
["1.000db feltétel füzet (ofszet 80g/m2, A4, 1+1 színnyomás, irkatűzés) legyártásának nettó ára",5,1,3,2,6,4,5]
["5.000db bejelentőlap (ofszet 80g/m2, A4, 2+2 színnyomás, perforáció) legyártásának nettó ára",3,6,1,2,4,5,12]
{"$rows_left_out":42}
{"sheet":"vegeredmeny","index":12,"n_rows":38,"n_cols":23,"rows_kept":38,"cut":false,"hidden":false,"merged":[]}
["Azonosító","Teszt"]
["Objektumok",6]
["Attribútumok",18]
["Lepcsők",6]
["Eltolás",0]
["Leírás","COCO Y0: Teszt"]
[]
["Rangsor","X(A1)","X(A2)","X(A3)","X(A4)","X(A5)","X(A6)","X(A7)","X(A8)","X(A9)","X(A10)","X(A11)","X(A12)","X(A13)","X(A14)","X(A15)","X(A16)","X(A17)","X(A18)","Y(A19)"]
["O1",4,4,2,3,1,2,1,1,1,5,3,2,3,2,3,1,1,1,1000]
["O2",2,6,2,2,2,1,3,4,5,1,6,4,1,1,1,3,1,3,1000]
["O3",3,2,1,1,5,5,4,3,3,3,1,1,4,4,1,1,1,1,1000]
["O4",1,1,4,4,2,3,2,2,2,2,2,3,2,2,6,3,6,6,1000]
["O5",6,3,6,6,6,6,5,6,6,6,5,6,6,6,3,3,1,3,1000]
["O6",5,5,5,5,4,4,6,5,4,4,4,5,5,5,3,3,1,3,1000]
[]
{"$rows_left_out":23}