{"text_format":"1","workbook":"xlsx","n_sheets":11,"sheets":["f5_a1","f5_a2","f5_a3","f5_a2_p1","C","C_P","C_filter","C_eredmeny","f5_a1_m","f5_a2_m","f5_a3_m"],"not_rendered":{"charts":4,"images":0,"macros":1,"external_links":0,"defined_names":4,"comments":0,"pivot_tables":2},"unopened":[],"bounds":{"document_bytes":16777216,"sheet_cells":100000,"rows_first":2000,"rows_last":500,"rows_between":2000,"halvings":0,"cell_chars":16384,"cell_head_chars":4096},"cells_cut":0,"cells_raw":0,"read":"whole","date_system":"1900"}

{"sheet":"f5_a1","index":0,"n_rows":499,"n_cols":11,"rows_kept":499,"cut":false,"hidden":false,"merged":[]}
["element","sourceX","sourceY","sourceW","sourceH","targetX","targetY","targetW","targetH","Válaszkártyák","Időigény"]
["COLOR_GREEN-DOT_2",938,159,152,152,470,459,171,171,"COLOR_BROWN-DOT_1",432]
["COLOR_BROWN-DOT_2",1166,159,152,152,470,287,171,171,"COLOR_BLUE-DOT_1",504]
["COLOR_GREEN-DOT_1",1394,159,152,152,298,459,171,171,"COLOR_GREEN-DOT_1",816]
["COLOR_BROWN-DOT_1",938,387,152,152,298,287,171,171,"COLOR_GREEN-DOT_2",608]
["COLOR_BLUE-DOT_3",1166,387,152,152,643,632,171,171,"COLOR_GREEN-DOT_3",568]
["COLOR_GREEN-DOT_3",1394,387,152,152,643,459,171,171,"COLOR_BLUE-DOT_2",280]
["COLOR_BLUE-DOT_1",938,615,152,152,298,632,171,171,"COLOR_BLUE-DOT_3",416]
["COLOR_BLUE-DOT_2",1166,615,152,152,470,632,171,171,"COLOR_BROWN-DOT_2",511]
["COLOR_BROWN-DOT_3",1394,615,152,152,643,287,171,171,"COLOR_BROWN-DOT_3",496]
[]
["time","event","element","x","y","game"]
[0,"START","ALL",0,0,"COLOR_DOT"]
[44663,"pointerdown","COLOR_BROWN-DOT_1",926,374,"COLOR_DOT"]
[44719,"pointermove","COLOR_BROWN-DOT_1",925.60003662109295,373.80001831054602,"COLOR_DOT"]
[44727,"pointermove","COLOR_BROWN-DOT_1",921.60003662109295,374.600006103515,"COLOR_DOT"]
[44735,"pointermove","COLOR_BROWN-DOT_1",913.60003662109295,374.600006103515,"COLOR_DOT"]
[44743,"pointermove","COLOR_BROWN-DOT_1",898.40002441406205,374.600006103515,"COLOR_DOT"]
[44751,"pointermove","COLOR_BROWN-DOT_1",882.40002441406205,373.80001831054602,"COLOR_DOT"]
[44759,"pointermove","COLOR_BROWN-DOT_1",864,370.600006103515,"COLOR_DOT"]
[44767,"pointermove","COLOR_BROWN-DOT_1",841.60003662109295,369.80001831054602,"COLOR_DOT"]
[44775,"pointermove","COLOR_BROWN-DOT_1",816.79998779296795,368.20001220703102,"COLOR_DOT"]
[44783,"pointermove","COLOR_BROWN-DOT_1",797.60003662109295,368.20001220703102,"COLOR_DOT"]
[44791,"pointermove","COLOR_BROWN-DOT_1",780.79998779296795,368.20001220703102,"COLOR_DOT"]
[44799,"pointermove","COLOR_BROWN-DOT_1",766.40002441406205,368.20001220703102,"COLOR_DOT"]
[44807,"pointermove","COLOR_BROWN-DOT_1",752.79998779296795,368.20001220703102,"COLOR_DOT"]
[44815,"pointermove","COLOR_BROWN-DOT_1",740.79998779296795,368.20001220703102,"COLOR_DOT"]
[44823,"pointermove","COLOR_BROWN-DOT_1",732,368.20001220703102,"COLOR_DOT"]
[44831,"pointermove","COLOR_BROWN-DOT_1",724.79998779296795,368.20001220703102,"COLOR_DOT"]
[44839,"pointermove","COLOR_BROWN-DOT_1",720,368.20001220703102,"COLOR_DOT"]
{"$rows_left_out":470}
{"sheet":"f5_a2","index":1,"n_rows":803,"n_cols":11,"rows_kept":803,"cut":false,"hidden":false,"merged":[]}
["element","sourceX","sourceY","sourceW","sourceH","targetX","targetY","targetW","targetH","Válaszkártyák (f1.xlsx)","Időigény"]
["SVK-€01",938,167,152,152,470,468,171,171,"IRL-€02",2272]
["IRL-€01",1166,167,152,152,470,296,171,171,"IRL-€20",1269]
["SVK-€02",1394,167,152,152,298,468,171,171,"IRL-€01",857]
["IRL-€02",938,395,152,152,298,296,171,171,"SVK-€02",3604]
["SMR-€20",1166,395,152,152,643,640,171,171,"SVK-€20",1288]
["SVK-€20",1394,395,152,152,643,468,171,171,"SMR-€01",3178]
["SMR-€02",938,624,152,152,298,640,171,171,"SVK-€01",704]
["SMR-€01",1166,624,152,152,470,640,171,171,"SMR-€02",545]
["IRL-€20",1394,624,152,152,643,296,171,171,"SMR-€20",1094]
[]
["time","event","element","x","y","game"]
[0,"START","ALL",0,0,"EUR_COIN"]
[9775,"pointerdown","IRL-€02",928.79998779296795,404.20001220703102,"EUR_COIN"]
[9915,"pointermove","IRL-€02",925.60003662109295,405,"EUR_COIN"]
[9927,"pointermove","IRL-€02",912.79998779296795,412.20001220703102,"EUR_COIN"]
[9943,"pointermove","IRL-€02",888,430.600006103515,"EUR_COIN"]
[9960,"pointermove","IRL-€02",858.40002441406205,450.60006713867102,"EUR_COIN"]
[9978,"pointermove","IRL-€02",821.60003662109295,476.20001220703102,"EUR_COIN"]
[9988,"pointermove","IRL-€02",800,490.60006713867102,"EUR_COIN"]
[10007,"pointermove","IRL-€02",769.60003662109295,509,"EUR_COIN"]
[10028,"pointermove","IRL-€02",741.60003662109295,518.60003662109295,"EUR_COIN"]
[10042,"pointermove","IRL-€02",718.40002441406205,525,"EUR_COIN"]
[10058,"pointermove","IRL-€02",698.40002441406205,529.79998779296795,"EUR_COIN"]
[10077,"pointermove","IRL-€02",678.40002441406205,536.20001220703102,"EUR_COIN"]
[10087,"pointermove","IRL-€02",671.20001220703102,537.79998779296795,"EUR_COIN"]
[10107,"pointermove","IRL-€02",657.60003662109295,541,"EUR_COIN"]
[10122,"pointermove","IRL-€02",646.40002441406205,541.79998779296795,"EUR_COIN"]
[10142,"pointermove","IRL-€02",634.40002441406205,544.20001220703102,"EUR_COIN"]
[10162,"pointermove","IRL-€02",621.60003662109295,545,"EUR_COIN"]
{"$rows_left_out":774}
{"sheet":"f5_a3","index":2,"n_rows":410,"n_cols":11,"rows_kept":410,"cut":false,"hidden":false,"merged":[]}
["element","sourceX","sourceY","sourceW","sourceH","targetX","targetY","targetW","targetH","Válaszkártyák","Időigény"]
["COLOR_GREEN-DOT_2",937,167,152,152,470,468,171,171,"COLOR_GREEN-DOT_2",941]
["COLOR_BROWN-DOT_2",1165,167,152,152,470,296,171,171,"COLOR_BROWN-DOT_1",1229]
["COLOR_GREEN-DOT_1",1393,167,152,152,298,468,171,171,"COLOR_BLUE-DOT_1",941]
["COLOR_BROWN-DOT_1",937,395,152,152,298,296,171,171,"COLOR_BROWN-DOT_2",857]
["COLOR_BLUE-DOT_3",1165,395,152,152,642,640,171,171,"COLOR_GREEN-DOT_1",1186]
["COLOR_GREEN-DOT_3",1393,395,152,152,642,468,171,171,"COLOR_BLUE-DOT_3",1514]
["COLOR_BLUE-DOT_1",937,623,152,152,298,640,171,171,"COLOR_BLUE-DOT_2",555]
["COLOR_BLUE-DOT_2",1165,623,152,152,470,640,171,171,"COLOR_GREEN-DOT_3",1050]
["COLOR_BROWN-DOT_3",1393,623,152,152,642,296,171,171,"COLOR_BROWN-DOT_3",936]
[]
["time","event","element","x","y","game"]
[0,"START","ALL",0,0,"COLOR_DOT"]
[1243,"pointerdown","COLOR_GREEN-DOT_2",926.40002441406205,145,"COLOR_DOT"]
[1278,"pointermove","COLOR_GREEN-DOT_2",923.20001220703102,150.600006103515,"COLOR_DOT"]
[1287,"pointermove","COLOR_GREEN-DOT_2",920,153.80000305175699,"COLOR_DOT"]
[1307,"pointermove","COLOR_GREEN-DOT_2",910.40002441406205,164.19999694824199,"COLOR_DOT"]
[1324,"pointermove","COLOR_GREEN-DOT_2",898.40002441406205,173,"COLOR_DOT"]
[1343,"pointermove","COLOR_GREEN-DOT_2",884,184.19999694824199,"COLOR_DOT"]
[1359,"pointermove","COLOR_GREEN-DOT_2",866.40002441406205,196.20001220703099,"COLOR_DOT"]
[1378,"pointermove","COLOR_GREEN-DOT_2",844,214.600006103515,"COLOR_DOT"]
[1388,"pointermove","COLOR_GREEN-DOT_2",827.20001220703102,226.600006103515,"COLOR_DOT"]
[1408,"pointermove","COLOR_GREEN-DOT_2",794.40002441406205,254.600006103515,"COLOR_DOT"]
[1424,"pointermove","COLOR_GREEN-DOT_2",761.60003662109295,282.600006103515,"COLOR_DOT"]
[1443,"pointermove","COLOR_GREEN-DOT_2",731.20001220703102,309,"COLOR_DOT"]
[1459,"pointermove","COLOR_GREEN-DOT_2",712,325,"COLOR_DOT"]
[1477,"pointermove","COLOR_GREEN-DOT_2",700,330.600006103515,"COLOR_DOT"]
[1488,"pointermove","COLOR_GREEN-DOT_2",697.60003662109295,330.600006103515,"COLOR_DOT"]
[1635,"pointermove","COLOR_GREEN-DOT_2",696.79998779296795,333.80001831054602,"COLOR_DOT"]
[1644,"pointermove","COLOR_GREEN-DOT_2",692.79998779296795,339.39999389648398,"COLOR_DOT"]
{"$rows_left_out":381}
{"sheet":"f5_a2_p1","index":3,"n_rows":14,"n_cols":5,"rows_kept":14,"cut":false,"hidden":false,"merged":[]}
["CTRL+SHIFT+R"]
[]
[null,null,"Sorcímkék","Mennyiség / element","hol.van"]
[null,null,"ALL",1,{"$f":"MATCH(C_P!C4,'C'!$C:$C,0)","v":13}]
[null,null,"IRL-€01",46,{"$f":"MATCH(C_P!C5,'C'!$C:$C,0)","v":202}]
[null,null,"IRL-€02",117,{"$f":"MATCH(C_P!C6,'C'!$C:$C,0)","v":14}]
[null,null,"IRL-€20",71,{"$f":"MATCH(C_P!C7,'C'!$C:$C,0)","v":131}]
[null,null,"SMR-€01",155,{"$f":"MATCH(C_P!C8,'C'!$C:$C,0)","v":525}]
[null,null,"SMR-€02",30,{"$f":"MATCH(C_P!C9,'C'!$C:$C,0)","v":716}]
[null,null,"SMR-€20",58,{"$f":"MATCH(C_P!C10,'C'!$C:$C,0)","v":746}]
[null,null,"SVK-€01",36,{"$f":"MATCH(C_P!C11,'C'!$C:$C,0)","v":680}]
[null,null,"SVK-€02",206,{"$f":"MATCH(C_P!C12,'C'!$C:$C,0)","v":248}]
[null,null,"SVK-€20",71,{"$f":"MATCH(C_P!C13,'C'!$C:$C,0)","v":454}]
[null,null,"Végösszeg",791]

{"sheet":"C","index":4,"n_rows":803,"n_cols":12,"rows_kept":803,"cut":false,"hidden":false,"merged":[]}
["element","sourceX","sourceY","sourceW","sourceH","targetX","targetY","targetW","targetH","Válaszkártyák (f1.xlsx)","Időigény","Sebesség3"]
["SVK-€01",938,167,152,152,470,468,171,171,"IRL-€02",2272,{"$f":"VLOOKUP(J2,C_eredmeny!$A$1:$B$9,2,0)/K2","v":0.80883916274109835}]
["IRL-€01",1166,167,152,152,470,296,171,171,"IRL-€20",1269,{"$f":"VLOOKUP(J3,C_eredmeny!$A$1:$B$9,2,0)/K3","v":0.6104521946218826}]
["SVK-€02",1394,167,152,152,298,468,171,171,"IRL-€01",857,{"$f":"VLOOKUP(J4,C_eredmeny!$A$1:$B$9,2,0)/K4","v":0.77022678353692808}]
["IRL-€02",938,395,152,152,298,296,171,171,"SVK-€02",3604,{"$f":"VLOOKUP(J5,C_eredmeny!$A$1:$B$9,2,0)/K5","v":0.31153940205811076}]
["SMR-€20",1166,395,152,152,643,640,171,171,"SVK-€20",1288,{"$f":"VLOOKUP(J6,C_eredmeny!$A$1:$B$9,2,0)/K6","v":0.57186618744739603}]
["SVK-€20",1394,395,152,152,643,468,171,171,"SMR-€01",3178,{"$f":"VLOOKUP(J7,C_eredmeny!$A$1:$B$9,2,0)/K7","v":0.91239418948627282}]
["SMR-€02",938,624,152,152,298,640,171,171,"SVK-€01",704,{"$f":"VLOOKUP(J8,C_eredmeny!$A$1:$B$9,2,0)/K8","v":0.78237202349432911}]
["SMR-€01",1166,624,152,152,470,640,171,171,"SMR-€02",545,{"$f":"VLOOKUP(J9,C_eredmeny!$A$1:$B$9,2,0)/K9","v":1.1137098815450615}]
["IRL-€20",1394,624,152,152,643,296,171,171,"SMR-€20",1094,{"$f":"VLOOKUP(J10,C_eredmeny!$A$1:$B$9,2,0)/K10","v":1.758074612296697}]
[]
["time","event","element","x","y","game"]
[0,"START","ALL",0,0,"EUR_COIN"]
[9775,"pointerdown","IRL-€02",928.79998779296795,404.20001220703102,"EUR_COIN"]
[9915,"pointermove","IRL-€02",925.60003662109295,405,"EUR_COIN"]
[9927,"pointermove","IRL-€02",912.79998779296795,412.20001220703102,"EUR_COIN"]
[9943,"pointermove","IRL-€02",888,430.600006103515,"EUR_COIN"]
[9960,"pointermove","IRL-€02",858.40002441406205,450.60006713867102,"EUR_COIN"]
[9978,"pointermove","IRL-€02",821.60003662109295,476.20001220703102,"EUR_COIN"]
[9988,"pointermove","IRL-€02",800,490.60006713867102,"EUR_COIN"]
[10007,"pointermove","IRL-€02",769.60003662109295,509,"EUR_COIN"]
[10028,"pointermove","IRL-€02",741.60003662109295,518.60003662109295,"EUR_COIN"]
[10042,"pointermove","IRL-€02",718.40002441406205,525,"EUR_COIN"]
[10058,"pointermove","IRL-€02",698.40002441406205,529.79998779296795,"EUR_COIN"]
[10077,"pointermove","IRL-€02",678.40002441406205,536.20001220703102,"EUR_COIN"]
[10087,"pointermove","IRL-€02",671.20001220703102,537.79998779296795,"EUR_COIN"]
[10107,"pointermove","IRL-€02",657.60003662109295,541,"EUR_COIN"]
[10122,"pointermove","IRL-€02",646.40002441406205,541.79998779296795,"EUR_COIN"]
[10142,"pointermove","IRL-€02",634.40002441406205,544.20001220703102,"EUR_COIN"]
[10162,"pointermove","IRL-€02",621.60003662109295,545,"EUR_COIN"]
{"$rows_left_out":774}
{"sheet":"C_P","index":5,"n_rows":15,"n_cols":3,"rows_kept":15,"cut":false,"hidden":false,"merged":[]}
[]
[]
[null,null,"Sorcímkék"]
[null,null,"ALL"]
[null,null,"IRL-€01"]
[null,null,"IRL-€02"]
[null,null,"IRL-€20"]
[null,null,"SMR-€01"]
[null,null,"SMR-€02"]
[null,null,"SMR-€20"]
[null,null,"SVK-€01"]
[null,null,"SVK-€02"]
[null,null,"SVK-€20"]
[null,null,"(üres)"]
[null,null,"Végösszeg"]

{"sheet":"C_filter","index":6,"n_rows":83,"n_cols":9,"rows_kept":83,"cut":false,"hidden":false,"merged":[]}
[]
[]
[]
[]
[]
[]
[]
[]
[]
[]
[null,null,null,{"$f":"COUNT(D13:D1048576)+12","v":83},null,null,null,null,{"$f":"SUM(I14:I83)","v":736.56364943224605}]
["time","event","element","x","y","game","x2","y2","tavolsag"]
[28078,"pointerdown","SVK-€20",1408,397,"EUR_COIN",{"$f":"$D$13-D13","v":0},{"$f":"$E$13-E13","v":0},{"$f":"SQRT(G13*G13+H13*H13)","v":0}]
[28246,"pointermove","SVK-€20",1403.20007324218,397.80001831054602,"EUR_COIN",{"$f":"$D$13-D14-SUM(G$13:G13)","v":4.7999267578200033},{"$f":"$E$13-E14-SUM(H$13:H13)","v":-0.80001831054602235},{"$f":"SQRT(G14*G14+H14*H14)","v":4.8661407889255894}]
[28255,"pointermove","SVK-€20",1390.40002441406,401,"EUR_COIN",{"$f":"$D$13-D15-SUM(G$13:G14)","v":12.800048828119998},{"$f":"$E$13-E15-SUM(H$13:H14)","v":-3.1999816894539777},{"$f":"SQRT(G15*G15+H15*H15)","v":13.193980931284418}]
[28266,"pointermove","SVK-€20",1368.80004882812,405,"EUR_COIN",{"$f":"$D$13-D16-SUM(G$13:G15)","v":21.599975585940001},{"$f":"$E$13-E16-SUM(H$13:H15)","v":-4},21.967224342488155]
[28285,"pointermove","SVK-€20",1326.40002441406,412.20001220703102,"EUR_COIN",{"$f":"$D$13-D17-SUM(G$13:G16)","v":42.400024414059999},{"$f":"$E$13-E17-SUM(H$13:H16)","v":-7.2000122070310226},43.007002291420868]
[28300,"pointermove","SVK-€20",1278.40002441406,418.600006103515,"EUR_COIN",{"$f":"$D$13-D18-SUM(G$13:G17)","v":48},{"$f":"$E$13-E18-SUM(H$13:H17)","v":-6.3999938964839771},48.424786234685975]
[28319,"pointermove","SVK-€20",1224,424.20001220703102,"EUR_COIN",{"$f":"$D$13-D19-SUM(G$13:G18)","v":54.400024414059999},{"$f":"$E$13-E19-SUM(H$13:H18)","v":-5.6000061035160229},54.687500625003345]
[28336,"pointermove","SVK-€20",1174.40002441406,429,"EUR_COIN",{"$f":"$D$13-D20-SUM(G$13:G19)","v":49.599975585940001},{"$f":"$E$13-E20-SUM(H$13:H19)","v":-4.7999877929689774},49.831691331305379]
[28354,"pointermove","SVK-€20",1104.80004882812,435.39999389648398,"EUR_COIN",{"$f":"$D$13-D21-SUM(G$13:G20)","v":69.599975585940001},{"$f":"$E$13-E21-SUM(H$13:H20)","v":-6.3999938964839771},69.893608602206797]
[28371,"pointermove","SVK-€20",1056.80004882812,436.20001220703102,"EUR_COIN",{"$f":"$D$13-D22-SUM(G$13:G21)","v":48},{"$f":"$E$13-E22-SUM(H$13:H21)","v":-0.80001831054704553},48.006666508904893]
[28389,"pointermove","SVK-€20",1004,436.20001220703102,"EUR_COIN",{"$f":"$D$13-D23-SUM(G$13:G22)","v":52.800048828119998},{"$f":"$E$13-E23-SUM(H$13:H22)","v":0},52.800048828119998]
[28399,"pointermove","SVK-€20",976,436.20001220703102,"EUR_COIN",{"$f":"$D$13-D24-SUM(G$13:G23)","v":28},{"$f":"$E$13-E24-SUM(H$13:H23)","v":0},28]
[28419,"pointermove","SVK-€20",938.40002441406205,436.20001220703102,"EUR_COIN",{"$f":"$D$13-D25-SUM(G$13:G24)","v":37.599975585937955},{"$f":"$E$13-E25-SUM(H$13:H24)","v":0},37.599975585937955]
[28435,"pointermove","SVK-€20",906.40002441406205,436.20001220703102,"EUR_COIN",{"$f":"$D$13-D26-SUM(G$13:G25)","v":32},{"$f":"$E$13-E26-SUM(H$13:H25)","v":0},32]
[28455,"pointermove","SVK-€20",890.40002441406205,436.20001220703102,"EUR_COIN",{"$f":"$D$13-D27-SUM(G$13:G26)","v":16},{"$f":"$E$13-E27-SUM(H$13:H26)","v":0},16]
[28471,"pointermove","SVK-€20",879.20001220703102,436.20001220703102,"EUR_COIN",{"$f":"$D$13-D28-SUM(G$13:G27)","v":11.200012207031023},{"$f":"$E$13-E28-SUM(H$13:H27)","v":0},11.200012207031023]
[28487,"pointermove","SVK-€20",875.20001220703102,436.20001220703102,"EUR_COIN",{"$f":"$D$13-D29-SUM(G$13:G28)","v":4},{"$f":"$E$13-E29-SUM(H$13:H28)","v":0},4]
[28505,"pointermove","SVK-€20",872,437.80001831054602,"EUR_COIN",{"$f":"$D$13-D30-SUM(G$13:G29)","v":3.2000122070310226},{"$f":"$E$13-E30-SUM(H$13:H29)","v":-1.6000061035149997},3.5777224118750195]
{"$rows_left_out":54}
{"sheet":"C_eredmeny","index":7,"n_rows":9,"n_cols":2,"rows_kept":9,"cut":false,"hidden":false,"merged":[]}
["IRL-€01",660.08435349114734]
["IRL-€02",1837.6825777477754]
["IRL-€20",774.66383497516904]
["SMR-€01",2899.5887341873749]
["SMR-€02",606.97188544205846]
["SMR-€20",1923.3336258525865]
["SVK-€01",550.78990454000768]
["SVK-€02",1122.7880050174313]
["SVK-€20",736.56364943224605]

{"sheet":"f5_a1_m","index":8,"n_rows":499,"n_cols":12,"rows_kept":499,"cut":false,"hidden":false,"merged":[]}
["element","sourceX","sourceY","sourceW","sourceH","targetX","targetY","targetW","targetH","Válaszkártyák","Időigény","Sebesség3"]
["COLOR_GREEN-DOT_2",938,159,152,152,470,459,171,171,"COLOR_BROWN-DOT_1",432,1.5014567596949915]
["COLOR_BROWN-DOT_2",1166,159,152,152,470,287,171,171,"COLOR_BLUE-DOT_1",504,1.2348005106720652]
["COLOR_GREEN-DOT_1",1394,159,152,152,298,459,171,171,"COLOR_GREEN-DOT_1",816,1.3739710706194821]
["COLOR_BROWN-DOT_1",938,387,152,152,298,287,171,171,"COLOR_GREEN-DOT_2",608,0.91310858841176035]
["COLOR_BLUE-DOT_3",1166,387,152,152,643,632,171,171,"COLOR_GREEN-DOT_3",568,1.5046698012152626]
["COLOR_GREEN-DOT_3",1394,387,152,152,643,459,171,171,"COLOR_BLUE-DOT_2",280,2.5583711920975452]
["COLOR_BLUE-DOT_1",938,615,152,152,298,632,171,171,"COLOR_BLUE-DOT_3",416,1.5189814035793989]
["COLOR_BLUE-DOT_2",1166,615,152,152,470,632,171,171,"COLOR_BROWN-DOT_2",511,1.7578598002570462]
["COLOR_BROWN-DOT_3",1394,615,152,152,643,287,171,171,"COLOR_BROWN-DOT_3",496,1.6464420651522935]
[]
["time","event","element","x","y","game"]
[0,"START","ALL",0,0,"COLOR_DOT"]
[44663,"pointerdown","COLOR_BROWN-DOT_1",926,374,"COLOR_DOT"]
[44719,"pointermove","COLOR_BROWN-DOT_1",925.60003662109295,373.80001831054602,"COLOR_DOT"]
[44727,"pointermove","COLOR_BROWN-DOT_1",921.60003662109295,374.600006103515,"COLOR_DOT"]
[44735,"pointermove","COLOR_BROWN-DOT_1",913.60003662109295,374.600006103515,"COLOR_DOT"]
[44743,"pointermove","COLOR_BROWN-DOT_1",898.40002441406205,374.600006103515,"COLOR_DOT"]
[44751,"pointermove","COLOR_BROWN-DOT_1",882.40002441406205,373.80001831054602,"COLOR_DOT"]
[44759,"pointermove","COLOR_BROWN-DOT_1",864,370.600006103515,"COLOR_DOT"]
[44767,"pointermove","COLOR_BROWN-DOT_1",841.60003662109295,369.80001831054602,"COLOR_DOT"]
[44775,"pointermove","COLOR_BROWN-DOT_1",816.79998779296795,368.20001220703102,"COLOR_DOT"]
[44783,"pointermove","COLOR_BROWN-DOT_1",797.60003662109295,368.20001220703102,"COLOR_DOT"]
[44791,"pointermove","COLOR_BROWN-DOT_1",780.79998779296795,368.20001220703102,"COLOR_DOT"]
[44799,"pointermove","COLOR_BROWN-DOT_1",766.40002441406205,368.20001220703102,"COLOR_DOT"]
[44807,"pointermove","COLOR_BROWN-DOT_1",752.79998779296795,368.20001220703102,"COLOR_DOT"]
[44815,"pointermove","COLOR_BROWN-DOT_1",740.79998779296795,368.20001220703102,"COLOR_DOT"]
[44823,"pointermove","COLOR_BROWN-DOT_1",732,368.20001220703102,"COLOR_DOT"]
[44831,"pointermove","COLOR_BROWN-DOT_1",724.79998779296795,368.20001220703102,"COLOR_DOT"]
[44839,"pointermove","COLOR_BROWN-DOT_1",720,368.20001220703102,"COLOR_DOT"]
{"$rows_left_out":470}
{"sheet":"f5_a2_m","index":9,"n_rows":803,"n_cols":12,"rows_kept":803,"cut":false,"hidden":false,"merged":[]}
["element","sourceX","sourceY","sourceW","sourceH","targetX","targetY","targetW","targetH","Válaszkártyák (f1.xlsx)","Időigény","Sebesség3"]
["SVK-€01",938,167,152,152,470,468,171,171,"IRL-€02",2272,0.80883916274109835]
["IRL-€01",1166,167,152,152,470,296,171,171,"IRL-€20",1269,0.6104521946218826]
["SVK-€02",1394,167,152,152,298,468,171,171,"IRL-€01",857,0.77022678353692808]
["IRL-€02",938,395,152,152,298,296,171,171,"SVK-€02",3604,0.31153940205811076]
["SMR-€20",1166,395,152,152,643,640,171,171,"SVK-€20",1288,0.57186618744739603]
["SVK-€20",1394,395,152,152,643,468,171,171,"SMR-€01",3178,0.91239418948627282]
["SMR-€02",938,624,152,152,298,640,171,171,"SVK-€01",704,0.78237202349432911]
["SMR-€01",1166,624,152,152,470,640,171,171,"SMR-€02",545,1.1137098815450615]
["IRL-€20",1394,624,152,152,643,296,171,171,"SMR-€20",1094,1.758074612296697]
[]
["time","event","element","x","y","game"]
[0,"START","ALL",0,0,"EUR_COIN"]
[9775,"pointerdown","IRL-€02",928.79998779296795,404.20001220703102,"EUR_COIN"]
[9915,"pointermove","IRL-€02",925.60003662109295,405,"EUR_COIN"]
[9927,"pointermove","IRL-€02",912.79998779296795,412.20001220703102,"EUR_COIN"]
[9943,"pointermove","IRL-€02",888,430.600006103515,"EUR_COIN"]
[9960,"pointermove","IRL-€02",858.40002441406205,450.60006713867102,"EUR_COIN"]
[9978,"pointermove","IRL-€02",821.60003662109295,476.20001220703102,"EUR_COIN"]
[9988,"pointermove","IRL-€02",800,490.60006713867102,"EUR_COIN"]
[10007,"pointermove","IRL-€02",769.60003662109295,509,"EUR_COIN"]
[10028,"pointermove","IRL-€02",741.60003662109295,518.60003662109295,"EUR_COIN"]
[10042,"pointermove","IRL-€02",718.40002441406205,525,"EUR_COIN"]
[10058,"pointermove","IRL-€02",698.40002441406205,529.79998779296795,"EUR_COIN"]
[10077,"pointermove","IRL-€02",678.40002441406205,536.20001220703102,"EUR_COIN"]
[10087,"pointermove","IRL-€02",671.20001220703102,537.79998779296795,"EUR_COIN"]
[10107,"pointermove","IRL-€02",657.60003662109295,541,"EUR_COIN"]
[10122,"pointermove","IRL-€02",646.40002441406205,541.79998779296795,"EUR_COIN"]
[10142,"pointermove","IRL-€02",634.40002441406205,544.20001220703102,"EUR_COIN"]
[10162,"pointermove","IRL-€02",621.60003662109295,545,"EUR_COIN"]
{"$rows_left_out":774}
{"sheet":"f5_a3_m","index":10,"n_rows":410,"n_cols":12,"rows_kept":410,"cut":false,"hidden":false,"merged":[]}
["element","sourceX","sourceY","sourceW","sourceH","targetX","targetY","targetW","targetH","Válaszkártyák","Időigény","Sebesség3"]
["COLOR_GREEN-DOT_2",937,167,152,152,470,468,171,171,"COLOR_GREEN-DOT_2",941,0.61667499158480799]
["COLOR_BROWN-DOT_2",1165,167,152,152,470,296,171,171,"COLOR_BROWN-DOT_1",1229,0.54409060960681599]
["COLOR_GREEN-DOT_1",1393,167,152,152,298,468,171,171,"COLOR_BLUE-DOT_1",941,0.69824192413464803]
["COLOR_BROWN-DOT_1",937,395,152,152,298,296,171,171,"COLOR_BROWN-DOT_2",857,0.84998417187771691]
["COLOR_BLUE-DOT_3",1165,395,152,152,642,640,171,171,"COLOR_GREEN-DOT_1",1186,0.96503375355480914]
["COLOR_GREEN-DOT_3",1393,395,152,152,642,468,171,171,"COLOR_BLUE-DOT_3",1514,0.46972777200665117]
["COLOR_BLUE-DOT_1",937,623,152,152,298,640,171,171,"COLOR_BLUE-DOT_2",555,1.2559837562470628]
["COLOR_BLUE-DOT_2",1165,623,152,152,470,640,171,171,"COLOR_GREEN-DOT_3",1050,0.71108778364892511]
["COLOR_BROWN-DOT_3",1393,623,152,152,642,296,171,171,"COLOR_BROWN-DOT_3",936,0.9123990972362972]
[]
["time","event","element","x","y","game"]
[0,"START","ALL",0,0,"COLOR_DOT"]
[1243,"pointerdown","COLOR_GREEN-DOT_2",926.40002441406205,145,"COLOR_DOT"]
[1278,"pointermove","COLOR_GREEN-DOT_2",923.20001220703102,150.600006103515,"COLOR_DOT"]
[1287,"pointermove","COLOR_GREEN-DOT_2",920,153.80000305175699,"COLOR_DOT"]
[1307,"pointermove","COLOR_GREEN-DOT_2",910.40002441406205,164.19999694824199,"COLOR_DOT"]
[1324,"pointermove","COLOR_GREEN-DOT_2",898.40002441406205,173,"COLOR_DOT"]
[1343,"pointermove","COLOR_GREEN-DOT_2",884,184.19999694824199,"COLOR_DOT"]
[1359,"pointermove","COLOR_GREEN-DOT_2",866.40002441406205,196.20001220703099,"COLOR_DOT"]
[1378,"pointermove","COLOR_GREEN-DOT_2",844,214.600006103515,"COLOR_DOT"]
[1388,"pointermove","COLOR_GREEN-DOT_2",827.20001220703102,226.600006103515,"COLOR_DOT"]
[1408,"pointermove","COLOR_GREEN-DOT_2",794.40002441406205,254.600006103515,"COLOR_DOT"]
[1424,"pointermove","COLOR_GREEN-DOT_2",761.60003662109295,282.600006103515,"COLOR_DOT"]
[1443,"pointermove","COLOR_GREEN-DOT_2",731.20001220703102,309,"COLOR_DOT"]
[1459,"pointermove","COLOR_GREEN-DOT_2",712,325,"COLOR_DOT"]
[1477,"pointermove","COLOR_GREEN-DOT_2",700,330.600006103515,"COLOR_DOT"]
[1488,"pointermove","COLOR_GREEN-DOT_2",697.60003662109295,330.600006103515,"COLOR_DOT"]
[1635,"pointermove","COLOR_GREEN-DOT_2",696.79998779296795,333.80001831054602,"COLOR_DOT"]
[1644,"pointermove","COLOR_GREEN-DOT_2",692.79998779296795,339.39999389648398,"COLOR_DOT"]
{"$rows_left_out":380}